Hospital Service Area,Hospital County,Operating Certificate Number,Permanent Facility Id,Facility Name,Age Group,Zip Code - 3 digits,Gender,Race,Ethnicity,Length of Stay,Type of Admission,Patient Disposition,Discharge Year,CCS Diagnosis Code,CCS Diagnosis Description,CCS Procedure Code,CCS Procedure Description,APR DRG Code,APR DRG Description,APR MDC Code,APR MDC Description,APR Severity of Illness Code,APR Severity of Illness Description,APR Risk of Mortality,APR Medical Surgical Description,Payment Typology 1,Payment Typology 2,Payment Typology 3,Birth Weight,Abortion Edit Indicator,Emergency Department Indicator,Total Charges,Total Costs
New York City,Manhattan,7002001,001438,Bellevue Hospital Center,50 to 69,112,M,Black/African American,Not Span/Hispanic,2,Emergency,Home w/ Home Health Services,2019,RSP008,CHRONIC OBSTRUCTIVE PULMONARY DISEASE AND BRONCHIECTASIS,ADM016,ADMINISTRATION OF ANTI-INFLAMMATORY AGENTS,140,CHRONIC OBSTRUCTIVE PULMONARY DISEASE,04,DISEASES AND DISORDERS OF THE RESPIRATORY SYSTEM,3,Major,Major,Medical,Medicare,Medicare,Medicaid,,,true,13509.7,8978.55
New York City,Manhattan,7002001,001438,Bellevue Hospital Center,50 to 69,112,M,Other Race,Spanish/Hispanic,3,Emergency,Home or Self Care,2019,RSP008,CHRONIC OBSTRUCTIVE PULMONARY DISEASE AND BRONCHIECTASIS,ADM021,"ADMINISTRATION OF THERAPEUTIC SUBSTANCES, NEC",140,CHRONIC OBSTRUCTIVE PULMONARY DISEASE,04,DISEASES AND DISORDERS OF THE RESPIRATORY SYSTEM,2,Moderate,Moderate,Medical,Medicare,Medicare,,,,true,25488.92,16939.94
New York City,Manhattan,7002001,001438,Bellevue Hospital Center,50 to 69,100,M,White,Not Span/Hispanic,17,Emergency,Home or Self Care,2019,RSP008,CHRONIC OBSTRUCTIVE PULMONARY DISEASE AND BRONCHIECTASIS,ADM021,"ADMINISTRATION OF THERAPEUTIC SUBSTANCES, NEC",140,CHRONIC OBSTRUCTIVE PULMONARY DISEASE,04,DISEASES AND DISORDERS OF THE RESPIRATORY SYSTEM,4,Extreme,Extreme,Medical,Medicaid,Medicaid,,,,true,90661.64,60253.73
New York City,Manhattan,7002001,001438,Bellevue Hospital Center,50 to 69,100,M,White,Not Span/Hispanic,2,Emergency,Home or Self Care,2019,RSP008,CHRONIC OBSTRUCTIVE PULMONARY DISEASE AND BRONCHIECTASIS,ADM016,ADMINISTRATION OF ANTI-INFLAMMATORY AGENTS,140,CHRONIC OBSTRUCTIVE PULMONARY DISEASE,04,DISEASES AND DISORDERS OF THE RESPIRATORY SYSTEM,4,Extreme,Extreme,Medical,Medicare,Medicare,Medicaid,,,false,14035.96,9328.3
New York City,Manhattan,7002001,001438,Bellevue Hospital Center,50 to 69,112,M,Black/African American,Not Span/Hispanic,5,Emergency,Home or Self Care,2019,RSP008,CHRONIC OBSTRUCTIVE PULMONARY DISEASE AND BRONCHIECTASIS,ADM015,ADMINISTRATION OF ANTIBIOTICS,140,CHRONIC OBSTRUCTIVE PULMONARY DISEASE,04,DISEASES AND DISORDERS OF THE RESPIRATORY SYSTEM,3,Major,Moderate,Medical,Medicaid,Medicaid,,,,true,30937.94,20561.35
New York City,Manhattan,7002001,001438,Bellevue Hospital Center,50 to 69,100,M,White,Spanish/Hispanic,5,Emergency,Home or Self Care,2019,RSP008,CHRONIC OBSTRUCTIVE PULMONARY DISEASE AND BRONCHIECTASIS,ADM021,"ADMINISTRATION OF THERAPEUTIC SUBSTANCES, NEC",140,CHRONIC OBSTRUCTIVE PULMONARY DISEASE,04,DISEASES AND DISORDERS OF THE RESPIRATORY SYSTEM,3,Major,Moderate,Medical,Medicaid,Medicaid,,,,true,28929.76,19226.72
New York City,Manhattan,7002001,001438,Bellevue Hospital Center,70 or Older,112,M,Other Race,Spanish/Hispanic,3,Emergency,Home or Self Care,2019,RSP008,CHRONIC OBSTRUCTIVE PULMONARY DISEASE AND BRONCHIECTASIS,IMG006,COMPUTERIZED TOMOGRAPHY (CT) WITH CONTRAST,140,CHRONIC OBSTRUCTIVE PULMONARY DISEASE,04,DISEASES AND DISORDERS OF THE RESPIRATORY SYSTEM,3,Major,Major,Medical,Self-Pay,,,,,true,19473.15,12941.86
New York City,Manhattan,7002001,001438,Bellevue Hospital Center,30 to 49,100,M,Other Race,Not Span/Hispanic,1,Emergency,Left Against Medical Advice,2019,RSP008,CHRONIC OBSTRUCTIVE PULMONARY DISEASE AND BRONCHIECTASIS,ADM015,ADMINISTRATION OF ANTIBIOTICS,140,CHRONIC OBSTRUCTIVE PULMONARY DISEASE,04,DISEASES AND DISORDERS OF THE RESPIRATORY SYSTEM,1,Minor,Minor,Medical,Blue Cross/Blue Shield,Medicaid,,,,true,6762.7,4494.49
New York City,Manhattan,7002001,001438,Bellevue Hospital Center,50 to 69,100,F,Black/African American,Not Span/Hispanic,15,Emergency,Home or Self Care,2019,RSP008,CHRONIC OBSTRUCTIVE PULMONARY DISEASE AND BRONCHIECTASIS,ADM021,"ADMINISTRATION OF THERAPEUTIC SUBSTANCES, NEC",140,CHRONIC OBSTRUCTIVE PULMONARY DISEASE,04,DISEASES AND DISORDERS OF THE RESPIRATORY SYSTEM,3,Major,Major,Medical,Medicare,Medicare,Medicaid,,,true,83530.95,55514.67
New York City,Manhattan,7002001,001438,Bellevue Hospital Center,50 to 69,100,M,White,Not Span/Hispanic,3,Emergency,Left Against Medical Advice,2019,RSP008,CHRONIC OBSTRUCTIVE PULMONARY DISEASE AND BRONCHIECTASIS,ESA004,NON-INVASIVE VENTILATION,140,CHRONIC OBSTRUCTIVE PULMONARY DISEASE,04,DISEASES AND DISORDERS OF THE RESPIRATORY SYSTEM,4,Extreme,Extreme,Medical,Medicare,Medicaid,,,,true,19399.1,12892.64
New York City,Manhattan,7002001,001438,Bellevue Hospital Center,70 or Older,112,M,Black/African American,Not Span/Hispanic,3,Emergency,Skilled Nursing Home,2019,RSP008,CHRONIC OBSTRUCTIVE PULMONARY DISEASE AND BRONCHIECTASIS,ADM016,ADMINISTRATION OF ANTI-INFLAMMATORY AGENTS,140,CHRONIC OBSTRUCTIVE PULMONARY DISEASE,04,DISEASES AND DISORDERS OF THE RESPIRATORY SYSTEM,3,Major,Major,Medical,Self-Pay,,,,,true,18892.94,12556.25
New York City,Manhattan,7002001,001438,Bellevue Hospital Center,70 or Older,112,M,Other Race,Spanish/Hispanic,3,Emergency,Home or Self Care,2019,RSP008,CHRONIC OBSTRUCTIVE PULMONARY DISEASE AND BRONCHIECTASIS,MAM006,PACEMAKER AND DEFIBRILLATOR INTERROGATION,140,CHRONIC OBSTRUCTIVE PULMONARY DISEASE,04,DISEASES AND DISORDERS OF THE RESPIRATORY SYSTEM,3,Major,Major,Medical,Medicare,Medicare,Medicaid,,,true,20636.13,13714.77
New York City,Manhattan,7002001,001438,Bellevue Hospital Center,70 or Older,100,M,White,Not Span/Hispanic,2,Emergency,Home or Self Care,2019,RSP008,CHRONIC OBSTRUCTIVE PULMONARY DISEASE AND BRONCHIECTASIS,SUD001,SUBSTANCE USE DETOXIFICATION,140,CHRONIC OBSTRUCTIVE PULMONARY DISEASE,04,DISEASES AND DISORDERS OF THE RESPIRATORY SYSTEM,2,Moderate,Moderate,Medical,Medicare,Medicaid,,,,true,16419.75,10912.57
New York City,Manhattan,7002001,001438,Bellevue Hospital Center,70 or Older,100,M,Black/African American,Not Span/Hispanic,4,Elective,Home or Self Care,2019,RSP008,CHRONIC OBSTRUCTIVE PULMONARY DISEASE AND BRONCHIECTASIS,ADM015,ADMINISTRATION OF ANTIBIOTICS,140,CHRONIC OBSTRUCTIVE PULMONARY DISEASE,04,DISEASES AND DISORDERS OF THE RESPIRATORY SYSTEM,3,Major,Major,Medical,Medicare,Medicare,Medicaid,,,true,25297.73,16812.87
New York City,Manhattan,7002001,001438,Bellevue Hospital Center,50 to 69,112,F,Black/African American,Not Span/Hispanic,19,Emergency,Home or Self Care,2019,RSP008,CHRONIC OBSTRUCTIVE PULMONARY DISEASE AND BRONCHIECTASIS,ESA004,NON-INVASIVE VENTILATION,140,CHRONIC OBSTRUCTIVE PULMONARY DISEASE,04,DISEASES AND DISORDERS OF THE RESPIRATORY SYSTEM,3,Major,Major,Medical,Medicaid,Medicaid,,,,true,95790.72,63662.51
New York City,Manhattan,7002001,001438,Bellevue Hospital Center,50 to 69,100,F,Other Race,Spanish/Hispanic,7,Emergency,Left Against Medical Advice,2019,RSP008,CHRONIC OBSTRUCTIVE PULMONARY DISEASE AND BRONCHIECTASIS,ADM021,"ADMINISTRATION OF THERAPEUTIC SUBSTANCES, NEC",140,CHRONIC OBSTRUCTIVE PULMONARY DISEASE,04,DISEASES AND DISORDERS OF THE RESPIRATORY SYSTEM,3,Major,Minor,Medical,Medicare,Medicaid,,,,true,39490.45,26245.35
New York City,Manhattan,7002001,001438,Bellevue Hospital Center,50 to 69,114,M,Other Race,Spanish/Hispanic,8,Emergency,Home or Self Care,2019,RSP008,CHRONIC OBSTRUCTIVE PULMONARY DISEASE AND BRONCHIECTASIS,IMG008,ULTRASONOGRAPHY,140,CHRONIC OBSTRUCTIVE PULMONARY DISEASE,04,DISEASES AND DISORDERS OF THE RESPIRATORY SYSTEM,3,Major,Major,Medical,Medicaid,,,,,true,46919.34,31182.59
New York City,Manhattan,7002001,001438,Bellevue Hospital Center,50 to 69,116,M,White,Not Span/Hispanic,3,Emergency,Home or Self Care,2019,RSP008,CHRONIC OBSTRUCTIVE PULMONARY DISEASE AND BRONCHIECTASIS,SUD001,SUBSTANCE USE DETOXIFICATION,140,CHRONIC OBSTRUCTIVE PULMONARY DISEASE,04,DISEASES AND DISORDERS OF THE RESPIRATORY SYSTEM,3,Major,Moderate,Medical,Medicare,Medicare,,,,true,22451.83,14921.49
New York City,Manhattan,7002001,001438,Bellevue Hospital Center,50 to 69,103,M,White,Not Span/Hispanic,3,Emergency,Home or Self Care,2019,RSP008,CHRONIC OBSTRUCTIVE PULMONARY DISEASE AND BRONCHIECTASIS,ADM016,ADMINISTRATION OF ANTI-INFLAMMATORY AGENTS,140,CHRONIC OBSTRUCTIVE PULMONARY DISEASE,04,DISEASES AND DISORDERS OF THE RESPIRATORY SYSTEM,2,Moderate,Moderate,Medical,Private Health Insurance,Medicaid,,,,true,18527.3,12313.24
New York City,Manhattan,7002001,001438,Bellevue Hospital Center,50 to 69,100,M,White,Not Span/Hispanic,1,Emergency,Left Against Medical Advice,2019,RSP008,CHRONIC OBSTRUCTIVE PULMONARY DISEASE AND BRONCHIECTASIS,ADM021,"ADMINISTRATION OF THERAPEUTIC SUBSTANCES, NEC",140,CHRONIC OBSTRUCTIVE PULMONARY DISEASE,04,DISEASES AND DISORDERS OF THE RESPIRATORY SYSTEM,3,Major,Major,Medical,Medicare,Medicare,Medicaid,,,true,7238.05,4810.41
New York City,Manhattan,7002001,001438,Bellevue Hospital Center,50 to 69,100,M,Other Race,Spanish/Hispanic,2,Emergency,Psychiatric Hospital or Unit of Hosp,2019,RSP008,CHRONIC OBSTRUCTIVE PULMONARY DISEASE AND BRONCHIECTASIS,ADM016,ADMINISTRATION OF ANTI-INFLAMMATORY AGENTS,140,CHRONIC OBSTRUCTIVE PULMONARY DISEASE,04,DISEASES AND DISORDERS OF THE RESPIRATORY SYSTEM,3,Major,Minor,Medical,Medicaid,,,,,true,14560.38,9676.83
New York City,Manhattan,7002001,001438,Bellevue Hospital Center,50 to 69,100,M,White,Not Span/Hispanic,1,Emergency,Left Against Medical Advice,2019,RSP008,CHRONIC OBSTRUCTIVE PULMONARY DISEASE AND BRONCHIECTASIS,ADM016,ADMINISTRATION OF ANTI-INFLAMMATORY AGENTS,140,CHRONIC OBSTRUCTIVE PULMONARY DISEASE,04,DISEASES AND DISORDERS OF THE RESPIRATORY SYSTEM,3,Major,Major,Medical,Medicare,Medicare,Medicaid,,,true,8128.18,5401.99
New York City,Manhattan,7002001,001438,Bellevue Hospital Center,70 or Older,111,M,Other Race,Not Span/Hispanic,15,Emergency,Home or Self Care,2019,RSP008,CHRONIC OBSTRUCTIVE PULMONARY DISEASE AND BRONCHIECTASIS,ADM007,INTRAVENOUS INDUCTION OF LABOR,140,CHRONIC OBSTRUCTIVE PULMONARY DISEASE,04,DISEASES AND DISORDERS OF THE RESPIRATORY SYSTEM,4,Extreme,Extreme,Medical,Self-Pay,,,,,true,85648.97,56922.31
New York City,Manhattan,7002001,001438,Bellevue Hospital Center,50 to 69,100,M,White,Spanish/Hispanic,6,Emergency,Home or Self Care,2019,RSP008,CHRONIC OBSTRUCTIVE PULMONARY DISEASE AND BRONCHIECTASIS,ADM021,"ADMINISTRATION OF THERAPEUTIC SUBSTANCES, NEC",140,CHRONIC OBSTRUCTIVE PULMONARY DISEASE,04,DISEASES AND DISORDERS OF THE RESPIRATORY SYSTEM,2,Moderate,Minor,Medical,Medicaid,Medicaid,,,,true,32658.02,21704.52
New York City,Manhattan,7002001,001438,Bellevue Hospital Center,70 or Older,104,F,Other Race,Spanish/Hispanic,7,Emergency,Home or Self Care,2019,RSP008,CHRONIC OBSTRUCTIVE PULMONARY DISEASE AND BRONCHIECTASIS,ADM021,"ADMINISTRATION OF THERAPEUTIC SUBSTANCES, NEC",140,CHRONIC OBSTRUCTIVE PULMONARY DISEASE,04,DISEASES AND DISORDERS OF THE RESPIRATORY SYSTEM,4,Extreme,Extreme,Medical,Medicare,Medicaid,,,,true,43885.58,29166.36
New York City,Manhattan,7002001,001438,Bellevue Hospital Center,50 to 69,100,M,White,Not Span/Hispanic,1,Emergency,Left Against Medical Advice,2019,RSP008,CHRONIC OBSTRUCTIVE PULMONARY DISEASE AND BRONCHIECTASIS,ADM021,"ADMINISTRATION OF THERAPEUTIC SUBSTANCES, NEC",140,CHRONIC OBSTRUCTIVE PULMONARY DISEASE,04,DISEASES AND DISORDERS OF THE RESPIRATORY SYSTEM,3,Major,Moderate,Medical,Medicare,Medicaid,,,,true,7009.65,4658.61
New York City,Manhattan,7002001,001438,Bellevue Hospital Center,50 to 69,112,M,Black/African American,Not Span/Hispanic,1,Emergency,Left Against Medical Advice,2019,RSP008,CHRONIC OBSTRUCTIVE PULMONARY DISEASE AND BRONCHIECTASIS,ADM021,"ADMINISTRATION OF THERAPEUTIC SUBSTANCES, NEC",140,CHRONIC OBSTRUCTIVE PULMONARY DISEASE,04,DISEASES AND DISORDERS OF THE RESPIRATORY SYSTEM,3,Major,Major,Medical,Medicaid,Medicaid,,,,true,10285.8,6835.94
New York City,Manhattan,7002001,001438,Bellevue Hospital Center,70 or Older,100,F,White,Not Span/Hispanic,1,Emergency,Left Against Medical Advice,2019,RSP008,CHRONIC OBSTRUCTIVE PULMONARY DISEASE AND BRONCHIECTASIS,ADM001,TRANSFUSION OF BLOOD AND BLOOD PRODUCTS,140,CHRONIC OBSTRUCTIVE PULMONARY DISEASE,04,DISEASES AND DISORDERS OF THE RESPIRATORY SYSTEM,3,Major,Major,Medical,Medicare,Medicare,Medicaid,,,true,7565.63,5028.12
New York City,Manhattan,7002001,001438,Bellevue Hospital Center,50 to 69,112,F,Black/African American,Not Span/Hispanic,4,Emergency,Home or Self Care,2019,RSP008,CHRONIC OBSTRUCTIVE PULMONARY DISEASE AND BRONCHIECTASIS,ADM016,ADMINISTRATION OF ANTI-INFLAMMATORY AGENTS,140,CHRONIC OBSTRUCTIVE PULMONARY DISEASE,04,DISEASES AND DISORDERS OF THE RESPIRATORY SYSTEM,2,Moderate,Minor,Medical,Self-Pay,,,,,true,25037.81,16640.13
New York City,Manhattan,7002001,001438,Bellevue Hospital Center,50 to 69,100,M,Other Race,Spanish/Hispanic,6,Emergency,Home or Self Care,2019,RSP008,CHRONIC OBSTRUCTIVE PULMONARY DISEASE AND BRONCHIECTASIS,ADM016,ADMINISTRATION OF ANTI-INFLAMMATORY AGENTS,140,CHRONIC OBSTRUCTIVE PULMONARY DISEASE,04,DISEASES AND DISORDERS OF THE RESPIRATORY SYSTEM,4,Extreme,Major,Medical,Medicaid,Medicaid,,,,true,37491.91,24917.12
New York City,Manhattan,7002001,001438,Bellevue Hospital Center,50 to 69,100,M,Black/African American,Not Span/Hispanic,4,Emergency,Home or Self Care,2019,RSP008,CHRONIC OBSTRUCTIVE PULMONARY DISEASE AND BRONCHIECTASIS,IMG007,COMPUTERIZED TOMOGRAPHY (CT) WITHOUT CONTRAST,140,CHRONIC OBSTRUCTIVE PULMONARY DISEASE,04,DISEASES AND DISORDERS OF THE RESPIRATORY SYSTEM,3,Major,Minor,Medical,Medicaid,,,,,true,30349.76,20170.45
New York City,Manhattan,7002001,001438,Bellevue Hospital Center,50 to 69,100,F,White,Not Span/Hispanic,6,Emergency,Home or Self Care,2019,RSP008,CHRONIC OBSTRUCTIVE PULMONARY DISEASE AND BRONCHIECTASIS,ADM016,ADMINISTRATION OF ANTI-INFLAMMATORY AGENTS,140,CHRONIC OBSTRUCTIVE PULMONARY DISEASE,04,DISEASES AND DISORDERS OF THE RESPIRATORY SYSTEM,1,Minor,Minor,Medical,Medicaid,Medicaid,,,,true,33098.97,21997.58
New York City,Manhattan,7002001,001438,Bellevue Hospital Center,70 or Older,100,M,Black/African American,Not Span/Hispanic,13,Emergency,Home w/ Home Health Services,2019,RSP008,CHRONIC OBSTRUCTIVE PULMONARY DISEASE AND BRONCHIECTASIS,ADM021,"ADMINISTRATION OF THERAPEUTIC SUBSTANCES, NEC",140,CHRONIC OBSTRUCTIVE PULMONARY DISEASE,04,DISEASES AND DISORDERS OF THE RESPIRATORY SYSTEM,2,Moderate,Moderate,Medical,Medicare,Medicare,Medicaid,,,true,70407.6,46792.89
New York City,Manhattan,7002001,001438,Bellevue Hospital Center,70 or Older,100,M,Black/African American,Not Span/Hispanic,12,Emergency,Home or Self Care,2019,RSP008,CHRONIC OBSTRUCTIVE PULMONARY DISEASE AND BRONCHIECTASIS,ESA004,NON-INVASIVE VENTILATION,140,CHRONIC OBSTRUCTIVE PULMONARY DISEASE,04,DISEASES AND DISORDERS OF THE RESPIRATORY SYSTEM,4,Extreme,Extreme,Medical,Medicare,Medicare,Medicaid,,,true,79238.23,52661.73
New York City,Manhattan,7002001,001438,Bellevue Hospital Center,30 to 49,100,M,Other Race,Not Span/Hispanic,3,Emergency,Home or Self Care,2019,RSP008,CHRONIC OBSTRUCTIVE PULMONARY DISEASE AND BRONCHIECTASIS,ADM021,"ADMINISTRATION OF THERAPEUTIC SUBSTANCES, NEC",140,CHRONIC OBSTRUCTIVE PULMONARY DISEASE,04,DISEASES AND DISORDERS OF THE RESPIRATORY SYSTEM,3,Major,Major,Medical,Medicaid,,,,,true,20556.69,13661.98
New York City,Manhattan,7002001,001438,Bellevue Hospital Center,50 to 69,OOS,F,Other Race,Not Span/Hispanic,2,Emergency,Home or Self Care,2019,RSP008,CHRONIC OBSTRUCTIVE PULMONARY DISEASE AND BRONCHIECTASIS,ADM021,"ADMINISTRATION OF THERAPEUTIC SUBSTANCES, NEC",140,CHRONIC OBSTRUCTIVE PULMONARY DISEASE,04,DISEASES AND DISORDERS OF THE RESPIRATORY SYSTEM,2,Moderate,Minor,Medical,Private Health Insurance,,,,,true,13828.29,9190.28
New York City,Manhattan,7002001,001438,Bellevue Hospital Center,50 to 69,100,M,White,Not Span/Hispanic,2,Emergency,Home or Self Care,2019,RSP008,CHRONIC OBSTRUCTIVE PULMONARY DISEASE AND BRONCHIECTASIS,ESA004,NON-INVASIVE VENTILATION,140,CHRONIC OBSTRUCTIVE PULMONARY DISEASE,04,DISEASES AND DISORDERS OF THE RESPIRATORY SYSTEM,3,Major,Moderate,Medical,Medicaid,Medicaid,,,,true,14590.21,9696.65
New York City,Manhattan,7002001,001438,Bellevue Hospital Center,30 to 49,100,M,Other Race,Not Span/Hispanic,1,Emergency,Left Against Medical Advice,2019,RSP008,CHRONIC OBSTRUCTIVE PULMONARY DISEASE AND BRONCHIECTASIS,ADM021,"ADMINISTRATION OF THERAPEUTIC SUBSTANCES, NEC",140,CHRONIC OBSTRUCTIVE PULMONARY DISEASE,04,DISEASES AND DISORDERS OF THE RESPIRATORY SYSTEM,1,Minor,Minor,Medical,Medicaid,Medicaid,,,,true,7821.44,5198.13
New York City,Manhattan,7002001,001438,Bellevue Hospital Center,50 to 69,100,M,White,Not Span/Hispanic,1,Emergency,Left Against Medical Advice,2019,RSP008,CHRONIC OBSTRUCTIVE PULMONARY DISEASE AND BRONCHIECTASIS,ADM021,"ADMINISTRATION OF THERAPEUTIC SUBSTANCES, NEC",140,CHRONIC OBSTRUCTIVE PULMONARY DISEASE,04,DISEASES AND DISORDERS OF THE RESPIRATORY SYSTEM,4,Extreme,Major,Medical,Medicaid,Medicaid,,,,true,8222.75,5464.84
New York City,Manhattan,7002001,001438,Bellevue Hospital Center,30 to 49,100,M,Black/African American,Not Span/Hispanic,1,Emergency,Left Against Medical Advice,2019,RSP008,CHRONIC OBSTRUCTIVE PULMONARY DISEASE AND BRONCHIECTASIS,IMG009,PLAIN RADIOGRAPHY,140,CHRONIC OBSTRUCTIVE PULMONARY DISEASE,04,DISEASES AND DISORDERS OF THE RESPIRATORY SYSTEM,2,Moderate,Moderate,Medical,Self-Pay,,,,,true,11495.7,7640.04
New York City,Manhattan,7002001,001438,Bellevue Hospital Center,70 or Older,114,M,Other Race,Spanish/Hispanic,2,Emergency,Home or Self Care,2019,RSP008,CHRONIC OBSTRUCTIVE PULMONARY DISEASE AND BRONCHIECTASIS,IMG009,PLAIN RADIOGRAPHY,140,CHRONIC OBSTRUCTIVE PULMONARY DISEASE,04,DISEASES AND DISORDERS OF THE RESPIRATORY SYSTEM,2,Moderate,Moderate,Medical,Self-Pay,,,,,true,14224.5,9453.6
New York City,Manhattan,7002001,001438,Bellevue Hospital Center,50 to 69,100,M,Other Race,Spanish/Hispanic,3,Emergency,Home or Self Care,2019,RSP008,CHRONIC OBSTRUCTIVE PULMONARY DISEASE AND BRONCHIECTASIS,ADM015,ADMINISTRATION OF ANTIBIOTICS,140,CHRONIC OBSTRUCTIVE PULMONARY DISEASE,04,DISEASES AND DISORDERS OF THE RESPIRATORY SYSTEM,3,Major,Major,Medical,Medicare,,,,,true,20615.11,13700.8
New York City,Manhattan,7002001,001438,Bellevue Hospital Center,70 or Older,112,F,White,Not Span/Hispanic,1,Emergency,Home or Self Care,2019,RSP008,CHRONIC OBSTRUCTIVE PULMONARY DISEASE AND BRONCHIECTASIS,IMG009,PLAIN RADIOGRAPHY,140,CHRONIC OBSTRUCTIVE PULMONARY DISEASE,04,DISEASES AND DISORDERS OF THE RESPIRATORY SYSTEM,2,Moderate,Moderate,Medical,Medicare,Medicaid,,,,true,9548.62,6346.01
New York City,Manhattan,7002001,001438,Bellevue Hospital Center,70 or Older,100,M,Black/African American,Not Span/Hispanic,2,Emergency,Home or Self Care,2019,RSP008,CHRONIC OBSTRUCTIVE PULMONARY DISEASE AND BRONCHIECTASIS,IMG006,COMPUTERIZED TOMOGRAPHY (CT) WITH CONTRAST,140,CHRONIC OBSTRUCTIVE PULMONARY DISEASE,04,DISEASES AND DISORDERS OF THE RESPIRATORY SYSTEM,2,Moderate,Moderate,Medical,Medicare,,,,,true,19441.36,12920.73
New York City,Manhattan,7002001,001438,Bellevue Hospital Center,50 to 69,112,M,White,Not Span/Hispanic,1,Emergency,Left Against Medical Advice,2019,RSP008,CHRONIC OBSTRUCTIVE PULMONARY DISEASE AND BRONCHIECTASIS,ADM021,"ADMINISTRATION OF THERAPEUTIC SUBSTANCES, NEC",140,CHRONIC OBSTRUCTIVE PULMONARY DISEASE,04,DISEASES AND DISORDERS OF THE RESPIRATORY SYSTEM,2,Moderate,Moderate,Medical,Medicare,Medicaid,,,,true,7548.64,5016.83
New York City,Manhattan,7002001,001438,Bellevue Hospital Center,50 to 69,100,M,Black/African American,Not Span/Hispanic,1,Emergency,Home or Self Care,2019,RSP008,CHRONIC OBSTRUCTIVE PULMONARY DISEASE AND BRONCHIECTASIS,ADM021,"ADMINISTRATION OF THERAPEUTIC SUBSTANCES, NEC",140,CHRONIC OBSTRUCTIVE PULMONARY DISEASE,04,DISEASES AND DISORDERS OF THE RESPIRATORY SYSTEM,2,Moderate,Minor,Medical,Medicare,Medicaid,,,,true,8550.44,5682.62
New York City,Manhattan,7002001,001438,Bellevue Hospital Center,50 to 69,100,M,White,Not Span/Hispanic,3,Emergency,Home or Self Care,2019,RSP008,CHRONIC OBSTRUCTIVE PULMONARY DISEASE AND BRONCHIECTASIS,IMG007,COMPUTERIZED TOMOGRAPHY (CT) WITHOUT CONTRAST,140,CHRONIC OBSTRUCTIVE PULMONARY DISEASE,04,DISEASES AND DISORDERS OF THE RESPIRATORY SYSTEM,3,Major,Major,Medical,Self-Pay,,,,,true,26682.92,17733.47
New York City,Manhattan,7002001,001438,Bellevue Hospital Center,70 or Older,114,F,White,Not Span/Hispanic,8,Emergency,Home or Self Care,2019,RSP008,CHRONIC OBSTRUCTIVE PULMONARY DISEASE AND BRONCHIECTASIS,ADM021,"ADMINISTRATION OF THERAPEUTIC SUBSTANCES, NEC",140,CHRONIC OBSTRUCTIVE PULMONARY DISEASE,04,DISEASES AND DISORDERS OF THE RESPIRATORY SYSTEM,1,Minor,Moderate,Medical,Self-Pay,,,,,true,57895.88,38477.6
New York City,Manhattan,7002001,001438,Bellevue Hospital Center,50 to 69,112,M,Other Race,Spanish/Hispanic,2,Emergency,Home or Self Care,2019,RSP008,CHRONIC OBSTRUCTIVE PULMONARY DISEASE AND BRONCHIECTASIS,ADM021,"ADMINISTRATION OF THERAPEUTIC SUBSTANCES, NEC",140,CHRONIC OBSTRUCTIVE PULMONARY DISEASE,04,DISEASES AND DISORDERS OF THE RESPIRATORY SYSTEM,2,Moderate,Minor,Medical,Private Health Insurance,,,,,true,15353.26,10203.78
New York City,Manhattan,7002001,001438,Bellevue Hospital Center,70 or Older,100,M,Black/African American,Not Span/Hispanic,1,Emergency,Left Against Medical Advice,2019,RSP008,CHRONIC OBSTRUCTIVE PULMONARY DISEASE AND BRONCHIECTASIS,IMG007,COMPUTERIZED TOMOGRAPHY (CT) WITHOUT CONTRAST,140,CHRONIC OBSTRUCTIVE PULMONARY DISEASE,04,DISEASES AND DISORDERS OF THE RESPIRATORY SYSTEM,2,Moderate,Moderate,Medical,Medicare,Medicaid,,,,true,9018.69,5993.82
New York City,Manhattan,7002001,001438,Bellevue Hospital Center,50 to 69,100,F,Black/African American,Not Span/Hispanic,3,Emergency,Home or Self Care,2019,RSP008,CHRONIC OBSTRUCTIVE PULMONARY DISEASE AND BRONCHIECTASIS,IMG006,COMPUTERIZED TOMOGRAPHY (CT) WITH CONTRAST,140,CHRONIC OBSTRUCTIVE PULMONARY DISEASE,04,DISEASES AND DISORDERS OF THE RESPIRATORY SYSTEM,2,Moderate,Minor,Medical,Medicaid,,,,,true,25288.88,16806.99
New York City,Manhattan,7002001,001438,Bellevue Hospital Center,50 to 69,100,M,Black/African American,Not Span/Hispanic,14,Emergency,Home or Self Care,2019,RSP008,CHRONIC OBSTRUCTIVE PULMONARY DISEASE AND BRONCHIECTASIS,ADM021,"ADMINISTRATION OF THERAPEUTIC SUBSTANCES, NEC",140,CHRONIC OBSTRUCTIVE PULMONARY DISEASE,04,DISEASES AND DISORDERS OF THE RESPIRATORY SYSTEM,2,Moderate,Moderate,Medical,Medicaid,,,,,true,89346.24,59379.51
New York City,Manhattan,7002001,001438,Bellevue Hospital Center,70 or Older,111,M,Other Race,Not Span/Hispanic,5,Emergency,Home or Self Care,2019,RSP008,CHRONIC OBSTRUCTIVE PULMONARY DISEASE AND BRONCHIECTASIS,ADM016,ADMINISTRATION OF ANTI-INFLAMMATORY AGENTS,140,CHRONIC OBSTRUCTIVE PULMONARY DISEASE,04,DISEASES AND DISORDERS OF THE RESPIRATORY SYSTEM,3,Major,Moderate,Medical,Medicare,Medicaid,,,,true,39252.6,26087.28
New York City,Manhattan,7002001,001438,Bellevue Hospital Center,50 to 69,104,M,Other Race,Spanish/Hispanic,4,Emergency,Home or Self Care,2019,RSP008,CHRONIC OBSTRUCTIVE PULMONARY DISEASE AND BRONCHIECTASIS,IMG009,PLAIN RADIOGRAPHY,140,CHRONIC OBSTRUCTIVE PULMONARY DISEASE,04,DISEASES AND DISORDERS OF THE RESPIRATORY SYSTEM,2,Moderate,Minor,Medical,Medicaid,,,,,true,27843.34,18504.68
New York City,Manhattan,7002001,001438,Bellevue Hospital Center,50 to 69,100,F,Other Race,Spanish/Hispanic,10,Emergency,Home or Self Care,2019,RSP008,CHRONIC OBSTRUCTIVE PULMONARY DISEASE AND BRONCHIECTASIS,ESA004,NON-INVASIVE VENTILATION,140,CHRONIC OBSTRUCTIVE PULMONARY DISEASE,04,DISEASES AND DISORDERS OF THE RESPIRATORY SYSTEM,3,Major,Major,Medical,Medicaid,,,,,true,76703.85,50977.38