Hospital Service Area,Hospital County,Operating Certificate Number,Permanent Facility Id,Facility Name,Age Group,Zip Code - 3 digits,Gender,Race,Ethnicity,Length of Stay,Type of Admission,Patient Disposition,Discharge Year,CCS Diagnosis Code,CCS Diagnosis Description,CCS Procedure Code,CCS Procedure Description,APR DRG Code,APR DRG Description,APR MDC Code,APR MDC Description,APR Severity of Illness Code,APR Severity of Illness Description,APR Risk of Mortality,APR Medical Surgical Description,Payment Typology 1,Payment Typology 2,Payment Typology 3,Birth Weight,Abortion Edit Indicator,Emergency Department Indicator,Total Charges,Total Costs
New York City,Manhattan,7002024,001456,Mount Sinai Hospital,0 to 17,100,F,Other Race,Not Span/Hispanic,2,Urgent,Home or Self Care,2017,128,Asthma,000,NO PROC,141,Asthma,04,Diseases and Disorders of the Respiratory System,2,Moderate,Minor,Medical,Medicaid,Medicaid,Self-Pay,,N,N,15584.75,11895.63
New York City,Manhattan,7002024,001456,Mount Sinai Hospital,0 to 17,100,F,Other Race,Not Span/Hispanic,3,Urgent,Home or Self Care,2017,128,Asthma,000,NO PROC,141,Asthma,04,Diseases and Disorders of the Respiratory System,1,Minor,Minor,Medical,Medicaid,Medicaid,Self-Pay,,N,N,30654.82,15552.11
New York City,Bronx,7000006,001168,Montefiore Medical Center-Wakefield Hospital,50 to 69,104,F,Black/African American,Not Span/Hispanic,4,Emergency,Home or Self Care,2017,128,Asthma,216,RESP INTUB/MECH VENTIL,141,Asthma,04,Diseases and Disorders of the Respiratory System,4,Extreme,Major,Medical,Medicaid,,,,N,Y,80787.84,17243.74
New York City,Bronx,7000006,001168,Montefiore Medical Center-Wakefield Hospital,30 to 49,104,F,Black/African American,Not Span/Hispanic,13,Emergency,Home or Self Care,2017,128,Asthma,041,OT NON-OR THER PRC RESP,141,Asthma,04,Diseases and Disorders of the Respiratory System,3,Major,Major,Medical,Medicaid,,,,N,Y,144080.99,30064.62
New York City,Bronx,7000006,001168,Montefiore Medical Center-Wakefield Hospital,50 to 69,104,F,Black/African American,Not Span/Hispanic,6,Emergency,Home or Self Care,2017,128,Asthma,041,OT NON-OR THER PRC RESP,141,Asthma,04,Diseases and Disorders of the Respiratory System,2,Moderate,Minor,Medical,Private Health Insurance,,,,N,Y,64938.94,13652.49
New York City,Bronx,7000006,001168,Montefiore Medical Center-Wakefield Hospital,50 to 69,104,F,Black/African American,Not Span/Hispanic,6,Emergency,Home or Self Care,2017,128,Asthma,019,OT THER PRCS EYELIDS,141,Asthma,04,Diseases and Disorders of the Respiratory System,1,Minor,Minor,Medical,Medicare,,,,N,Y,70767.75,14930.22
New York City,Bronx,7000006,001168,Montefiore Medical Center-Wakefield Hospital,18 to 29,104,F,White,Spanish/Hispanic,4,Emergency,Home or Self Care,2017,128,Asthma,041,OT NON-OR THER PRC RESP,141,Asthma,04,Diseases and Disorders of the Respiratory System,2,Moderate,Minor,Medical,Medicaid,,,,N,Y,44304.71,10769.50
New York City,Bronx,7000006,001168,Montefiore Medical Center-Wakefield Hospital,30 to 49,104,F,Black/African American,Not Span/Hispanic,2,Emergency,Home w/ Home Health Services,2017,128,Asthma,041,OT NON-OR THER PRC RESP,141,Asthma,04,Diseases and Disorders of the Respiratory System,3,Major,Major,Medical,Medicaid,,,,N,Y,40280.77,8532.28
New York City,Bronx,7000006,001169,Montefiore Medical Center - Henry & Lucy Moses Div,50 to 69,104,M,Other Race,Not Span/Hispanic,6,Emergency,Home or Self Care,2017,128,Asthma,231,OTHER THERAPEUTIC PRCS,141,Asthma,04,Diseases and Disorders of the Respiratory System,3,Major,Moderate,Medical,Medicare,Medicaid,,,N,Y,77097.51,15682.94
New York City,Bronx,7000006,001169,Montefiore Medical Center - Henry & Lucy Moses Div,50 to 69,104,F,Black/African American,Spanish/Hispanic,7,Emergency,Home or Self Care,2017,128,Asthma,000,NO PROC,141,Asthma,04,Diseases and Disorders of the Respiratory System,2,Moderate,Minor,Medical,Medicare,,,,N,Y,60503.20,13497.55
New York City,Bronx,7000006,001169,Montefiore Medical Center - Henry & Lucy Moses Div,50 to 69,104,F,White,Not Span/Hispanic,5,Emergency,Home or Self Care,2017,128,Asthma,041,OT NON-OR THER PRC RESP,141,Asthma,04,Diseases and Disorders of the Respiratory System,2,Moderate,Minor,Medical,Medicare,Medicaid,,,N,Y,49033.04,10612.20
New York City,Bronx,7000006,001169,Montefiore Medical Center - Henry & Lucy Moses Div,50 to 69,104,F,Other Race,Spanish/Hispanic,3,Emergency,Home or Self Care,2017,128,Asthma,041,OT NON-OR THER PRC RESP,141,Asthma,04,Diseases and Disorders of the Respiratory System,2,Moderate,Minor,Medical,Medicaid,,,,N,Y,29723.01,5718.36
New York City,Bronx,7000006,001169,Montefiore Medical Center - Henry & Lucy Moses Div,18 to 29,104,M,Other Race,Not Span/Hispanic,8,Emergency,Home or Self Care,2017,128,Asthma,216,RESP INTUB/MECH VENTIL,141,Asthma,04,Diseases and Disorders of the Respiratory System,4,Extreme,Major,Medical,Private Health Insurance,,,,N,Y,97563.46,20700.00
New York City,Bronx,7000006,001169,Montefiore Medical Center - Henry & Lucy Moses Div,50 to 69,104,M,Other Race,Spanish/Hispanic,3,Emergency,Home or Self Care,2017,128,Asthma,041,OT NON-OR THER PRC RESP,141,Asthma,04,Diseases and Disorders of the Respiratory System,1,Minor,Minor,Medical,Private Health Insurance,,,,N,Y,30420.45,6171.92
New York City,Bronx,7000006,001169,Montefiore Medical Center - Henry & Lucy Moses Div,50 to 69,104,F,Black/African American,Not Span/Hispanic,1,Emergency,Home or Self Care,2017,128,Asthma,231,OTHER THERAPEUTIC PRCS,141,Asthma,04,Diseases and Disorders of the Respiratory System,2,Moderate,Minor,Medical,Medicare,Medicaid,,,N,Y,13577.54,2588.10
New York City,Bronx,7000006,001169,Montefiore Medical Center - Henry & Lucy Moses Div,50 to 69,104,F,Black/African American,Not Span/Hispanic,4,Emergency,Home or Self Care,2017,128,Asthma,041,OT NON-OR THER PRC RESP,141,Asthma,04,Diseases and Disorders of the Respiratory System,2,Moderate,Minor,Medical,Medicare,,,,N,Y,33380.40,7095.47
New York City,Bronx,7000006,001169,Montefiore Medical Center - Henry & Lucy Moses Div,30 to 49,104,F,Other Race,Spanish/Hispanic,1,Emergency,Home or Self Care,2017,128,Asthma,041,OT NON-OR THER PRC RESP,141,Asthma,04,Diseases and Disorders of the Respiratory System,1,Minor,Minor,Medical,Medicaid,,,,N,Y,13327.57,2604.58
New York City,Bronx,7000006,001169,Montefiore Medical Center - Henry & Lucy Moses Div,30 to 49,104,F,Other Race,Not Span/Hispanic,3,Emergency,Home or Self Care,2017,128,Asthma,041,OT NON-OR THER PRC RESP,141,Asthma,04,Diseases and Disorders of the Respiratory System,3,Major,Minor,Medical,Medicaid,,,,N,Y,33268.81,6936.50
New York City,Bronx,7000006,001169,Montefiore Medical Center - Henry & Lucy Moses Div,70 or Older,104,M,Other Race,Spanish/Hispanic,3,Emergency,Home w/ Home Health Services,2017,128,Asthma,000,NO PROC,141,Asthma,04,Diseases and Disorders of the Respiratory System,2,Moderate,Moderate,Medical,Medicare,Medicaid,,,N,Y,36792.36,6980.52
New York City,Bronx,7000006,001169,Montefiore Medical Center - Henry & Lucy Moses Div,30 to 49,104,F,Other Race,Spanish/Hispanic,3,Emergency,Home or Self Care,2017,128,Asthma,041,OT NON-OR THER PRC RESP,141,Asthma,04,Diseases and Disorders of the Respiratory System,2,Moderate,Minor,Medical,Medicaid,,,,N,Y,17156.39,3625.24
New York City,Bronx,7000006,001169,Montefiore Medical Center - Henry & Lucy Moses Div,50 to 69,104,F,Other Race,Not Span/Hispanic,2,Emergency,Home or Self Care,2017,128,Asthma,000,NO PROC,141,Asthma,04,Diseases and Disorders of the Respiratory System,2,Moderate,Moderate,Medical,Medicare,Medicaid,,,N,Y,16579.25,3077.91
New York City,Bronx,7000006,001169,Montefiore Medical Center - Henry & Lucy Moses Div,30 to 49,104,F,Other Race,Spanish/Hispanic,3,Emergency,Home or Self Care,2017,128,Asthma,222,BLOOD TRANSFUSION,141,Asthma,04,Diseases and Disorders of the Respiratory System,3,Major,Major,Medical,Medicaid,,,,N,Y,35567.38,7518.84
New York City,Bronx,7000006,001169,Montefiore Medical Center - Henry & Lucy Moses Div,18 to 29,100,F,Other Race,Not Span/Hispanic,2,Emergency,Home or Self Care,2017,128,Asthma,041,OT NON-OR THER PRC RESP,141,Asthma,04,Diseases and Disorders of the Respiratory System,1,Minor,Minor,Medical,Medicaid,,,,N,Y,18300.92,3650.28
New York City,Bronx,7000006,001169,Montefiore Medical Center - Henry & Lucy Moses Div,50 to 69,104,F,Black/African American,Not Span/Hispanic,4,Emergency,Home or Self Care,2017,128,Asthma,041,OT NON-OR THER PRC RESP,141,Asthma,04,Diseases and Disorders of the Respiratory System,2,Moderate,Minor,Medical,Medicaid,,,,N,Y,38264.66,7697.36
New York City,Bronx,7000006,001169,Montefiore Medical Center - Henry & Lucy Moses Div,70 or Older,104,F,White,Not Span/Hispanic,3,Emergency,Home w/ Home Health Services,2017,128,Asthma,041,OT NON-OR THER PRC RESP,141,Asthma,04,Diseases and Disorders of the Respiratory System,2,Moderate,Moderate,Medical,Medicare,,,,N,Y,38156.71,6920.40
New York City,Bronx,7000006,001169,Montefiore Medical Center - Henry & Lucy Moses Div,50 to 69,104,F,Other Race,Spanish/Hispanic,3,Emergency,Home or Self Care,2017,128,Asthma,000,NO PROC,141,Asthma,04,Diseases and Disorders of the Respiratory System,1,Minor,Minor,Medical,Medicaid,,,,N,Y,28931.54,6274.68
New York City,Bronx,7000006,001169,Montefiore Medical Center - Henry & Lucy Moses Div,30 to 49,104,F,Black/African American,Not Span/Hispanic,2,Emergency,Home or Self Care,2017,128,Asthma,000,NO PROC,141,Asthma,04,Diseases and Disorders of the Respiratory System,1,Minor,Minor,Medical,Medicaid,,,,N,Y,22186.99,4594.51
New York City,Bronx,7000006,001169,Montefiore Medical Center - Henry & Lucy Moses Div,30 to 49,104,M,Other Race,Spanish/Hispanic,1,Emergency,Home or Self Care,2017,128,Asthma,041,OT NON-OR THER PRC RESP,141,Asthma,04,Diseases and Disorders of the Respiratory System,1,Minor,Minor,Medical,Medicaid,,,,N,Y,7964.76,1281.04
New York City,Bronx,7000006,001169,Montefiore Medical Center - Henry & Lucy Moses Div,50 to 69,104,F,Black/African American,Not Span/Hispanic,2,Emergency,Home or Self Care,2017,128,Asthma,041,OT NON-OR THER PRC RESP,141,Asthma,04,Diseases and Disorders of the Respiratory System,2,Moderate,Minor,Medical,Medicaid,,,,N,Y,28857.46,6207.48
New York City,Bronx,7000006,001169,Montefiore Medical Center - Henry & Lucy Moses Div,0 to 17,104,M,Other Race,Not Span/Hispanic,8,Emergency,Home or Self Care,2017,128,Asthma,041,OT NON-OR THER PRC RESP,141,Asthma,04,Diseases and Disorders of the Respiratory System,1,Minor,Minor,Medical,Medicaid,,,,N,Y,113060.39,28827.52
New York City,Bronx,7000006,001169,Montefiore Medical Center - Henry & Lucy Moses Div,0 to 17,OOS,M,Other Race,Spanish/Hispanic,1,Emergency,Home or Self Care,2017,128,Asthma,041,OT NON-OR THER PRC RESP,141,Asthma,04,Diseases and Disorders of the Respiratory System,2,Moderate,Minor,Medical,Blue Cross/Blue Shield,,,,N,Y,16246.90,4034.41
New York City,Bronx,7000006,001169,Montefiore Medical Center - Henry & Lucy Moses Div,0 to 17,104,F,Black/African American,Not Span/Hispanic,1,Emergency,Home or Self Care,2017,128,Asthma,041,OT NON-OR THER PRC RESP,141,Asthma,04,Diseases and Disorders of the Respiratory System,2,Moderate,Minor,Medical,Blue Cross/Blue Shield,,,,N,Y,13700.03,3643.06
New York City,Bronx,7000006,001169,Montefiore Medical Center - Henry & Lucy Moses Div,0 to 17,107,F,Other Race,Not Span/Hispanic,2,Emergency,Home or Self Care,2017,128,Asthma,041,OT NON-OR THER PRC RESP,141,Asthma,04,Diseases and Disorders of the Respiratory System,1,Minor,Minor,Medical,Private Health Insurance,Medicaid,,,N,Y,21242.31,5791.66
New York City,Bronx,7000006,001169,Montefiore Medical Center - Henry & Lucy Moses Div,0 to 17,104,F,Other Race,Spanish/Hispanic,1,Emergency,Home or Self Care,2017,128,Asthma,041,OT NON-OR THER PRC RESP,141,Asthma,04,Diseases and Disorders of the Respiratory System,1,Minor,Minor,Medical,Medicaid,,,,N,Y,13114.31,3425.66
New York City,Bronx,7000006,001169,Montefiore Medical Center - Henry & Lucy Moses Div,0 to 17,104,F,Black/African American,Not Span/Hispanic,2,Emergency,Home or Self Care,2017,128,Asthma,041,OT NON-OR THER PRC RESP,141,Asthma,04,Diseases and Disorders of the Respiratory System,1,Minor,Minor,Medical,Medicaid,,,,N,Y,18848.33,4508.72
New York City,Bronx,7000006,001169,Montefiore Medical Center - Henry & Lucy Moses Div,0 to 17,104,M,Other Race,Spanish/Hispanic,1,Emergency,Home or Self Care,2017,128,Asthma,041,OT NON-OR THER PRC RESP,141,Asthma,04,Diseases and Disorders of the Respiratory System,2,Moderate,Minor,Medical,Medicaid,,,,N,Y,13643.78,3611.65
New York City,Bronx,7000006,001169,Montefiore Medical Center - Henry & Lucy Moses Div,0 to 17,104,M,Other Race,Spanish/Hispanic,2,Emergency,Home or Self Care,2017,128,Asthma,000,NO PROC,141,Asthma,04,Diseases and Disorders of the Respiratory System,1,Minor,Minor,Medical,Medicaid,,,,N,Y,22700.51,6195.58
New York City,Bronx,7000006,001169,Montefiore Medical Center - Henry & Lucy Moses Div,0 to 17,112,M,Other Race,Not Span/Hispanic,2,Emergency,Home or Self Care,2017,128,Asthma,041,OT NON-OR THER PRC RESP,141,Asthma,04,Diseases and Disorders of the Respiratory System,3,Major,Moderate,Medical,Medicaid,,,,N,Y,19323.96,5554.24
New York City,Bronx,7000006,001169,Montefiore Medical Center - Henry & Lucy Moses Div,0 to 17,104,F,Black/African American,Not Span/Hispanic,2,Emergency,Home or Self Care,2017,128,Asthma,041,OT NON-OR THER PRC RESP,141,Asthma,04,Diseases and Disorders of the Respiratory System,2,Moderate,Minor,Medical,Medicaid,,,,N,Y,20239.88,4736.11
New York City,Bronx,7000006,001169,Montefiore Medical Center - Henry & Lucy Moses Div,0 to 17,104,M,Black/African American,Not Span/Hispanic,1,Emergency,Home or Self Care,2017,128,Asthma,041,OT NON-OR THER PRC RESP,141,Asthma,04,Diseases and Disorders of the Respiratory System,1,Minor,Minor,Medical,Medicaid,,,,N,Y,15190.64,3768.28
New York City,Bronx,7000006,001169,Montefiore Medical Center - Henry & Lucy Moses Div,0 to 17,104,M,Other Race,Spanish/Hispanic,1,Emergency,Home or Self Care,2017,128,Asthma,041,OT NON-OR THER PRC RESP,141,Asthma,04,Diseases and Disorders of the Respiratory System,1,Minor,Minor,Medical,Federal/State/Local/VA,Medicaid,,,N,Y,14166.70,3565.86
New York City,Bronx,7000006,001169,Montefiore Medical Center - Henry & Lucy Moses Div,0 to 17,104,M,Other Race,Not Span/Hispanic,1,Emergency,Home or Self Care,2017,128,Asthma,041,OT NON-OR THER PRC RESP,141,Asthma,04,Diseases and Disorders of the Respiratory System,2,Moderate,Minor,Medical,Private Health Insurance,Private Health Insurance,,,N,Y,13795.50,3454.47
New York City,Bronx,7000006,003058,Montefiore Med Center - Jack D Weiler Hosp of A Einstein College Div,30 to 49,104,F,White,Not Span/Hispanic,1,Emergency,Home or Self Care,2017,128,Asthma,041,OT NON-OR THER PRC RESP,141,Asthma,04,Diseases and Disorders of the Respiratory System,1,Minor,Minor,Medical,Miscellaneous/Other,,,,N,Y,20792.37,2806.63
New York City,Bronx,7000006,003058,Montefiore Med Center - Jack D Weiler Hosp of A Einstein College Div,50 to 69,104,F,Black/African American,Not Span/Hispanic,4,Emergency,Home or Self Care,2017,128,Asthma,041,OT NON-OR THER PRC RESP,141,Asthma,04,Diseases and Disorders of the Respiratory System,2,Moderate,Moderate,Medical,Self-Pay,,,,N,Y,39506.88,8494.85
New York City,Bronx,7000006,003058,Montefiore Med Center - Jack D Weiler Hosp of A Einstein College Div,70 or Older,104,F,Other Race,Not Span/Hispanic,5,Emergency,Home or Self Care,2017,128,Asthma,041,OT NON-OR THER PRC RESP,141,Asthma,04,Diseases and Disorders of the Respiratory System,3,Major,Major,Medical,Medicare,Medicaid,,,N,Y,54082.61,11020.92
New York City,Bronx,7000006,003058,Montefiore Med Center - Jack D Weiler Hosp of A Einstein College Div,50 to 69,104,F,Other Race,Spanish/Hispanic,5,Emergency,Home or Self Care,2017,128,Asthma,041,OT NON-OR THER PRC RESP,141,Asthma,04,Diseases and Disorders of the Respiratory System,2,Moderate,Minor,Medical,Private Health Insurance,,,,N,Y,52146.88,11026.43
New York City,Bronx,7000006,003058,Montefiore Med Center - Jack D Weiler Hosp of A Einstein College Div,18 to 29,104,F,Black/African American,Not Span/Hispanic,2,Emergency,Home or Self Care,2017,128,Asthma,041,OT NON-OR THER PRC RESP,141,Asthma,04,Diseases and Disorders of the Respiratory System,1,Minor,Minor,Medical,Private Health Insurance,,,,N,Y,29647.07,5591.71
New York City,Bronx,7000006,003058,Montefiore Med Center - Jack D Weiler Hosp of A Einstein College Div,50 to 69,104,M,Other Race,Spanish/Hispanic,5,Emergency,Home or Self Care,2017,128,Asthma,041,OT NON-OR THER PRC RESP,141,Asthma,04,Diseases and Disorders of the Respiratory System,2,Moderate,Minor,Medical,Medicare,,,,N,Y,41292.27,8842.44
New York City,Bronx,7000006,003058,Montefiore Med Center - Jack D Weiler Hosp of A Einstein College Div,30 to 49,104,F,Other Race,Spanish/Hispanic,2,Emergency,Home or Self Care,2017,128,Asthma,041,OT NON-OR THER PRC RESP,141,Asthma,04,Diseases and Disorders of the Respiratory System,2,Moderate,Minor,Medical,Private Health Insurance,,,,N,Y,23709.97,4812.01
New York City,Kings,7002002,001324,Mount Sinai Brooklyn,70 or Older,112,M,White,Not Span/Hispanic,8,Emergency,Home w/ Home Health Services,2017,128,Asthma,193,DX ULTRASOUND HEART,141,Asthma,04,Diseases and Disorders of the Respiratory System,2,Moderate,Moderate,Medical,Medicare,Medicaid,Self-Pay,,N,Y,63011.72,10483.23
New York City,Kings,7001033,001315,Kingsbrook Jewish Medical Center,70 or Older,112,F,Black/African American,Not Span/Hispanic,3,Emergency,Home or Self Care,2017,128,Asthma,000,NO PROC,141,Asthma,04,Diseases and Disorders of the Respiratory System,1,Minor,Minor,Medical,Medicare,Medicare,Self-Pay,,N,Y,23612.00,6562.12
New York City,Kings,7001033,001315,Kingsbrook Jewish Medical Center,30 to 49,115,F,Other Race,Not Span/Hispanic,6,Emergency,Home or Self Care,2017,128,Asthma,216,RESP INTUB/MECH VENTIL,141,Asthma,04,Diseases and Disorders of the Respiratory System,1,Minor,Minor,Medical,Blue Cross/Blue Shield,Self-Pay,,,N,Y,34167.00,11210.16
New York City,Kings,7001033,001315,Kingsbrook Jewish Medical Center,70 or Older,112,M,Black/African American,Not Span/Hispanic,2,Emergency,Home or Self Care,2017,128,Asthma,000,NO PROC,141,Asthma,04,Diseases and Disorders of the Respiratory System,1,Minor,Minor,Medical,Medicare,Medicare,Self-Pay,,N,Y,16645.00,4783.98
New York City,Kings,7001033,001315,Kingsbrook Jewish Medical Center,70 or Older,112,F,Black/African American,Not Span/Hispanic,5,Emergency,Home or Self Care,2017,128,Asthma,000,NO PROC,141,Asthma,04,Diseases and Disorders of the Respiratory System,2,Moderate,Moderate,Medical,Medicare,Medicaid,Self-Pay,,N,Y,31388.00,9561.90
New York City,Kings,7002002,001324,Mount Sinai Brooklyn,30 to 49,112,F,Black/African American,Not Span/Hispanic,9,Emergency,Home or Self Care,2017,128,Asthma,041,OT NON-OR THER PRC RESP,141,Asthma,04,Diseases and Disorders of the Respiratory System,2,Moderate,Moderate,Medical,Medicare,Medicaid,Self-Pay,,N,Y,74138.15,15897.51
Hudson Valley,Orange,3523000,000699,Orange Regional Medical Center,30 to 49,109,F,Black/African American,Not Span/Hispanic,4,Emergency,Home or Self Care,2017,128,Asthma,000,NO PROC,141,Asthma,04,Diseases and Disorders of the Respiratory System,2,Moderate,Minor,Medical,Private Health Insurance,,,,N,Y,24366.52,6723.23
New York City,Manhattan,7002002,001439,Mount Sinai Beth Israel,50 to 69,100,F,Other Race,Not Span/Hispanic,3,Emergency,Home or Self Care,2017,128,Asthma,202,ELECTROCARDIOGRAM,141,Asthma,04,Diseases and Disorders of the Respiratory System,2,Moderate,Minor,Medical,Medicaid,Medicaid,Self-Pay,,N,Y,43562.64,23105.65
New York City,Manhattan,7002002,001439,Mount Sinai Beth Israel,50 to 69,100,M,White,Not Span/Hispanic,4,Emergency,Home or Self Care,2017,128,Asthma,041,OT NON-OR THER PRC RESP,141,Asthma,04,Diseases and Disorders of the Respiratory System,2,Moderate,Minor,Medical,Private Health Insurance,Self-Pay,,,N,N,25400.07,8616.94
New York City,Manhattan,7002002,001439,Mount Sinai Beth Israel,50 to 69,100,F,Other Race,Not Span/Hispanic,7,Emergency,Home w/ Home Health Services,2017,128,Asthma,193,DX ULTRASOUND HEART,141,Asthma,04,Diseases and Disorders of the Respiratory System,2,Moderate,Moderate,Medical,Medicaid,Medicaid,Self-Pay,,N,Y,66923.83,22772.94
New York City,Manhattan,7002002,001439,Mount Sinai Beth Israel,0 to 17,,M,White,Not Span/Hispanic,2,Emergency,Home or Self Care,2017,128,Asthma,041,OT NON-OR THER PRC RESP,141,Asthma,04,Diseases and Disorders of the Respiratory System,1,Minor,Minor,Medical,Private Health Insurance,Self-Pay,,,N,Y,15341.45,10060.43
New York City,Manhattan,7002002,001439,Mount Sinai Beth Israel,50 to 69,100,F,Black/African American,Spanish/Hispanic,5,Emergency,Home or Self Care,2017,128,Asthma,231,OTHER THERAPEUTIC PRCS,141,Asthma,04,Diseases and Disorders of the Respiratory System,2,Moderate,Minor,Medical,Medicaid,Medicaid,Self-Pay,,N,Y,60544.41,28384.53
New York City,Manhattan,7002024,001456,Mount Sinai Hospital,0 to 17,100,M,Other Race,Not Span/Hispanic,2,Urgent,Home or Self Care,2017,128,Asthma,000,NO PROC,141,Asthma,04,Diseases and Disorders of the Respiratory System,2,Moderate,Minor,Medical,Medicaid,Medicaid,Self-Pay,,N,N,13596.98,10589.46
New York City,Manhattan,7002024,001456,Mount Sinai Hospital,0 to 17,100,F,Black/African American,Not Span/Hispanic,2,Urgent,Home or Self Care,2017,128,Asthma,041,OT NON-OR THER PRC RESP,141,Asthma,04,Diseases and Disorders of the Respiratory System,2,Moderate,Minor,Medical,Blue Cross/Blue Shield,Self-Pay,,,N,N,17448.53,9759.10
New York City,Manhattan,7002024,001456,Mount Sinai Hospital,70 or Older,100,M,Black/African American,Not Span/Hispanic,2,Emergency,Home or Self Care,2017,128,Asthma,000,NO PROC,141,Asthma,04,Diseases and Disorders of the Respiratory System,1,Minor,Minor,Medical,Medicare,Medicare,Medicaid,,N,Y,31255.46,10740.94
New York City,Manhattan,7002024,001456,Mount Sinai Hospital,18 to 29,104,F,Other Race,Not Span/Hispanic,3,Emergency,Home or Self Care,2017,128,Asthma,000,NO PROC,141,Asthma,04,Diseases and Disorders of the Respiratory System,1,Minor,Minor,Medical,Medicaid,Medicaid,Self-Pay,,N,Y,24696.19,8719.57
New York City,Manhattan,7002024,001456,Mount Sinai Hospital,30 to 49,100,F,Other Race,Not Span/Hispanic,3,Emergency,Home or Self Care,2017,128,Asthma,000,NO PROC,141,Asthma,04,Diseases and Disorders of the Respiratory System,2,Moderate,Minor,Medical,Medicaid,Medicaid,Self-Pay,,N,Y,25992.51,8721.41
New York City,Manhattan,7002024,001456,Mount Sinai Hospital,0 to 17,100,M,Black/African American,Not Span/Hispanic,1,Emergency,Home or Self Care,2017,128,Asthma,000,NO PROC,141,Asthma,04,Diseases and Disorders of the Respiratory System,2,Moderate,Minor,Medical,Medicaid,Self-Pay,,,N,Y,16760.68,6683.22
New York City,Manhattan,7002024,001456,Mount Sinai Hospital,0 to 17,100,F,Black/African American,Not Span/Hispanic,2,Emergency,Home or Self Care,2017,128,Asthma,000,NO PROC,141,Asthma,04,Diseases and Disorders of the Respiratory System,2,Moderate,Minor,Medical,Medicaid,Medicaid,Self-Pay,,N,Y,22363.26,11478.01
New York City,Manhattan,7002024,001456,Mount Sinai Hospital,50 to 69,100,M,Black/African American,Not Span/Hispanic,4,Emergency,Home or Self Care,2017,128,Asthma,216,RESP INTUB/MECH VENTIL,141,Asthma,04,Diseases and Disorders of the Respiratory System,1,Minor,Minor,Medical,Medicaid,Medicaid,Self-Pay,,N,Y,31677.43,11006.57
New York City,Manhattan,7002024,001456,Mount Sinai Hospital,18 to 29,100,F,Black/African American,Not Span/Hispanic,2,Emergency,Home or Self Care,2017,128,Asthma,000,NO PROC,141,Asthma,04,Diseases and Disorders of the Respiratory System,2,Moderate,Minor,Medical,Medicaid,Medicaid,Self-Pay,,N,Y,22600.34,7870.80
New York City,Manhattan,7002024,001456,Mount Sinai Hospital,50 to 69,111,F,Other Race,Not Span/Hispanic,2,Emergency,Home or Self Care,2017,128,Asthma,000,NO PROC,141,Asthma,04,Diseases and Disorders of the Respiratory System,1,Minor,Minor,Medical,Private Health Insurance,Self-Pay,,,N,N,15304.01,5220.07