Hospital Service Area,Hospital County,Operating Certificate Number,Permanent Facility Id,Facility Name,Age Group,Zip Code - 3 digits,Gender,Race,Ethnicity,Length of Stay,Type of Admission,Patient Disposition,Discharge Year,CCS Diagnosis Code,CCS Diagnosis Description,CCS Procedure Code,CCS Procedure Description,APR DRG Code,APR DRG Description,APR MDC Code,APR MDC Description,APR Severity of Illness Code,APR Severity of Illness Description,APR Risk of Mortality,APR Medical Surgical Description,Payment Typology 1,Payment Typology 2,Payment Typology 3,Birth Weight,Abortion Edit Indicator,Emergency Department Indicator,Total Charges,Total Costs
New York City,Kings,7002053,001304,NYU Langone Hospital-Brooklyn,50 to 69,112,M,Black/African American,Not Span/Hispanic,1,Emergency,Home or Self Care,2019,RSP009,ASTHMA,ADM021,"ADMINISTRATION OF THERAPEUTIC SUBSTANCES, NEC",141,ASTHMA,04,DISEASES AND DISORDERS OF THE RESPIRATORY SYSTEM,2,Moderate,Moderate,Medical,Blue Cross/Blue Shield,,,,,true,14028.86,4412.7
New York City,Kings,7002053,001304,NYU Langone Hospital-Brooklyn,50 to 69,112,F,Other Race,Not Span/Hispanic,1,Emergency,Home or Self Care,2019,RSP009,ASTHMA,,,141,ASTHMA,04,DISEASES AND DISORDERS OF THE RESPIRATORY SYSTEM,3,Major,Moderate,Medical,Medicaid,,,,,true,23441.88,5863.4
New York City,Kings,7002053,001304,NYU Langone Hospital-Brooklyn,0 to 17,112,M,Other Race,Spanish/Hispanic,3,Emergency,Home or Self Care,2019,RSP009,ASTHMA,ADM021,"ADMINISTRATION OF THERAPEUTIC SUBSTANCES, NEC",141,ASTHMA,04,DISEASES AND DISORDERS OF THE RESPIRATORY SYSTEM,1,Minor,Minor,Medical,Medicaid,,,,,true,29646.87,11427.73
New York City,Kings,7002053,001304,NYU Langone Hospital-Brooklyn,50 to 69,112,F,White,Spanish/Hispanic,6,Emergency,Home w/ Home Health Services,2019,RSP009,ASTHMA,,,141,ASTHMA,04,DISEASES AND DISORDERS OF THE RESPIRATORY SYSTEM,3,Major,Moderate,Medical,Medicare,Medicaid,,,,true,82503.01,23159.55
New York City,Kings,7002053,001304,NYU Langone Hospital-Brooklyn,70 or Older,112,F,Other Race,Spanish/Hispanic,3,Emergency,Home w/ Home Health Services,2019,RSP009,ASTHMA,IMG006,COMPUTERIZED TOMOGRAPHY (CT) WITH CONTRAST,141,ASTHMA,04,DISEASES AND DISORDERS OF THE RESPIRATORY SYSTEM,3,Major,Major,Medical,Private Health Insurance,Medicaid,,,,true,62304.96,13821.38
New York City,Kings,7002053,001304,NYU Langone Hospital-Brooklyn,50 to 69,112,F,White,Not Span/Hispanic,1,Emergency,Home or Self Care,2019,RSP009,ASTHMA,,,141,ASTHMA,04,DISEASES AND DISORDERS OF THE RESPIRATORY SYSTEM,3,Major,Moderate,Medical,Medicare,,,,,true,18979.41,5041.19
New York City,Kings,7002053,001304,NYU Langone Hospital-Brooklyn,50 to 69,112,F,White,Not Span/Hispanic,2,Emergency,Home or Self Care,2019,RSP009,ASTHMA,,,141,ASTHMA,04,DISEASES AND DISORDERS OF THE RESPIRATORY SYSTEM,2,Moderate,Moderate,Medical,Medicaid,,,,,true,35165.41,12220.87
New York City,Kings,7002053,001304,NYU Langone Hospital-Brooklyn,70 or Older,112,F,Other Race,Spanish/Hispanic,2,Emergency,Home or Self Care,2019,RSP009,ASTHMA,,,141,ASTHMA,04,DISEASES AND DISORDERS OF THE RESPIRATORY SYSTEM,1,Minor,Minor,Medical,Medicare,Medicaid,,,,true,47114.67,11421.5
New York City,Kings,7002053,001304,NYU Langone Hospital-Brooklyn,0 to 17,112,F,Other Race,Not Span/Hispanic,1,Emergency,Home or Self Care,2019,RSP009,ASTHMA,,,141,ASTHMA,04,DISEASES AND DISORDERS OF THE RESPIRATORY SYSTEM,1,Minor,Minor,Medical,Medicaid,,,,,true,11901.86,3584.77
New York City,Kings,7002053,001304,NYU Langone Hospital-Brooklyn,30 to 49,112,F,White,Not Span/Hispanic,1,Emergency,Home or Self Care,2019,RSP009,ASTHMA,,,141,ASTHMA,04,DISEASES AND DISORDERS OF THE RESPIRATORY SYSTEM,2,Moderate,Minor,Medical,Private Health Insurance,,,,,true,17663.52,5433.33
New York City,Kings,7002053,001304,NYU Langone Hospital-Brooklyn,0 to 17,112,M,White,Spanish/Hispanic,2,Emergency,Home or Self Care,2019,RSP009,ASTHMA,ADM021,"ADMINISTRATION OF THERAPEUTIC SUBSTANCES, NEC",141,ASTHMA,04,DISEASES AND DISORDERS OF THE RESPIRATORY SYSTEM,1,Minor,Minor,Medical,Medicaid,,,,,true,22847.66,6747.88
New York City,Kings,7002053,001304,NYU Langone Hospital-Brooklyn,50 to 69,112,F,Other Race,Spanish/Hispanic,2,Emergency,Home or Self Care,2019,RSP009,ASTHMA,ADM001,TRANSFUSION OF BLOOD AND BLOOD PRODUCTS,141,ASTHMA,04,DISEASES AND DISORDERS OF THE RESPIRATORY SYSTEM,2,Moderate,Minor,Medical,Medicaid,,,,,true,28056.47,8476.08
New York City,Kings,7002053,001304,NYU Langone Hospital-Brooklyn,70 or Older,112,F,Black/African American,Not Span/Hispanic,2,Emergency,Home w/ Home Health Services,2019,RSP009,ASTHMA,ESA004,NON-INVASIVE VENTILATION,141,ASTHMA,04,DISEASES AND DISORDERS OF THE RESPIRATORY SYSTEM,3,Major,Moderate,Medical,Medicare,Medicaid,,,,true,37492.53,9608.66
New York City,Kings,7002053,001304,NYU Langone Hospital-Brooklyn,50 to 69,112,F,Black/African American,Not Span/Hispanic,3,Emergency,Home w/ Home Health Services,2019,RSP009,ASTHMA,,,141,ASTHMA,04,DISEASES AND DISORDERS OF THE RESPIRATORY SYSTEM,3,Major,Major,Medical,Medicare,Medicaid,,,,true,46174.76,15714.63
New York City,Kings,7002053,001304,NYU Langone Hospital-Brooklyn,70 or Older,112,F,White,Spanish/Hispanic,1,Emergency,Home or Self Care,2019,RSP009,ASTHMA,ADM021,"ADMINISTRATION OF THERAPEUTIC SUBSTANCES, NEC",141,ASTHMA,04,DISEASES AND DISORDERS OF THE RESPIRATORY SYSTEM,2,Moderate,Moderate,Medical,Medicare,Medicaid,,,,true,17460.19,4887.58
New York City,Kings,7002053,001304,NYU Langone Hospital-Brooklyn,50 to 69,112,F,Other Race,Not Span/Hispanic,3,Emergency,Home w/ Home Health Services,2019,RSP009,ASTHMA,,,141,ASTHMA,04,DISEASES AND DISORDERS OF THE RESPIRATORY SYSTEM,2,Moderate,Moderate,Medical,Medicaid,,,,,true,37859.16,11286.31
New York City,Kings,7002053,001304,NYU Langone Hospital-Brooklyn,18 to 29,112,M,White,Not Span/Hispanic,2,Emergency,Home or Self Care,2019,RSP009,ASTHMA,ESA004,NON-INVASIVE VENTILATION,141,ASTHMA,04,DISEASES AND DISORDERS OF THE RESPIRATORY SYSTEM,2,Moderate,Moderate,Medical,Medicaid,,,,,true,30194.83,9329.73
New York City,Kings,7002053,001304,NYU Langone Hospital-Brooklyn,50 to 69,103,M,Other Race,Not Span/Hispanic,2,Emergency,Home or Self Care,2019,RSP009,ASTHMA,ADM001,TRANSFUSION OF BLOOD AND BLOOD PRODUCTS,141,ASTHMA,04,DISEASES AND DISORDERS OF THE RESPIRATORY SYSTEM,2,Moderate,Moderate,Medical,Medicaid,,,,,true,54718.1,16983.36
New York City,Kings,7002053,001304,NYU Langone Hospital-Brooklyn,50 to 69,112,F,Other Race,Not Span/Hispanic,3,Emergency,Home or Self Care,2019,RSP009,ASTHMA,IMG007,COMPUTERIZED TOMOGRAPHY (CT) WITHOUT CONTRAST,141,ASTHMA,04,DISEASES AND DISORDERS OF THE RESPIRATORY SYSTEM,1,Minor,Minor,Medical,Medicare,Medicaid,,,,true,36954.32,11766.73
New York City,Kings,7002053,001304,NYU Langone Hospital-Brooklyn,18 to 29,112,F,Other Race,Spanish/Hispanic,4,Emergency,Home or Self Care,2019,RSP009,ASTHMA,,,141,ASTHMA,04,DISEASES AND DISORDERS OF THE RESPIRATORY SYSTEM,4,Extreme,Moderate,Medical,Medicaid,,,,,true,46321.32,15605.43
New York City,Kings,7002053,001304,NYU Langone Hospital-Brooklyn,70 or Older,112,M,Other Race,Spanish/Hispanic,1,Emergency,Home w/ Home Health Services,2019,RSP009,ASTHMA,ESA004,NON-INVASIVE VENTILATION,141,ASTHMA,04,DISEASES AND DISORDERS OF THE RESPIRATORY SYSTEM,3,Major,Major,Medical,Medicare,Medicaid,,,,true,26603.8,6486.99
New York City,Kings,7002053,001304,NYU Langone Hospital-Brooklyn,70 or Older,112,F,Other Race,Spanish/Hispanic,3,Emergency,Home w/ Home Health Services,2019,RSP009,ASTHMA,,,141,ASTHMA,04,DISEASES AND DISORDERS OF THE RESPIRATORY SYSTEM,2,Moderate,Minor,Medical,Medicare,Medicaid,,,,true,56644.72,18573.85
New York City,Kings,7002053,001304,NYU Langone Hospital-Brooklyn,70 or Older,112,F,Other Race,Not Span/Hispanic,4,Emergency,Home w/ Home Health Services,2019,RSP009,ASTHMA,,,141,ASTHMA,04,DISEASES AND DISORDERS OF THE RESPIRATORY SYSTEM,3,Major,Moderate,Medical,Medicare,Medicaid,,,,true,58291.78,21746.92
New York City,Kings,7002053,001304,NYU Langone Hospital-Brooklyn,0 to 17,112,F,Black/African American,Spanish/Hispanic,2,Emergency,Home or Self Care,2019,RSP009,ASTHMA,,,141,ASTHMA,04,DISEASES AND DISORDERS OF THE RESPIRATORY SYSTEM,1,Minor,Minor,Medical,Blue Cross/Blue Shield,,,,,true,19305.61,6682.79
New York City,Kings,7002053,001304,NYU Langone Hospital-Brooklyn,0 to 17,112,M,Other Race,Spanish/Hispanic,1,Emergency,Home or Self Care,2019,RSP009,ASTHMA,,,141,ASTHMA,04,DISEASES AND DISORDERS OF THE RESPIRATORY SYSTEM,1,Minor,Minor,Medical,Blue Cross/Blue Shield,,,,,true,11506.75,3515.92
New York City,Kings,7002053,001304,NYU Langone Hospital-Brooklyn,50 to 69,112,F,Black/African American,Not Span/Hispanic,2,Emergency,Home or Self Care,2019,RSP009,ASTHMA,,,141,ASTHMA,04,DISEASES AND DISORDERS OF THE RESPIRATORY SYSTEM,2,Moderate,Minor,Medical,Medicare,,,,,true,29705.33,9937.16
New York City,Kings,7002053,001304,NYU Langone Hospital-Brooklyn,70 or Older,112,F,Other Race,Spanish/Hispanic,1,Emergency,Home or Self Care,2019,RSP009,ASTHMA,,,141,ASTHMA,04,DISEASES AND DISORDERS OF THE RESPIRATORY SYSTEM,2,Moderate,Moderate,Medical,Medicare,,,,,true,27627.65,8861.59
New York City,Kings,7002053,001304,NYU Langone Hospital-Brooklyn,70 or Older,112,F,Other Race,Not Span/Hispanic,1,Emergency,Home w/ Home Health Services,2019,RSP009,ASTHMA,,,141,ASTHMA,04,DISEASES AND DISORDERS OF THE RESPIRATORY SYSTEM,2,Moderate,Moderate,Medical,Medicare,Medicaid,,,,true,44547.54,13548.06
New York City,Kings,7002053,001304,NYU Langone Hospital-Brooklyn,50 to 69,112,F,Black/African American,Not Span/Hispanic,21,Emergency,Skilled Nursing Home,2019,RSP009,ASTHMA,,,141,ASTHMA,04,DISEASES AND DISORDERS OF THE RESPIRATORY SYSTEM,3,Major,Moderate,Medical,Medicare,Medicaid,,,,true,167533.8,69798.3
New York City,Kings,7002053,001304,NYU Langone Hospital-Brooklyn,50 to 69,112,F,Other Race,Spanish/Hispanic,8,Emergency,Home w/ Home Health Services,2019,RSP009,ASTHMA,,,141,ASTHMA,04,DISEASES AND DISORDERS OF THE RESPIRATORY SYSTEM,3,Major,Major,Medical,Medicare,Medicaid,,,,true,104378.76,28692.27
New York City,Kings,7002053,001304,NYU Langone Hospital-Brooklyn,70 or Older,112,F,White,Not Span/Hispanic,9,Emergency,Skilled Nursing Home,2019,RSP009,ASTHMA,,,141,ASTHMA,04,DISEASES AND DISORDERS OF THE RESPIRATORY SYSTEM,3,Major,Major,Medical,Blue Cross/Blue Shield,,,,,true,135985.27,32884.68
New York City,Kings,7002053,001304,NYU Langone Hospital-Brooklyn,70 or Older,112,F,Other Race,Not Span/Hispanic,15,Emergency,Medicare Cert Long Term Care Hospital,2019,RSP009,ASTHMA,,,141,ASTHMA,04,DISEASES AND DISORDERS OF THE RESPIRATORY SYSTEM,3,Major,Major,Medical,Medicare,Medicaid,,,,true,119818.46,50386.13
New York City,Kings,7002053,001304,NYU Langone Hospital-Brooklyn,50 to 69,112,M,Other Race,Spanish/Hispanic,2,Emergency,Home or Self Care,2019,RSP009,ASTHMA,,,141,ASTHMA,04,DISEASES AND DISORDERS OF THE RESPIRATORY SYSTEM,2,Moderate,Minor,Medical,Private Health Insurance,Medicaid,,,,true,27361.37,8944.73
New York City,Kings,7002053,001304,NYU Langone Hospital-Brooklyn,70 or Older,112,F,Multi-racial,Not Span/Hispanic,1,Emergency,Home or Self Care,2019,RSP009,ASTHMA,,,141,ASTHMA,04,DISEASES AND DISORDERS OF THE RESPIRATORY SYSTEM,2,Moderate,Moderate,Medical,Medicare,Medicaid,,,,true,16714.78,4501.18
New York City,Kings,7002053,001304,NYU Langone Hospital-Brooklyn,50 to 69,112,M,Other Race,Spanish/Hispanic,3,Emergency,Home w/ Home Health Services,2019,RSP009,ASTHMA,,,141,ASTHMA,04,DISEASES AND DISORDERS OF THE RESPIRATORY SYSTEM,2,Moderate,Minor,Medical,Medicare,Medicaid,,,,true,53609.27,11655.89
New York City,Kings,7002053,001304,NYU Langone Hospital-Brooklyn,0 to 17,112,F,White,Not Span/Hispanic,1,Emergency,Home or Self Care,2019,RSP009,ASTHMA,ADM021,"ADMINISTRATION OF THERAPEUTIC SUBSTANCES, NEC",141,ASTHMA,04,DISEASES AND DISORDERS OF THE RESPIRATORY SYSTEM,1,Minor,Minor,Medical,Medicaid,,,,,true,17673.51,4766.09
New York City,Kings,7002053,001304,NYU Langone Hospital-Brooklyn,50 to 69,112,M,Other Race,Not Span/Hispanic,2,Emergency,Home or Self Care,2019,RSP009,ASTHMA,ADM017,ADMINISTRATION OF NUTRITIONAL AND ELECTROLYTIC SUBSTANCES,141,ASTHMA,04,DISEASES AND DISORDERS OF THE RESPIRATORY SYSTEM,3,Major,Moderate,Medical,Medicare,Medicaid,,,,true,33181.53,9348.82
New York City,Kings,7002053,001304,NYU Langone Hospital-Brooklyn,70 or Older,112,F,Other Race,Not Span/Hispanic,5,Emergency,Home w/ Home Health Services,2019,RSP009,ASTHMA,,,141,ASTHMA,04,DISEASES AND DISORDERS OF THE RESPIRATORY SYSTEM,2,Moderate,Moderate,Medical,Medicare,Medicaid,,,,true,51512.92,17788.87
New York City,Kings,7002053,001304,NYU Langone Hospital-Brooklyn,50 to 69,116,F,Black/African American,Not Span/Hispanic,1,Emergency,Left Against Medical Advice,2019,RSP009,ASTHMA,,,141,ASTHMA,04,DISEASES AND DISORDERS OF THE RESPIRATORY SYSTEM,1,Minor,Minor,Medical,Medicare,,,,,true,22818.84,8653.36
New York City,Kings,7002053,001304,NYU Langone Hospital-Brooklyn,50 to 69,112,F,White,Not Span/Hispanic,4,Emergency,Home or Self Care,2019,RSP009,ASTHMA,ESA003,MECHANICAL VENTILATION,141,ASTHMA,04,DISEASES AND DISORDERS OF THE RESPIRATORY SYSTEM,4,Extreme,Major,Medical,Blue Cross/Blue Shield,,,,,true,87142.96,30081.91
New York City,Kings,7002053,001304,NYU Langone Hospital-Brooklyn,0 to 17,112,M,White,Spanish/Hispanic,2,Emergency,Home or Self Care,2019,RSP009,ASTHMA,ADM021,"ADMINISTRATION OF THERAPEUTIC SUBSTANCES, NEC",141,ASTHMA,04,DISEASES AND DISORDERS OF THE RESPIRATORY SYSTEM,1,Minor,Minor,Medical,Medicaid,,,,,true,23830.82,6847.38
New York City,Kings,7002053,001304,NYU Langone Hospital-Brooklyn,70 or Older,112,F,Other Race,Not Span/Hispanic,2,Emergency,Home w/ Home Health Services,2019,RSP009,ASTHMA,,,141,ASTHMA,04,DISEASES AND DISORDERS OF THE RESPIRATORY SYSTEM,3,Major,Moderate,Medical,Medicaid,,,,,true,29048.24,8275.84
New York City,Kings,7002053,001304,NYU Langone Hospital-Brooklyn,30 to 49,113,F,Other Race,Spanish/Hispanic,2,Emergency,Home or Self Care,2019,RSP009,ASTHMA,,,141,ASTHMA,04,DISEASES AND DISORDERS OF THE RESPIRATORY SYSTEM,1,Minor,Minor,Medical,Medicaid,,,,,true,39368,13784.21
New York City,Kings,7002053,001304,NYU Langone Hospital-Brooklyn,18 to 29,116,F,White,Not Span/Hispanic,1,Emergency,Home or Self Care,2019,RSP009,ASTHMA,ADM021,"ADMINISTRATION OF THERAPEUTIC SUBSTANCES, NEC",141,ASTHMA,04,DISEASES AND DISORDERS OF THE RESPIRATORY SYSTEM,2,Moderate,Minor,Medical,Medicare,Medicaid,,,,true,20650.86,5347.03
New York City,Kings,7002053,001304,NYU Langone Hospital-Brooklyn,30 to 49,112,F,Other Race,Not Span/Hispanic,1,Emergency,Home or Self Care,2019,RSP009,ASTHMA,,,141,ASTHMA,04,DISEASES AND DISORDERS OF THE RESPIRATORY SYSTEM,1,Minor,Minor,Medical,Blue Cross/Blue Shield,,,,,true,29861.6,8637.46
New York City,Kings,7002053,001304,NYU Langone Hospital-Brooklyn,0 to 17,112,M,Black/African American,Not Span/Hispanic,1,Emergency,Home or Self Care,2019,RSP009,ASTHMA,ADM021,"ADMINISTRATION OF THERAPEUTIC SUBSTANCES, NEC",141,ASTHMA,04,DISEASES AND DISORDERS OF THE RESPIRATORY SYSTEM,1,Minor,Minor,Medical,Federal/State/Local/VA,,,,,true,13504.04,4186.88
New York City,Kings,7002053,001304,NYU Langone Hospital-Brooklyn,70 or Older,112,F,Other Race,Spanish/Hispanic,7,Emergency,Home w/ Home Health Services,2019,RSP009,ASTHMA,,,141,ASTHMA,04,DISEASES AND DISORDERS OF THE RESPIRATORY SYSTEM,2,Moderate,Moderate,Medical,Medicare,,,,,true,65611.54,24909.38
New York City,Kings,7002053,001304,NYU Langone Hospital-Brooklyn,0 to 17,112,F,Other Race,Spanish/Hispanic,1,Emergency,Home or Self Care,2019,RSP009,ASTHMA,ADM021,"ADMINISTRATION OF THERAPEUTIC SUBSTANCES, NEC",141,ASTHMA,04,DISEASES AND DISORDERS OF THE RESPIRATORY SYSTEM,1,Minor,Minor,Medical,Medicaid,,,,,true,13094.97,3766.1
New York City,Kings,7002053,001304,NYU Langone Hospital-Brooklyn,30 to 49,112,M,Other Race,Not Span/Hispanic,2,Emergency,Home or Self Care,2019,RSP009,ASTHMA,ADM016,ADMINISTRATION OF ANTI-INFLAMMATORY AGENTS,141,ASTHMA,04,DISEASES AND DISORDERS OF THE RESPIRATORY SYSTEM,2,Moderate,Minor,Medical,Medicaid,,,,,true,35171.92,11971.31
New York City,Kings,7002053,001304,NYU Langone Hospital-Brooklyn,0 to 17,112,F,White,Not Span/Hispanic,2,Emergency,Home or Self Care,2019,RSP009,ASTHMA,,,141,ASTHMA,04,DISEASES AND DISORDERS OF THE RESPIRATORY SYSTEM,1,Minor,Minor,Medical,Blue Cross/Blue Shield,,,,,true,18212.89,6142.68
New York City,Kings,7002053,001304,NYU Langone Hospital-Brooklyn,70 or Older,112,M,Other Race,Unknown,3,Emergency,Home or Self Care,2019,RSP009,ASTHMA,IMG007,COMPUTERIZED TOMOGRAPHY (CT) WITHOUT CONTRAST,141,ASTHMA,04,DISEASES AND DISORDERS OF THE RESPIRATORY SYSTEM,2,Moderate,Major,Medical,Medicaid,,,,,true,37527.26,11776.83
New York City,Kings,7002053,001304,NYU Langone Hospital-Brooklyn,50 to 69,112,F,Other Race,Spanish/Hispanic,3,Emergency,Home or Self Care,2019,RSP009,ASTHMA,,,141,ASTHMA,04,DISEASES AND DISORDERS OF THE RESPIRATORY SYSTEM,2,Moderate,Moderate,Medical,Medicaid,,,,,true,30322.34,11221.57
New York City,Kings,7002053,001304,NYU Langone Hospital-Brooklyn,70 or Older,112,M,Other Race,Spanish/Hispanic,3,Emergency,Home w/ Home Health Services,2019,RSP009,ASTHMA,,,141,ASTHMA,04,DISEASES AND DISORDERS OF THE RESPIRATORY SYSTEM,3,Major,Major,Medical,Medicare,Medicaid,,,,true,70406.89,19618.73
New York City,Kings,7002053,001304,NYU Langone Hospital-Brooklyn,50 to 69,112,M,White,Not Span/Hispanic,7,Emergency,Home or Self Care,2019,RSP009,ASTHMA,ESA004,NON-INVASIVE VENTILATION,141,ASTHMA,04,DISEASES AND DISORDERS OF THE RESPIRATORY SYSTEM,3,Major,Minor,Medical,Medicare,,,,,true,98747,34903.82
New York City,Kings,7002053,001304,NYU Langone Hospital-Brooklyn,30 to 49,116,M,Black/African American,Unknown,1,Emergency,Left Against Medical Advice,2019,RSP009,ASTHMA,,,141,ASTHMA,04,DISEASES AND DISORDERS OF THE RESPIRATORY SYSTEM,2,Moderate,Minor,Medical,Medicaid,,,,,true,33363.68,12673.43
New York City,Kings,7002053,001304,NYU Langone Hospital-Brooklyn,18 to 29,112,M,Black/African American,Not Span/Hispanic,1,Emergency,Home or Self Care,2019,RSP009,ASTHMA,,,141,ASTHMA,04,DISEASES AND DISORDERS OF THE RESPIRATORY SYSTEM,3,Major,Moderate,Medical,Blue Cross/Blue Shield,,,,,true,24710.63,5861.06
New York City,Kings,7002053,001304,NYU Langone Hospital-Brooklyn,50 to 69,112,M,White,Not Span/Hispanic,3,Emergency,Home or Self Care,2019,RSP009,ASTHMA,,,141,ASTHMA,04,DISEASES AND DISORDERS OF THE RESPIRATORY SYSTEM,1,Minor,Minor,Medical,Medicaid,,,,,true,34679.6,14445.78
New York City,Kings,7002053,001304,NYU Langone Hospital-Brooklyn,18 to 29,112,M,White,Not Span/Hispanic,3,Emergency,Home or Self Care,2019,RSP009,ASTHMA,,,141,ASTHMA,04,DISEASES AND DISORDERS OF THE RESPIRATORY SYSTEM,2,Moderate,Minor,Medical,Medicaid,,,,,true,34857.7,12118.4
New York City,Kings,7002053,001304,NYU Langone Hospital-Brooklyn,70 or Older,112,F,White,Spanish/Hispanic,1,Emergency,Home or Self Care,2019,RSP009,ASTHMA,,,141,ASTHMA,04,DISEASES AND DISORDERS OF THE RESPIRATORY SYSTEM,3,Major,Major,Medical,Medicare,Medicaid,,,,true,18425.09,4746.75
New York City,Kings,7002053,001304,NYU Langone Hospital-Brooklyn,70 or Older,112,F,White,Not Span/Hispanic,13,Emergency,Hospice - Medical Facility,2019,RSP009,ASTHMA,RES005,CHEST TUBE PLACEMENT AND THERAPEUTIC THORACENTESIS,141,ASTHMA,04,DISEASES AND DISORDERS OF THE RESPIRATORY SYSTEM,4,Extreme,Extreme,Medical,Medicare,Medicaid,,,,true,251327.81,81259.15
New York City,Kings,7002053,001304,NYU Langone Hospital-Brooklyn,70 or Older,112,F,Other Race,Spanish/Hispanic,1,Emergency,Home or Self Care,2019,RSP009,ASTHMA,ADM016,ADMINISTRATION OF ANTI-INFLAMMATORY AGENTS,141,ASTHMA,04,DISEASES AND DISORDERS OF THE RESPIRATORY SYSTEM,2,Moderate,Moderate,Medical,Medicare,,,,,true,15576.58,4646.63
New York City,Kings,7002053,001304,NYU Langone Hospital-Brooklyn,0 to 17,,M,White,Spanish/Hispanic,3,Emergency,Home or Self Care,2019,RSP009,ASTHMA,,,141,ASTHMA,04,DISEASES AND DISORDERS OF THE RESPIRATORY SYSTEM,2,Moderate,Minor,Medical,Medicaid,,,,,true,26246.41,8905.42
New York City,Kings,7002053,001304,NYU Langone Hospital-Brooklyn,50 to 69,112,M,Other Race,Not Span/Hispanic,1,Emergency,Home or Self Care,2019,RSP009,ASTHMA,ESA004,NON-INVASIVE VENTILATION,141,ASTHMA,04,DISEASES AND DISORDERS OF THE RESPIRATORY SYSTEM,1,Minor,Minor,Medical,Medicaid,,,,,true,20047.29,5508.36
New York City,Kings,7002053,001304,NYU Langone Hospital-Brooklyn,70 or Older,112,F,Other Race,Spanish/Hispanic,1,Emergency,Home or Self Care,2019,RSP009,ASTHMA,,,141,ASTHMA,04,DISEASES AND DISORDERS OF THE RESPIRATORY SYSTEM,1,Minor,Minor,Medical,Medicare,Medicaid,,,,true,20664.14,7145.52
New York City,Kings,7002053,001304,NYU Langone Hospital-Brooklyn,50 to 69,112,M,Other Race,Unknown,3,Emergency,Home or Self Care,2019,RSP009,ASTHMA,,,141,ASTHMA,04,DISEASES AND DISORDERS OF THE RESPIRATORY SYSTEM,4,Extreme,Major,Medical,Medicaid,,,,,true,38170.97,11189.52
New York City,Kings,7002053,001304,NYU Langone Hospital-Brooklyn,70 or Older,112,F,Other Race,Not Span/Hispanic,8,Emergency,Home w/ Home Health Services,2019,RSP009,ASTHMA,,,141,ASTHMA,04,DISEASES AND DISORDERS OF THE RESPIRATORY SYSTEM,2,Moderate,Moderate,Medical,Medicare,,,,,true,170630.45,33523.69
New York City,Kings,7002053,001304,NYU Langone Hospital-Brooklyn,0 to 17,112,F,Other Race,Not Span/Hispanic,2,Emergency,Home or Self Care,2019,RSP009,ASTHMA,ADM021,"ADMINISTRATION OF THERAPEUTIC SUBSTANCES, NEC",141,ASTHMA,04,DISEASES AND DISORDERS OF THE RESPIRATORY SYSTEM,3,Major,Moderate,Medical,Medicaid,,,,,true,21927.3,6590.44
New York City,Kings,7002053,001304,NYU Langone Hospital-Brooklyn,0 to 17,112,M,White,Not Span/Hispanic,1,Emergency,Home or Self Care,2019,RSP009,ASTHMA,,,141,ASTHMA,04,DISEASES AND DISORDERS OF THE RESPIRATORY SYSTEM,1,Minor,Minor,Medical,Medicaid,,,,,true,13230.26,3752.59
New York City,Kings,7002053,001304,NYU Langone Hospital-Brooklyn,0 to 17,,F,White,Spanish/Hispanic,1,Emergency,Home or Self Care,2019,RSP009,ASTHMA,,,141,ASTHMA,04,DISEASES AND DISORDERS OF THE RESPIRATORY SYSTEM,1,Minor,Minor,Medical,Medicaid,,,,,true,12362.16,3781.1
New York City,Kings,7002053,001304,NYU Langone Hospital-Brooklyn,50 to 69,112,F,Other Race,Spanish/Hispanic,1,Emergency,Home or Self Care,2019,RSP009,ASTHMA,ADM021,"ADMINISTRATION OF THERAPEUTIC SUBSTANCES, NEC",141,ASTHMA,04,DISEASES AND DISORDERS OF THE RESPIRATORY SYSTEM,2,Moderate,Minor,Medical,Medicaid,,,,,true,31219.1,9075.92
New York City,Kings,7002053,001304,NYU Langone Hospital-Brooklyn,18 to 29,114,M,Black/African American,Not Span/Hispanic,1,Emergency,Home or Self Care,2019,RSP009,ASTHMA,,,141,ASTHMA,04,DISEASES AND DISORDERS OF THE RESPIRATORY SYSTEM,2,Moderate,Minor,Medical,Private Health Insurance,,,,,true,16346.19,4588.81
New York City,Kings,7002053,001304,NYU Langone Hospital-Brooklyn,0 to 17,112,M,Other Race,Not Span/Hispanic,2,Emergency,Home or Self Care,2019,RSP009,ASTHMA,ADM016,ADMINISTRATION OF ANTI-INFLAMMATORY AGENTS,141,ASTHMA,04,DISEASES AND DISORDERS OF THE RESPIRATORY SYSTEM,1,Minor,Minor,Medical,Medicaid,,,,,true,17087.26,5983.09
New York City,Kings,7002053,001304,NYU Langone Hospital-Brooklyn,0 to 17,112,M,White,Spanish/Hispanic,2,Emergency,Home or Self Care,2019,RSP009,ASTHMA,ADM021,"ADMINISTRATION OF THERAPEUTIC SUBSTANCES, NEC",141,ASTHMA,04,DISEASES AND DISORDERS OF THE RESPIRATORY SYSTEM,2,Moderate,Minor,Medical,Medicaid,,,,,true,21402.48,6475.18
New York City,Kings,7002053,001304,NYU Langone Hospital-Brooklyn,70 or Older,112,F,Other Race,Not Span/Hispanic,1,Emergency,Home w/ Home Health Services,2019,RSP009,ASTHMA,,,141,ASTHMA,04,DISEASES AND DISORDERS OF THE RESPIRATORY SYSTEM,3,Major,Moderate,Medical,Medicare,Medicaid,,,,true,29194.01,7967.27
New York City,Kings,7002053,001304,NYU Langone Hospital-Brooklyn,30 to 49,112,M,Black/African American,Not Span/Hispanic,1,Emergency,Home or Self Care,2019,RSP009,ASTHMA,ADM021,"ADMINISTRATION OF THERAPEUTIC SUBSTANCES, NEC",141,ASTHMA,04,DISEASES AND DISORDERS OF THE RESPIRATORY SYSTEM,3,Major,Major,Medical,Private Health Insurance,,,,,true,25896.1,6473.78