Hospital Service Area,Hospital County,Operating Certificate Number,Permanent Facility Id,Facility Name,Age Group,Zip Code - 3 digits,Gender,Race,Ethnicity,Length of Stay,Type of Admission,Patient Disposition,Discharge Year,CCS Diagnosis Code,CCS Diagnosis Description,CCS Procedure Code,CCS Procedure Description,APR DRG Code,APR DRG Description,APR MDC Code,APR MDC Description,APR Severity of Illness Code,APR Severity of Illness Description,APR Risk of Mortality,APR Medical Surgical Description,Payment Typology 1,Payment Typology 2,Payment Typology 3,Birth Weight,Abortion Edit Indicator,Emergency Department Indicator,Total Charges,Total Costs
Long Island,Nassau,2908000,000511,NYU Langone Hospital-Long Island,0 to 17,115,F,Other Race,Spanish/Hispanic,1,Emergency,Home or Self Care,2019,RSP009,ASTHMA,,,141,ASTHMA,04,DISEASES AND DISORDERS OF THE RESPIRATORY SYSTEM,1,Minor,Minor,Medical,Medicaid,Medicaid,,,,true,26466.41,3999.15
Long Island,Nassau,2908000,000511,NYU Langone Hospital-Long Island,0 to 17,115,F,White,Spanish/Hispanic,2,Emergency,Home or Self Care,2019,RSP009,ASTHMA,,,141,ASTHMA,04,DISEASES AND DISORDERS OF THE RESPIRATORY SYSTEM,2,Moderate,Minor,Medical,Medicaid,Medicaid,,,,true,33794.45,5614.18
Long Island,Nassau,2908000,000511,NYU Langone Hospital-Long Island,0 to 17,115,M,Other Race,Spanish/Hispanic,5,Emergency,Home or Self Care,2019,RSP009,ASTHMA,,,141,ASTHMA,04,DISEASES AND DISORDERS OF THE RESPIRATORY SYSTEM,1,Minor,Minor,Medical,Medicaid,Medicaid,,,,true,52162.52,10614.2
Long Island,Nassau,2908000,000511,NYU Langone Hospital-Long Island,50 to 69,115,M,Other Race,Spanish/Hispanic,5,Emergency,Home or Self Care,2019,RSP009,ASTHMA,,,141,ASTHMA,04,DISEASES AND DISORDERS OF THE RESPIRATORY SYSTEM,2,Moderate,Minor,Medical,Medicaid,Medicaid,,,,true,66956.11,11495.64
Long Island,Nassau,2908000,000511,NYU Langone Hospital-Long Island,50 to 69,115,F,Black/African American,Not Span/Hispanic,7,Emergency,Home w/ Home Health Services,2019,RSP009,ASTHMA,MAM005,MEASUREMENT DURING CARDIAC CATHETERIZATION,141,ASTHMA,04,DISEASES AND DISORDERS OF THE RESPIRATORY SYSTEM,3,Major,Moderate,Medical,Medicaid,Medicaid,,,,true,94870.81,17520.12
Long Island,Nassau,2908000,000511,NYU Langone Hospital-Long Island,0 to 17,115,M,Black/African American,Not Span/Hispanic,2,Emergency,Home w/ Home Health Services,2019,RSP009,ASTHMA,OTR004,ISOLATION PROCEDURES,141,ASTHMA,04,DISEASES AND DISORDERS OF THE RESPIRATORY SYSTEM,3,Major,Moderate,Medical,Private Health Insurance,,,,,true,48041.62,7947.14
Long Island,Nassau,2908000,000511,NYU Langone Hospital-Long Island,50 to 69,110,M,White,Not Span/Hispanic,3,Emergency,Home or Self Care,2019,RSP009,ASTHMA,,,141,ASTHMA,04,DISEASES AND DISORDERS OF THE RESPIRATORY SYSTEM,3,Major,Major,Medical,Private Health Insurance,,,,,true,53277.65,8600.1
Long Island,Nassau,2908000,000511,NYU Langone Hospital-Long Island,50 to 69,115,F,Black/African American,Not Span/Hispanic,6,Emergency,Home or Self Care,2019,RSP009,ASTHMA,ESA004,NON-INVASIVE VENTILATION,141,ASTHMA,04,DISEASES AND DISORDERS OF THE RESPIRATORY SYSTEM,3,Major,Moderate,Medical,Medicare,Medicare,Private Health Insurance,,,true,91134.59,15858.68
Long Island,Nassau,2908000,000511,NYU Langone Hospital-Long Island,0 to 17,115,M,White,Not Span/Hispanic,1,Emergency,Home or Self Care,2019,RSP009,ASTHMA,,,141,ASTHMA,04,DISEASES AND DISORDERS OF THE RESPIRATORY SYSTEM,1,Minor,Minor,Medical,Blue Cross/Blue Shield,,,,,true,25409.21,3788.01
Long Island,Nassau,2908000,000511,NYU Langone Hospital-Long Island,70 or Older,115,M,White,Not Span/Hispanic,12,Emergency,Expired,2019,RSP009,ASTHMA,CAR024,VENOUS AND ARTERIAL CATHETER PLACEMENT,141,ASTHMA,04,DISEASES AND DISORDERS OF THE RESPIRATORY SYSTEM,4,Extreme,Extreme,Medical,Medicare,Medicare,Blue Cross/Blue Shield,,,true,219069.19,36789.98
Long Island,Nassau,2908000,000511,NYU Langone Hospital-Long Island,0 to 17,115,F,Other Race,Spanish/Hispanic,1,Emergency,Home or Self Care,2019,RSP009,ASTHMA,,,141,ASTHMA,04,DISEASES AND DISORDERS OF THE RESPIRATORY SYSTEM,1,Minor,Minor,Medical,Medicaid,Medicaid,,,,true,20671.52,3229.19
Long Island,Nassau,2908000,000511,NYU Langone Hospital-Long Island,0 to 17,117,M,White,Not Span/Hispanic,2,Emergency,Home or Self Care,2019,RSP009,ASTHMA,,,141,ASTHMA,04,DISEASES AND DISORDERS OF THE RESPIRATORY SYSTEM,1,Minor,Minor,Medical,Private Health Insurance,,,,,true,37311.94,5986.43
Long Island,Nassau,2908000,000511,NYU Langone Hospital-Long Island,0 to 17,115,F,Black/African American,Not Span/Hispanic,1,Emergency,Home w/ Home Health Services,2019,RSP009,ASTHMA,,,141,ASTHMA,04,DISEASES AND DISORDERS OF THE RESPIRATORY SYSTEM,1,Minor,Minor,Medical,Medicaid,Medicaid,,,,true,23931.88,3552.11
Long Island,Nassau,2908000,000511,NYU Langone Hospital-Long Island,50 to 69,117,F,White,Spanish/Hispanic,4,Emergency,Home or Self Care,2019,RSP009,ASTHMA,,,141,ASTHMA,04,DISEASES AND DISORDERS OF THE RESPIRATORY SYSTEM,2,Moderate,Moderate,Medical,Private Health Insurance,,,,,true,41277.53,8476.93
Long Island,Nassau,2908000,000511,NYU Langone Hospital-Long Island,50 to 69,115,F,Black/African American,Not Span/Hispanic,4,Emergency,Home or Self Care,2019,RSP009,ASTHMA,,,141,ASTHMA,04,DISEASES AND DISORDERS OF THE RESPIRATORY SYSTEM,3,Major,Major,Medical,Medicaid,Medicaid,,,,true,57420.09,10054.27
Long Island,Nassau,2908000,000511,NYU Langone Hospital-Long Island,50 to 69,117,F,White,Not Span/Hispanic,13,Emergency,Home or Self Care,2019,RSP009,ASTHMA,,,141,ASTHMA,04,DISEASES AND DISORDERS OF THE RESPIRATORY SYSTEM,3,Major,Moderate,Medical,Medicare,Medicare,Medicaid,,,true,118956.65,25816.63
Long Island,Nassau,2908000,000511,NYU Langone Hospital-Long Island,50 to 69,113,M,Other Race,Not Span/Hispanic,2,Emergency,Home or Self Care,2019,RSP009,ASTHMA,,,141,ASTHMA,04,DISEASES AND DISORDERS OF THE RESPIRATORY SYSTEM,2,Moderate,Minor,Medical,Private Health Insurance,,,,,true,29430.5,4930.75
Long Island,Nassau,2908000,000511,NYU Langone Hospital-Long Island,0 to 17,115,M,Other Race,Spanish/Hispanic,2,Emergency,Home or Self Care,2019,RSP009,ASTHMA,,,141,ASTHMA,04,DISEASES AND DISORDERS OF THE RESPIRATORY SYSTEM,1,Minor,Minor,Medical,Medicaid,Medicaid,,,,true,28939.08,5079.37
Long Island,Nassau,2908000,000511,NYU Langone Hospital-Long Island,0 to 17,115,M,Black/African American,Not Span/Hispanic,1,Emergency,Home or Self Care,2019,RSP009,ASTHMA,,,141,ASTHMA,04,DISEASES AND DISORDERS OF THE RESPIRATORY SYSTEM,1,Minor,Minor,Medical,Self-Pay,,,,,true,23463.09,3453.99
Long Island,Nassau,2908000,000511,NYU Langone Hospital-Long Island,0 to 17,115,M,White,Not Span/Hispanic,4,Emergency,Home w/ Home Health Services,2019,RSP009,ASTHMA,,,141,ASTHMA,04,DISEASES AND DISORDERS OF THE RESPIRATORY SYSTEM,3,Major,Minor,Medical,Blue Cross/Blue Shield,,,,,true,54252.89,9839.95
Long Island,Nassau,2908000,000511,NYU Langone Hospital-Long Island,0 to 17,115,M,Black/African American,Not Span/Hispanic,1,Emergency,Home or Self Care,2019,RSP009,ASTHMA,OTR004,ISOLATION PROCEDURES,141,ASTHMA,04,DISEASES AND DISORDERS OF THE RESPIRATORY SYSTEM,1,Minor,Minor,Medical,Medicaid,,,,,true,24177.38,3656.46
Long Island,Nassau,2908000,000511,NYU Langone Hospital-Long Island,0 to 17,115,M,White,Spanish/Hispanic,2,Emergency,Home w/ Home Health Services,2019,RSP009,ASTHMA,OTR004,ISOLATION PROCEDURES,141,ASTHMA,04,DISEASES AND DISORDERS OF THE RESPIRATORY SYSTEM,1,Minor,Minor,Medical,Medicaid,Medicaid,,,,true,39084.73,6559.49
Long Island,Nassau,2908000,000511,NYU Langone Hospital-Long Island,30 to 49,110,F,Other Race,Spanish/Hispanic,5,Emergency,Home or Self Care,2019,RSP009,ASTHMA,MAM004,CARDIAC STRESS TESTS,141,ASTHMA,04,DISEASES AND DISORDERS OF THE RESPIRATORY SYSTEM,1,Minor,Minor,Medical,Blue Cross/Blue Shield,,,,,true,63713.12,13065.25
Long Island,Nassau,2908000,000511,NYU Langone Hospital-Long Island,0 to 17,113,F,Other Race,Spanish/Hispanic,2,Emergency,Home or Self Care,2019,RSP009,ASTHMA,ADM021,"ADMINISTRATION OF THERAPEUTIC SUBSTANCES, NEC",141,ASTHMA,04,DISEASES AND DISORDERS OF THE RESPIRATORY SYSTEM,1,Minor,Minor,Medical,Blue Cross/Blue Shield,,,,,true,33518.48,5655.99
Long Island,Nassau,2908000,000511,NYU Langone Hospital-Long Island,70 or Older,117,F,Black/African American,Not Span/Hispanic,2,Emergency,Home or Self Care,2019,RSP009,ASTHMA,,,141,ASTHMA,04,DISEASES AND DISORDERS OF THE RESPIRATORY SYSTEM,2,Moderate,Major,Medical,Medicare,Medicare,Medicaid,,,true,38050.73,6303.74
Long Island,Nassau,2908000,000511,NYU Langone Hospital-Long Island,0 to 17,115,M,Black/African American,Not Span/Hispanic,2,Emergency,Home or Self Care,2019,RSP009,ASTHMA,ADM021,"ADMINISTRATION OF THERAPEUTIC SUBSTANCES, NEC",141,ASTHMA,04,DISEASES AND DISORDERS OF THE RESPIRATORY SYSTEM,1,Minor,Minor,Medical,Private Health Insurance,,,,,true,35254.57,5874.49
Long Island,Nassau,2908000,000511,NYU Langone Hospital-Long Island,0 to 17,115,M,White,Not Span/Hispanic,1,Emergency,Home or Self Care,2019,RSP009,ASTHMA,,,141,ASTHMA,04,DISEASES AND DISORDERS OF THE RESPIRATORY SYSTEM,1,Minor,Minor,Medical,Blue Cross/Blue Shield,,,,,true,26527.65,3960.77
Long Island,Nassau,2908000,000511,NYU Langone Hospital-Long Island,30 to 49,117,F,White,Not Span/Hispanic,2,Emergency,Home or Self Care,2019,RSP009,ASTHMA,,,141,ASTHMA,04,DISEASES AND DISORDERS OF THE RESPIRATORY SYSTEM,2,Moderate,Moderate,Medical,Federal/State/Local/VA,,,,,true,31676.42,5445.67
Long Island,Nassau,2908000,000511,NYU Langone Hospital-Long Island,0 to 17,115,F,Black/African American,Not Span/Hispanic,2,Emergency,Home or Self Care,2019,RSP009,ASTHMA,,,141,ASTHMA,04,DISEASES AND DISORDERS OF THE RESPIRATORY SYSTEM,1,Minor,Minor,Medical,Medicaid,Medicaid,,,,true,32887.5,5622.85
Long Island,Nassau,2908000,000511,NYU Langone Hospital-Long Island,70 or Older,115,F,White,Not Span/Hispanic,7,Emergency,Home or Self Care,2019,RSP009,ASTHMA,,,141,ASTHMA,04,DISEASES AND DISORDERS OF THE RESPIRATORY SYSTEM,2,Moderate,Minor,Medical,Medicare,Medicare,Blue Cross/Blue Shield,,,true,79991.28,15786.59
Long Island,Nassau,2908000,000511,NYU Langone Hospital-Long Island,30 to 49,110,F,White,Spanish/Hispanic,2,Emergency,Home or Self Care,2019,RSP009,ASTHMA,,,141,ASTHMA,04,DISEASES AND DISORDERS OF THE RESPIRATORY SYSTEM,1,Minor,Minor,Medical,Private Health Insurance,,,,,true,28470.64,4941.14
Long Island,Nassau,2908000,000511,NYU Langone Hospital-Long Island,50 to 69,115,M,Black/African American,Not Span/Hispanic,6,Emergency,Home or Self Care,2019,RSP009,ASTHMA,,,141,ASTHMA,04,DISEASES AND DISORDERS OF THE RESPIRATORY SYSTEM,3,Major,Minor,Medical,Medicaid,Medicaid,,,,true,57541.08,12402.77
Long Island,Nassau,2908000,000511,NYU Langone Hospital-Long Island,18 to 29,110,F,White,Not Span/Hispanic,2,Emergency,Home or Self Care,2019,RSP009,ASTHMA,,,141,ASTHMA,04,DISEASES AND DISORDERS OF THE RESPIRATORY SYSTEM,2,Moderate,Minor,Medical,Medicaid,Medicaid,,,,true,32060.11,5307.72
Long Island,Nassau,2908000,000511,NYU Langone Hospital-Long Island,70 or Older,118,F,White,Not Span/Hispanic,6,Emergency,Home or Self Care,2019,RSP009,ASTHMA,RES005,CHEST TUBE PLACEMENT AND THERAPEUTIC THORACENTESIS,141,ASTHMA,04,DISEASES AND DISORDERS OF THE RESPIRATORY SYSTEM,3,Major,Moderate,Medical,Medicare,Medicare,,,,true,101833.07,15710.75
Long Island,Nassau,2908000,000511,NYU Langone Hospital-Long Island,0 to 17,110,M,Black/African American,Not Span/Hispanic,2,Emergency,Home or Self Care,2019,RSP009,ASTHMA,,,141,ASTHMA,04,DISEASES AND DISORDERS OF THE RESPIRATORY SYSTEM,1,Minor,Minor,Medical,Medicaid,,,,,true,40971.33,6720.8
Long Island,Nassau,2908000,000511,NYU Langone Hospital-Long Island,0 to 17,115,M,Black/African American,Not Span/Hispanic,2,Emergency,Home or Self Care,2019,RSP009,ASTHMA,OTR004,ISOLATION PROCEDURES,141,ASTHMA,04,DISEASES AND DISORDERS OF THE RESPIRATORY SYSTEM,1,Minor,Minor,Medical,Medicaid,Medicaid,,,,true,32769.02,5576.12
Long Island,Nassau,2908000,000511,NYU Langone Hospital-Long Island,50 to 69,115,F,Black/African American,Not Span/Hispanic,3,Emergency,Home or Self Care,2019,RSP009,ASTHMA,ESA004,NON-INVASIVE VENTILATION,141,ASTHMA,04,DISEASES AND DISORDERS OF THE RESPIRATORY SYSTEM,2,Moderate,Minor,Medical,Medicaid,Medicaid,,,,true,51714.6,8536.91
Long Island,Nassau,2908000,000511,NYU Langone Hospital-Long Island,0 to 17,117,F,White,Not Span/Hispanic,2,Emergency,Home or Self Care,2019,RSP009,ASTHMA,,,141,ASTHMA,04,DISEASES AND DISORDERS OF THE RESPIRATORY SYSTEM,2,Moderate,Moderate,Medical,Blue Cross/Blue Shield,,,,,true,34512.83,5751.03
Long Island,Nassau,2908000,000511,NYU Langone Hospital-Long Island,30 to 49,115,M,Black/African American,Not Span/Hispanic,1,Emergency,Home or Self Care,2019,RSP009,ASTHMA,,,141,ASTHMA,04,DISEASES AND DISORDERS OF THE RESPIRATORY SYSTEM,2,Moderate,Minor,Medical,Medicaid,,,,,true,22404.25,3672.28
Long Island,Nassau,2908000,000511,NYU Langone Hospital-Long Island,0 to 17,115,M,White,Spanish/Hispanic,1,Emergency,Home or Self Care,2019,RSP009,ASTHMA,,,141,ASTHMA,04,DISEASES AND DISORDERS OF THE RESPIRATORY SYSTEM,1,Minor,Minor,Medical,Medicaid,,,,,false,9288.62,2043.57
Long Island,Nassau,2908000,000511,NYU Langone Hospital-Long Island,0 to 17,115,F,Black/African American,Not Span/Hispanic,1,Emergency,Home or Self Care,2019,RSP009,ASTHMA,,,141,ASTHMA,04,DISEASES AND DISORDERS OF THE RESPIRATORY SYSTEM,1,Minor,Minor,Medical,Medicaid,Medicaid,,,,true,31903.15,4636.69
Long Island,Nassau,2908000,000511,NYU Langone Hospital-Long Island,70 or Older,117,F,White,Not Span/Hispanic,4,Emergency,Home or Self Care,2019,RSP009,ASTHMA,,,141,ASTHMA,04,DISEASES AND DISORDERS OF THE RESPIRATORY SYSTEM,2,Moderate,Minor,Medical,Medicare,Medicare,,,,true,52098.86,9584.15
Long Island,Nassau,2908000,000511,NYU Langone Hospital-Long Island,18 to 29,115,M,Black/African American,Not Span/Hispanic,1,Emergency,Home w/ Home Health Services,2019,RSP009,ASTHMA,,,141,ASTHMA,04,DISEASES AND DISORDERS OF THE RESPIRATORY SYSTEM,1,Minor,Minor,Medical,Blue Cross/Blue Shield,,,,,true,26159.63,3771.61
Long Island,Nassau,2908000,000511,NYU Langone Hospital-Long Island,50 to 69,115,F,Black/African American,Not Span/Hispanic,3,Emergency,Home or Self Care,2019,RSP009,ASTHMA,,,141,ASTHMA,04,DISEASES AND DISORDERS OF THE RESPIRATORY SYSTEM,1,Minor,Minor,Medical,Medicaid,Medicaid,,,,true,34490.56,6832.34
Long Island,Nassau,2908000,000511,NYU Langone Hospital-Long Island,0 to 17,117,F,White,Not Span/Hispanic,5,Emergency,Home w/ Home Health Services,2019,RSP009,ASTHMA,RES001,BRONCHOSCOPY (DIAGNOSTIC),141,ASTHMA,04,DISEASES AND DISORDERS OF THE RESPIRATORY SYSTEM,2,Moderate,Minor,Medical,Private Health Insurance,,,,,true,87908.23,13804.77
Long Island,Nassau,2908000,000511,NYU Langone Hospital-Long Island,50 to 69,115,F,Black/African American,Not Span/Hispanic,4,Emergency,Home or Self Care,2019,RSP009,ASTHMA,,,141,ASTHMA,04,DISEASES AND DISORDERS OF THE RESPIRATORY SYSTEM,2,Moderate,Minor,Medical,Blue Cross/Blue Shield,Medicare,,,,true,61225.69,10621.56
Long Island,Nassau,2908000,000511,NYU Langone Hospital-Long Island,0 to 17,115,F,Other Race,Spanish/Hispanic,2,Emergency,Home w/ Home Health Services,2019,RSP009,ASTHMA,,,141,ASTHMA,04,DISEASES AND DISORDERS OF THE RESPIRATORY SYSTEM,1,Minor,Minor,Medical,Medicaid,,,,,true,38587.6,6246.01
Long Island,Nassau,2908000,000511,NYU Langone Hospital-Long Island,50 to 69,110,F,White,Not Span/Hispanic,3,Emergency,Home or Self Care,2019,RSP009,ASTHMA,OTR004,ISOLATION PROCEDURES,141,ASTHMA,04,DISEASES AND DISORDERS OF THE RESPIRATORY SYSTEM,3,Major,Extreme,Medical,Blue Cross/Blue Shield,Medicare,,,,true,51526.36,8316.55
Long Island,Nassau,2908000,000511,NYU Langone Hospital-Long Island,0 to 17,115,M,Other Race,Spanish/Hispanic,3,Emergency,Home w/ Home Health Services,2019,RSP009,ASTHMA,OTR004,ISOLATION PROCEDURES,141,ASTHMA,04,DISEASES AND DISORDERS OF THE RESPIRATORY SYSTEM,1,Minor,Minor,Medical,Medicaid,,,,,true,41623.14,7528.59
Long Island,Nassau,2908000,000511,NYU Langone Hospital-Long Island,0 to 17,115,M,White,Spanish/Hispanic,5,Urgent,Home or Self Care,2019,RSP009,ASTHMA,OTR004,ISOLATION PROCEDURES,141,ASTHMA,04,DISEASES AND DISORDERS OF THE RESPIRATORY SYSTEM,1,Minor,Minor,Medical,Medicaid,,,,,false,46229.5,9925.43
Long Island,Nassau,2908000,000511,NYU Langone Hospital-Long Island,0 to 17,115,M,White,Spanish/Hispanic,2,Emergency,Home w/ Home Health Services,2019,RSP009,ASTHMA,,,141,ASTHMA,04,DISEASES AND DISORDERS OF THE RESPIRATORY SYSTEM,1,Minor,Minor,Medical,Medicaid,Medicaid,,,,true,36673.83,6580.93
Long Island,Nassau,2908000,000511,NYU Langone Hospital-Long Island,0 to 17,115,M,Black/African American,Not Span/Hispanic,2,Emergency,Home w/ Home Health Services,2019,RSP009,ASTHMA,OTR004,ISOLATION PROCEDURES,141,ASTHMA,04,DISEASES AND DISORDERS OF THE RESPIRATORY SYSTEM,2,Moderate,Minor,Medical,Blue Cross/Blue Shield,Medicaid,,,,true,25920.47,4930.95
Long Island,Nassau,2908000,000511,NYU Langone Hospital-Long Island,70 or Older,115,F,Other Race,Spanish/Hispanic,3,Emergency,Home w/ Home Health Services,2019,RSP009,ASTHMA,,,141,ASTHMA,04,DISEASES AND DISORDERS OF THE RESPIRATORY SYSTEM,2,Moderate,Moderate,Medical,Medicare,Medicare,Medicaid,,,true,46397.3,7908.39
Long Island,Nassau,2908000,000511,NYU Langone Hospital-Long Island,0 to 17,115,M,White,Not Span/Hispanic,3,Emergency,Home w/ Home Health Services,2019,RSP009,ASTHMA,OTR004,ISOLATION PROCEDURES,141,ASTHMA,04,DISEASES AND DISORDERS OF THE RESPIRATORY SYSTEM,1,Minor,Minor,Medical,Private Health Insurance,,,,,true,47002.05,8159.32
Long Island,Nassau,2908000,000511,NYU Langone Hospital-Long Island,30 to 49,115,F,White,Not Span/Hispanic,3,Emergency,Home or Self Care,2019,RSP009,ASTHMA,OTR004,ISOLATION PROCEDURES,141,ASTHMA,04,DISEASES AND DISORDERS OF THE RESPIRATORY SYSTEM,2,Moderate,Moderate,Medical,Private Health Insurance,,,,,true,44692.81,7647.49
Long Island,Nassau,2908000,000511,NYU Langone Hospital-Long Island,50 to 69,115,F,White,Not Span/Hispanic,7,Emergency,Home or Self Care,2019,RSP009,ASTHMA,,,141,ASTHMA,04,DISEASES AND DISORDERS OF THE RESPIRATORY SYSTEM,1,Minor,Minor,Medical,Blue Cross/Blue Shield,Medicare,,,,true,76124.08,15210.16
Long Island,Nassau,2908000,000511,NYU Langone Hospital-Long Island,18 to 29,117,F,White,Spanish/Hispanic,2,Emergency,Home or Self Care,2019,RSP009,ASTHMA,,,141,ASTHMA,04,DISEASES AND DISORDERS OF THE RESPIRATORY SYSTEM,2,Moderate,Minor,Medical,Medicaid,Medicaid,,,,true,48075.35,7172.46
Long Island,Nassau,2908000,000511,NYU Langone Hospital-Long Island,0 to 17,113,M,Black/African American,Not Span/Hispanic,2,Emergency,Home w/ Home Health Services,2019,RSP009,ASTHMA,,,141,ASTHMA,04,DISEASES AND DISORDERS OF THE RESPIRATORY SYSTEM,1,Minor,Minor,Medical,Blue Cross/Blue Shield,,,,,true,27315.04,4870.95
Long Island,Nassau,2908000,000511,NYU Langone Hospital-Long Island,0 to 17,117,M,Black/African American,Not Span/Hispanic,1,Emergency,Home or Self Care,2019,RSP009,ASTHMA,OTR004,ISOLATION PROCEDURES,141,ASTHMA,04,DISEASES AND DISORDERS OF THE RESPIRATORY SYSTEM,2,Moderate,Minor,Medical,Private Health Insurance,,,,,true,28839.71,4401.3
Long Island,Nassau,2908000,000511,NYU Langone Hospital-Long Island,0 to 17,117,F,White,Not Span/Hispanic,1,Emergency,Home or Self Care,2019,RSP009,ASTHMA,,,141,ASTHMA,04,DISEASES AND DISORDERS OF THE RESPIRATORY SYSTEM,1,Minor,Minor,Medical,Blue Cross/Blue Shield,,,,,true,15521.45,2772.7
Long Island,Nassau,2908000,000511,NYU Langone Hospital-Long Island,0 to 17,115,F,Black/African American,Not Span/Hispanic,1,Emergency,Home w/ Home Health Services,2019,RSP009,ASTHMA,,,141,ASTHMA,04,DISEASES AND DISORDERS OF THE RESPIRATORY SYSTEM,1,Minor,Minor,Medical,Medicaid,Medicaid,,,,true,14081.44,2566.73
Long Island,Nassau,2908000,000511,NYU Langone Hospital-Long Island,30 to 49,117,F,White,Not Span/Hispanic,6,Emergency,Home or Self Care,2019,RSP009,ASTHMA,,,141,ASTHMA,04,DISEASES AND DISORDERS OF THE RESPIRATORY SYSTEM,2,Moderate,Minor,Medical,Medicare,Medicare,Private Health Insurance,,,true,63784.49,13187.96
Long Island,Nassau,2908000,000511,NYU Langone Hospital-Long Island,0 to 17,115,M,Black/African American,Not Span/Hispanic,1,Emergency,Home or Self Care,2019,RSP009,ASTHMA,,,141,ASTHMA,04,DISEASES AND DISORDERS OF THE RESPIRATORY SYSTEM,1,Minor,Minor,Medical,Blue Cross/Blue Shield,,,,,true,25406.96,3758
Long Island,Nassau,2908000,000511,NYU Langone Hospital-Long Island,0 to 17,115,F,Black/African American,Not Span/Hispanic,2,Emergency,Home or Self Care,2019,RSP009,ASTHMA,,,141,ASTHMA,04,DISEASES AND DISORDERS OF THE RESPIRATORY SYSTEM,1,Minor,Minor,Medical,Medicaid,Medicaid,,,,true,30290.98,5267.25
Long Island,Nassau,2908000,000511,NYU Langone Hospital-Long Island,0 to 17,115,M,Other Race,Not Span/Hispanic,1,Emergency,Home or Self Care,2019,RSP009,ASTHMA,,,141,ASTHMA,04,DISEASES AND DISORDERS OF THE RESPIRATORY SYSTEM,1,Minor,Minor,Medical,Blue Cross/Blue Shield,,,,,true,22135.62,3248.99
Long Island,Nassau,2908000,000511,NYU Langone Hospital-Long Island,0 to 17,117,M,White,Not Span/Hispanic,1,Emergency,Home w/ Home Health Services,2019,RSP009,ASTHMA,ADM021,"ADMINISTRATION OF THERAPEUTIC SUBSTANCES, NEC",141,ASTHMA,04,DISEASES AND DISORDERS OF THE RESPIRATORY SYSTEM,2,Moderate,Minor,Medical,Private Health Insurance,,,,,true,20596.79,3110.83
Long Island,Nassau,2908000,000511,NYU Langone Hospital-Long Island,0 to 17,115,F,Black/African American,Not Span/Hispanic,2,Emergency,Home or Self Care,2019,RSP009,ASTHMA,OTR004,ISOLATION PROCEDURES,141,ASTHMA,04,DISEASES AND DISORDERS OF THE RESPIRATORY SYSTEM,2,Moderate,Minor,Medical,Private Health Insurance,,,,,true,35167.98,5778.13
Long Island,Nassau,2908000,000511,NYU Langone Hospital-Long Island,50 to 69,115,F,Black/African American,Not Span/Hispanic,27,Emergency,Home w/ Home Health Services,2019,RSP009,ASTHMA,GIS004,GI SYSTEM ENDOSCOPY WITHOUT BIOPSY (DIAGNOSTIC),141,ASTHMA,04,DISEASES AND DISORDERS OF THE RESPIRATORY SYSTEM,3,Major,Moderate,Medical,Private Health Insurance,Medicare,Medicare,,,true,263514.9,56199.66
Long Island,Nassau,2908000,000511,NYU Langone Hospital-Long Island,0 to 17,117,M,Black/African American,Not Span/Hispanic,2,Emergency,Home or Self Care,2019,RSP009,ASTHMA,OTR004,ISOLATION PROCEDURES,141,ASTHMA,04,DISEASES AND DISORDERS OF THE RESPIRATORY SYSTEM,1,Minor,Minor,Medical,Blue Cross/Blue Shield,,,,,true,31373.05,5451.73
Long Island,Nassau,2908000,000511,NYU Langone Hospital-Long Island,0 to 17,115,M,White,Not Span/Hispanic,2,Emergency,Home or Self Care,2019,RSP009,ASTHMA,,,141,ASTHMA,04,DISEASES AND DISORDERS OF THE RESPIRATORY SYSTEM,2,Moderate,Minor,Medical,Blue Cross/Blue Shield,,,,,true,30828.57,5459.71
Long Island,Nassau,2908000,000511,NYU Langone Hospital-Long Island,0 to 17,115,F,Black/African American,Not Span/Hispanic,3,Emergency,Home or Self Care,2019,RSP009,ASTHMA,,,141,ASTHMA,04,DISEASES AND DISORDERS OF THE RESPIRATORY SYSTEM,1,Minor,Minor,Medical,Medicaid,Medicaid,,,,true,39024.12,7107.26
Long Island,Nassau,2908000,000511,NYU Langone Hospital-Long Island,50 to 69,113,F,Other Race,Spanish/Hispanic,3,Emergency,Home or Self Care,2019,RSP009,ASTHMA,ESA004,NON-INVASIVE VENTILATION,141,ASTHMA,04,DISEASES AND DISORDERS OF THE RESPIRATORY SYSTEM,3,Major,Major,Medical,Blue Cross/Blue Shield,,,,,true,50590.96,8607.76
Long Island,Nassau,2908000,000511,NYU Langone Hospital-Long Island,0 to 17,115,M,White,Spanish/Hispanic,2,Emergency,Home w/ Home Health Services,2019,RSP009,ASTHMA,OTR004,ISOLATION PROCEDURES,141,ASTHMA,04,DISEASES AND DISORDERS OF THE RESPIRATORY SYSTEM,2,Moderate,Minor,Medical,Medicaid,Medicaid,,,,true,41780.64,6262.52
Long Island,Nassau,2908000,000511,NYU Langone Hospital-Long Island,50 to 69,117,F,White,Not Span/Hispanic,5,Emergency,Home w/ Home Health Services,2019,RSP009,ASTHMA,GIS004,GI SYSTEM ENDOSCOPY WITHOUT BIOPSY (DIAGNOSTIC),141,ASTHMA,04,DISEASES AND DISORDERS OF THE RESPIRATORY SYSTEM,3,Major,Minor,Medical,Medicaid,Medicaid,,,,true,92128.44,14468.83