Hospital Service Area,Hospital County,Operating Certificate Number,Permanent Facility Id,Facility Name,Age Group,Zip Code - 3 digits,Gender,Race,Ethnicity,Length of Stay,Type of Admission,Patient Disposition,Discharge Year,CCS Diagnosis Code,CCS Diagnosis Description,CCS Procedure Code,CCS Procedure Description,APR DRG Code,APR DRG Description,APR MDC Code,APR MDC Description,APR Severity of Illness Code,APR Severity of Illness Description,APR Risk of Mortality,APR Medical Surgical Description,Payment Typology 1,Payment Typology 2,Payment Typology 3,Birth Weight,Abortion Edit Indicator,Emergency Department Indicator,Total Charges,Total Costs
New York City,Manhattan,7002001,001438,Bellevue Hospital Center,30 to 49,113,M,Other Race,Not Span/Hispanic,12,Emergency,Home or Self Care,2017,057,Immunity disorders,041,OT NON-OR THER PRC RESP,142,Interstitial & alveolar lung diseases,04,Diseases and Disorders of the Respiratory System,2,Moderate,Moderate,Medical,Self-Pay,,,,N,Y,75512.76,48686.70
New York City,Manhattan,7002001,001438,Bellevue Hospital Center,50 to 69,100,M,Other Race,Not Span/Hispanic,3,Emergency,Left Against Medical Advice,2017,057,Immunity disorders,041,OT NON-OR THER PRC RESP,142,Interstitial & alveolar lung diseases,04,Diseases and Disorders of the Respiratory System,2,Moderate,Minor,Medical,Self-Pay,,,,N,Y,22753.28,14670.13
New York City,Manhattan,7002001,001438,Bellevue Hospital Center,30 to 49,100,F,Other Race,Not Span/Hispanic,3,Emergency,Home or Self Care,2017,057,Immunity disorders,041,OT NON-OR THER PRC RESP,142,Interstitial & alveolar lung diseases,04,Diseases and Disorders of the Respiratory System,1,Minor,Minor,Medical,Self-Pay,,,,N,Y,21890.44,14113.82
New York City,Manhattan,7002001,001438,Bellevue Hospital Center,30 to 49,113,M,Other Race,Not Span/Hispanic,13,Emergency,Home or Self Care,2017,057,Immunity disorders,000,NO PROC,142,Interstitial & alveolar lung diseases,04,Diseases and Disorders of the Respiratory System,2,Moderate,Moderate,Medical,Medicaid,,,,N,Y,70821.72,45662.16
New York City,Manhattan,7002001,001438,Bellevue Hospital Center,50 to 69,112,F,Other Race,Not Span/Hispanic,1,Emergency,Home or Self Care,2017,132,Lung disease due to external agents,179,CT SCAN ABDOMEN,142,Interstitial & alveolar lung diseases,04,Diseases and Disorders of the Respiratory System,2,Moderate,Moderate,Medical,"Managed Care, Unspecified",Medicaid,,,N,Y,8175.70,5271.27
New York City,Manhattan,7002001,001438,Bellevue Hospital Center,50 to 69,112,F,Other Race,Not Span/Hispanic,7,Emergency,Home or Self Care,2017,133,Other lower respiratory disease,180,OTHER CT SCAN,142,Interstitial & alveolar lung diseases,04,Diseases and Disorders of the Respiratory System,3,Major,Major,Medical,Medicaid,Medicaid,,,N,Y,39347.06,25368.94
New York City,Manhattan,7002001,001438,Bellevue Hospital Center,30 to 49,112,F,Black/African American,Not Span/Hispanic,12,Emergency,Home w/ Home Health Services,2017,057,Immunity disorders,198,MAG RESONANCE IMAGING,142,Interstitial & alveolar lung diseases,04,Diseases and Disorders of the Respiratory System,2,Moderate,Minor,Medical,Medicaid,,,,N,Y,71771.83,46274.74
New York City,Manhattan,7002001,001438,Bellevue Hospital Center,50 to 69,100,M,White,Not Span/Hispanic,6,Emergency,Expired,2017,133,Other lower respiratory disease,219,ALCO/DRUG REHAB/DETOX,142,Interstitial & alveolar lung diseases,04,Diseases and Disorders of the Respiratory System,4,Extreme,Major,Medical,Medicaid,,,,N,Y,47064.93,30345.02
New York City,Manhattan,7002001,001438,Bellevue Hospital Center,50 to 69,111,M,Other Race,Not Span/Hispanic,6,Emergency,Home or Self Care,2017,132,Lung disease due to external agents,231,OTHER THERAPEUTIC PRCS,142,Interstitial & alveolar lung diseases,04,Diseases and Disorders of the Respiratory System,1,Minor,Minor,Medical,Medicaid,Medicaid,,,N,Y,35471.81,22870.38
New York City,Manhattan,7002001,001438,Bellevue Hospital Center,50 to 69,100,M,Black/African American,Not Span/Hispanic,8,Emergency,Home w/ Home Health Services,2017,133,Other lower respiratory disease,180,OTHER CT SCAN,142,Interstitial & alveolar lung diseases,04,Diseases and Disorders of the Respiratory System,2,Moderate,Moderate,Medical,Medicaid,,,,N,Y,48708.68,31404.82
New York City,Manhattan,7002001,001438,Bellevue Hospital Center,50 to 69,100,F,Black/African American,Not Span/Hispanic,7,Emergency,Home or Self Care,2017,133,Other lower respiratory disease,047,DX CARDIAC CATHETERIZTN,142,Interstitial & alveolar lung diseases,04,Diseases and Disorders of the Respiratory System,3,Major,Moderate,Medical,Medicare,Medicare,Medicaid,,N,Y,43388.76,27974.82
New York City,Manhattan,7002001,001438,Bellevue Hospital Center,30 to 49,100,M,Black/African American,Not Span/Hispanic,7,Emergency,Psychiatric Hospital or Unit of Hosp,2017,057,Immunity disorders,180,OTHER CT SCAN,142,Interstitial & alveolar lung diseases,04,Diseases and Disorders of the Respiratory System,1,Minor,Minor,Medical,"Managed Care, Unspecified",Medicaid,,,N,Y,40722.37,26255.67
New York City,Manhattan,7002001,001438,Bellevue Hospital Center,70 or Older,104,M,Black/African American,Not Span/Hispanic,1,Emergency,Home or Self Care,2017,133,Other lower respiratory disease,041,OT NON-OR THER PRC RESP,142,Interstitial & alveolar lung diseases,04,Diseases and Disorders of the Respiratory System,3,Major,Moderate,Medical,Medicare,Medicare,Medicaid,,N,Y,11933.98,7694.41
New York City,Manhattan,7002001,001438,Bellevue Hospital Center,50 to 69,113,M,Other Race,Not Span/Hispanic,7,Emergency,Home or Self Care,2017,133,Other lower respiratory disease,180,OTHER CT SCAN,142,Interstitial & alveolar lung diseases,04,Diseases and Disorders of the Respiratory System,3,Major,Moderate,Medical,Medicaid,Medicaid,,,N,N,40652.50,26210.62
New York City,Manhattan,7002001,001438,Bellevue Hospital Center,70 or Older,112,F,Other Race,Not Span/Hispanic,1,Emergency,Home or Self Care,2017,133,Other lower respiratory disease,180,OTHER CT SCAN,142,Interstitial & alveolar lung diseases,04,Diseases and Disorders of the Respiratory System,1,Minor,Moderate,Medical,Medicaid,,,,N,Y,10674.46,6882.34
New York City,Manhattan,7002001,001438,Bellevue Hospital Center,30 to 49,104,M,Black/African American,Not Span/Hispanic,4,Emergency,Home or Self Care,2017,133,Other lower respiratory disease,041,OT NON-OR THER PRC RESP,142,Interstitial & alveolar lung diseases,04,Diseases and Disorders of the Respiratory System,3,Major,Moderate,Medical,Medicaid,Medicaid,,,N,Y,25204.94,16250.83
New York City,Manhattan,7002001,001438,Bellevue Hospital Center,50 to 69,100,M,Black/African American,Not Span/Hispanic,23,Emergency,Skilled Nursing Home,2017,133,Other lower respiratory disease,041,OT NON-OR THER PRC RESP,142,Interstitial & alveolar lung diseases,04,Diseases and Disorders of the Respiratory System,3,Major,Moderate,Medical,Medicaid,Medicaid,,,N,Y,113294.38,73046.32
New York City,Manhattan,7002001,001438,Bellevue Hospital Center,30 to 49,112,M,Other Race,Not Span/Hispanic,16,Emergency,Home w/ Home Health Services,2017,133,Other lower respiratory disease,231,OTHER THERAPEUTIC PRCS,142,Interstitial & alveolar lung diseases,04,Diseases and Disorders of the Respiratory System,3,Major,Major,Medical,Medicaid,Medicaid,,,N,Y,86212.92,55585.61
New York City,Manhattan,7002001,001438,Bellevue Hospital Center,50 to 69,100,F,White,Not Span/Hispanic,7,Emergency,Home or Self Care,2017,133,Other lower respiratory disease,037,DX BRONCHOSCOPY & BIOPS,142,Interstitial & alveolar lung diseases,04,Diseases and Disorders of the Respiratory System,3,Major,Extreme,Medical,Blue Cross/Blue Shield,Medicare,,,N,Y,42872.33,27641.85
New York City,Manhattan,7002001,001438,Bellevue Hospital Center,70 or Older,100,M,Other Race,Not Span/Hispanic,3,Emergency,Home or Self Care,2017,057,Immunity disorders,180,OTHER CT SCAN,142,Interstitial & alveolar lung diseases,04,Diseases and Disorders of the Respiratory System,2,Moderate,Minor,Medical,Medicare,Medicare,Medicaid,,N,Y,19556.35,12608.92
New York City,Manhattan,7002001,001438,Bellevue Hospital Center,30 to 49,100,M,White,Not Span/Hispanic,3,Emergency,Home or Self Care,2017,132,Lung disease due to external agents,041,OT NON-OR THER PRC RESP,142,Interstitial & alveolar lung diseases,04,Diseases and Disorders of the Respiratory System,3,Major,Moderate,Medical,Medicaid,,,,N,Y,18197.93,11733.08
New York City,Manhattan,7002001,001438,Bellevue Hospital Center,30 to 49,100,M,Other Race,Not Span/Hispanic,16,Emergency,Home or Self Care,2017,057,Immunity disorders,037,DX BRONCHOSCOPY & BIOPS,142,Interstitial & alveolar lung diseases,04,Diseases and Disorders of the Respiratory System,1,Minor,Minor,Medical,Medicaid,Medicaid,,,N,Y,82543.54,53219.78
New York City,Manhattan,7002001,001438,Bellevue Hospital Center,50 to 69,100,M,White,Not Span/Hispanic,1,Emergency,Home w/ Home Health Services,2017,133,Other lower respiratory disease,231,OTHER THERAPEUTIC PRCS,142,Interstitial & alveolar lung diseases,04,Diseases and Disorders of the Respiratory System,2,Moderate,Minor,Medical,Medicare,Medicare,,,N,Y,8740.44,5635.38
New York City,Manhattan,7002001,001438,Bellevue Hospital Center,50 to 69,100,F,Other Race,Spanish/Hispanic,10,Emergency,Home or Self Care,2017,132,Lung disease due to external agents,000,NO PROC,142,Interstitial & alveolar lung diseases,04,Diseases and Disorders of the Respiratory System,2,Moderate,Minor,Medical,Medicare,Private Health Insurance,,,N,Y,56656.34,36529.06
New York City,Manhattan,7002001,001438,Bellevue Hospital Center,50 to 69,112,M,Other Race,Spanish/Hispanic,3,Emergency,Home or Self Care,2017,133,Other lower respiratory disease,196,DX ULTRASOUND AB/RETRO,142,Interstitial & alveolar lung diseases,04,Diseases and Disorders of the Respiratory System,1,Minor,Moderate,Medical,Medicaid,Medicaid,,,N,Y,26372.40,17003.55
New York City,Manhattan,7002001,001438,Bellevue Hospital Center,70 or Older,104,M,Black/African American,Not Span/Hispanic,8,Emergency,Home w/ Home Health Services,2017,133,Other lower respiratory disease,193,DX ULTRASOUND HEART,142,Interstitial & alveolar lung diseases,04,Diseases and Disorders of the Respiratory System,3,Major,Major,Medical,Medicare,Medicare,Medicaid,,N,Y,50228.75,32384.89
New York City,Manhattan,7002001,001438,Bellevue Hospital Center,50 to 69,119,M,White,Not Span/Hispanic,2,Emergency,Home or Self Care,2017,133,Other lower respiratory disease,000,NO PROC,142,Interstitial & alveolar lung diseases,04,Diseases and Disorders of the Respiratory System,1,Minor,Moderate,Medical,Private Health Insurance,,,,N,N,19419.70,12520.81
New York City,Manhattan,7002001,001438,Bellevue Hospital Center,30 to 49,113,M,Black/African American,Not Span/Hispanic,7,Emergency,Home or Self Care,2017,057,Immunity disorders,000,NO PROC,142,Interstitial & alveolar lung diseases,04,Diseases and Disorders of the Respiratory System,1,Minor,Minor,Medical,Private Health Insurance,Medicaid,,,N,Y,43934.65,28326.78
