Hospital Service Area,Hospital County,Operating Certificate Number,Permanent Facility Id,Facility Name,Age Group,Zip Code - 3 digits,Gender,Race,Ethnicity,Length of Stay,Type of Admission,Patient Disposition,Discharge Year,CCS Diagnosis Code,CCS Diagnosis Description,CCS Procedure Code,CCS Procedure Description,APR DRG Code,APR DRG Description,APR MDC Code,APR MDC Description,APR Severity of Illness Code,APR Severity of Illness Description,APR Risk of Mortality,APR Medical Surgical Description,Payment Typology 1,Payment Typology 2,Payment Typology 3,Birth Weight,Abortion Edit Indicator,Emergency Department Indicator,Total Charges,Total Costs
New York City,Manhattan,7002001,001438,Bellevue Hospital Center,50 to 69,113,M,Black/African American,Not Span/Hispanic,1,Emergency,Home or Self Care,2019,RSP016,OTHER SPECIFIED AND UNSPECIFIED LOWER RESPIRATORY DISEASE,RES002,"LUNG, PLEURA, OR DIAPHRAGM BIOPSY (NON-ENDOSCOPIC)",142,INTERSTITIAL & ALVEOLAR LUNG DISEASES,04,DISEASES AND DISORDERS OF THE RESPIRATORY SYSTEM,2,Moderate,Moderate,Medical,Medicaid,,,,,false,6621.58,4400.7
New York City,Manhattan,7002001,001438,Bellevue Hospital Center,70 or Older,100,F,Other Race,Not Span/Hispanic,4,Emergency,Home or Self Care,2019,RSP013,LUNG DISEASE DUE TO EXTERNAL AGENTS,IMG006,COMPUTERIZED TOMOGRAPHY (CT) WITH CONTRAST,142,INTERSTITIAL & ALVEOLAR LUNG DISEASES,04,DISEASES AND DISORDERS OF THE RESPIRATORY SYSTEM,3,Major,Major,Medical,Medicare,Medicare,Blue Cross/Blue Shield,,,true,29769.75,19784.98
New York City,Manhattan,7002001,001438,Bellevue Hospital Center,70 or Older,100,F,Other Race,Not Span/Hispanic,1,Emergency,Home or Self Care,2019,RSP016,OTHER SPECIFIED AND UNSPECIFIED LOWER RESPIRATORY DISEASE,IMG006,COMPUTERIZED TOMOGRAPHY (CT) WITH CONTRAST,142,INTERSTITIAL & ALVEOLAR LUNG DISEASES,04,DISEASES AND DISORDERS OF THE RESPIRATORY SYSTEM,2,Moderate,Moderate,Medical,Medicare,Medicare,Blue Cross/Blue Shield,,,true,8227.76,5468.17
New York City,Manhattan,7002001,001438,Bellevue Hospital Center,70 or Older,100,F,Other Race,Not Span/Hispanic,3,Emergency,Home or Self Care,2019,RSP013,LUNG DISEASE DUE TO EXTERNAL AGENTS,ADM016,ADMINISTRATION OF ANTI-INFLAMMATORY AGENTS,142,INTERSTITIAL & ALVEOLAR LUNG DISEASES,04,DISEASES AND DISORDERS OF THE RESPIRATORY SYSTEM,2,Moderate,Moderate,Medical,Medicare,Medicare,,,,true,21151.04,14056.98
New York City,Manhattan,7002001,001438,Bellevue Hospital Center,50 to 69,111,F,Other Race,Not Span/Hispanic,2,Elective,Home or Self Care,2019,RSP016,OTHER SPECIFIED AND UNSPECIFIED LOWER RESPIRATORY DISEASE,RES001,BRONCHOSCOPY (DIAGNOSTIC),142,INTERSTITIAL & ALVEOLAR LUNG DISEASES,04,DISEASES AND DISORDERS OF THE RESPIRATORY SYSTEM,1,Minor,Minor,Medical,Medicaid,Medicaid,,,,false,9683.83,6435.87
New York City,Manhattan,7002001,001438,Bellevue Hospital Center,70 or Older,100,F,White,Spanish/Hispanic,2,Emergency,Home or Self Care,2019,BLD008,IMMUNITY DISORDERS,IMG008,ULTRASONOGRAPHY,142,INTERSTITIAL & ALVEOLAR LUNG DISEASES,04,DISEASES AND DISORDERS OF THE RESPIRATORY SYSTEM,3,Major,Moderate,Medical,Medicare,Medicare,Medicaid,,,true,13597.63,9036.98
New York City,Manhattan,7002001,001438,Bellevue Hospital Center,50 to 69,104,F,Other Race,Not Span/Hispanic,37,Urgent,Home or Self Care,2019,BLD008,IMMUNITY DISORDERS,ESA004,NON-INVASIVE VENTILATION,142,INTERSTITIAL & ALVEOLAR LUNG DISEASES,04,DISEASES AND DISORDERS OF THE RESPIRATORY SYSTEM,4,Extreme,Major,Medical,Medicaid,,,,,false,199877.81,132838.79
New York City,Manhattan,7002001,001438,Bellevue Hospital Center,70 or Older,112,F,Other Race,Not Span/Hispanic,14,Emergency,Home or Self Care,2019,MUS024,SYSTEMIC LUPUS ERYTHEMATOSUS AND CONNECTIVE TISSUE DISORDERS,IMG006,COMPUTERIZED TOMOGRAPHY (CT) WITH CONTRAST,142,INTERSTITIAL & ALVEOLAR LUNG DISEASES,04,DISEASES AND DISORDERS OF THE RESPIRATORY SYSTEM,4,Extreme,Extreme,Medical,Medicare,Medicaid,,,,true,108264.45,71952.55
New York City,Manhattan,7002001,001438,Bellevue Hospital Center,50 to 69,111,F,Other Race,Not Span/Hispanic,6,Emergency,Home or Self Care,2019,RSP016,OTHER SPECIFIED AND UNSPECIFIED LOWER RESPIRATORY DISEASE,ADM016,ADMINISTRATION OF ANTI-INFLAMMATORY AGENTS,142,INTERSTITIAL & ALVEOLAR LUNG DISEASES,04,DISEASES AND DISORDERS OF THE RESPIRATORY SYSTEM,2,Moderate,Moderate,Medical,Medicaid,,,,,true,47972.31,31882.4
New York City,Manhattan,7002001,001438,Bellevue Hospital Center,50 to 69,100,F,Other Race,Spanish/Hispanic,10,Emergency,Home or Self Care,2019,RSP016,OTHER SPECIFIED AND UNSPECIFIED LOWER RESPIRATORY DISEASE,ADM021,"ADMINISTRATION OF THERAPEUTIC SUBSTANCES, NEC",142,INTERSTITIAL & ALVEOLAR LUNG DISEASES,04,DISEASES AND DISORDERS OF THE RESPIRATORY SYSTEM,3,Major,Major,Medical,Medicare,,,,,true,75251.49,50012.14
New York City,Manhattan,7002001,001438,Bellevue Hospital Center,70 or Older,100,M,Other Race,Spanish/Hispanic,1,Elective,Home or Self Care,2019,RSP016,OTHER SPECIFIED AND UNSPECIFIED LOWER RESPIRATORY DISEASE,RES001,BRONCHOSCOPY (DIAGNOSTIC),142,INTERSTITIAL & ALVEOLAR LUNG DISEASES,04,DISEASES AND DISORDERS OF THE RESPIRATORY SYSTEM,4,Extreme,Moderate,Medical,Medicare,,,,,false,35794.9,23789.29
New York City,Manhattan,7002001,001438,Bellevue Hospital Center,30 to 49,112,M,Other Race,Unknown,4,Emergency,Home or Self Care,2019,RSP013,LUNG DISEASE DUE TO EXTERNAL AGENTS,IMG007,COMPUTERIZED TOMOGRAPHY (CT) WITHOUT CONTRAST,142,INTERSTITIAL & ALVEOLAR LUNG DISEASES,04,DISEASES AND DISORDERS OF THE RESPIRATORY SYSTEM,3,Major,Moderate,Medical,Medicaid,,,,,true,30316.52,20148.36
New York City,Manhattan,7002001,001438,Bellevue Hospital Center,30 to 49,104,M,Other Race,Spanish/Hispanic,1,Elective,Home or Self Care,2019,RSP016,OTHER SPECIFIED AND UNSPECIFIED LOWER RESPIRATORY DISEASE,RES002,"LUNG, PLEURA, OR DIAPHRAGM BIOPSY (NON-ENDOSCOPIC)",142,INTERSTITIAL & ALVEOLAR LUNG DISEASES,04,DISEASES AND DISORDERS OF THE RESPIRATORY SYSTEM,2,Moderate,Moderate,Medical,Medicaid,,,,,false,22680.15,15073.23
New York City,Manhattan,7002001,001438,Bellevue Hospital Center,50 to 69,111,F,Other Race,Not Span/Hispanic,2,Urgent,Home or Self Care,2019,RSP016,OTHER SPECIFIED AND UNSPECIFIED LOWER RESPIRATORY DISEASE,MAM007,ELECTROCARDIOGRAM (ECG),142,INTERSTITIAL & ALVEOLAR LUNG DISEASES,04,DISEASES AND DISORDERS OF THE RESPIRATORY SYSTEM,2,Moderate,Moderate,Medical,Medicaid,,,,,true,17144.19,11394.03
New York City,Manhattan,7002001,001438,Bellevue Hospital Center,50 to 69,111,M,Other Race,Not Span/Hispanic,17,Emergency,Home w/ Home Health Services,2019,RSP016,OTHER SPECIFIED AND UNSPECIFIED LOWER RESPIRATORY DISEASE,ADM021,"ADMINISTRATION OF THERAPEUTIC SUBSTANCES, NEC",142,INTERSTITIAL & ALVEOLAR LUNG DISEASES,04,DISEASES AND DISORDERS OF THE RESPIRATORY SYSTEM,4,Extreme,Extreme,Medical,Medicaid,,,,,true,135267.31,89898.65
New York City,Manhattan,7002001,001438,Bellevue Hospital Center,50 to 69,104,M,Black/African American,Not Span/Hispanic,5,Emergency,Court/Law Enforcement,2019,RSP016,OTHER SPECIFIED AND UNSPECIFIED LOWER RESPIRATORY DISEASE,IMG009,PLAIN RADIOGRAPHY,142,INTERSTITIAL & ALVEOLAR LUNG DISEASES,04,DISEASES AND DISORDERS OF THE RESPIRATORY SYSTEM,4,Extreme,Major,Medical,Medicaid,,,,,true,34568.2,22974.03
New York City,Manhattan,7002001,001438,Bellevue Hospital Center,50 to 69,113,M,Other Race,Spanish/Hispanic,16,Emergency,Home or Self Care,2019,RSP016,OTHER SPECIFIED AND UNSPECIFIED LOWER RESPIRATORY DISEASE,ADM021,"ADMINISTRATION OF THERAPEUTIC SUBSTANCES, NEC",142,INTERSTITIAL & ALVEOLAR LUNG DISEASES,04,DISEASES AND DISORDERS OF THE RESPIRATORY SYSTEM,4,Extreme,Extreme,Medical,Medicaid,,,,,true,113542.97,75460.66
New York City,Manhattan,7002001,001438,Bellevue Hospital Center,70 or Older,112,M,Other Race,Spanish/Hispanic,1,Emergency,Expired,2019,RSP016,OTHER SPECIFIED AND UNSPECIFIED LOWER RESPIRATORY DISEASE,RES005,CHEST TUBE PLACEMENT AND THERAPEUTIC THORACENTESIS,142,INTERSTITIAL & ALVEOLAR LUNG DISEASES,04,DISEASES AND DISORDERS OF THE RESPIRATORY SYSTEM,4,Extreme,Major,Medical,Medicare,,,,,true,16896.59,11229.47
New York City,Manhattan,7002001,001438,Bellevue Hospital Center,50 to 69,112,M,Other Race,Spanish/Hispanic,15,Emergency,Home w/ Home Health Services,2019,RSP016,OTHER SPECIFIED AND UNSPECIFIED LOWER RESPIRATORY DISEASE,RES007,AIRWAY INTUBATION,142,INTERSTITIAL & ALVEOLAR LUNG DISEASES,04,DISEASES AND DISORDERS OF THE RESPIRATORY SYSTEM,4,Extreme,Major,Medical,Medicaid,,,,,true,107590.69,71504.77
New York City,Manhattan,7002001,001438,Bellevue Hospital Center,50 to 69,100,M,White,Not Span/Hispanic,2,Emergency,Home or Self Care,2019,BLD008,IMMUNITY DISORDERS,MAM005,MEASUREMENT DURING CARDIAC CATHETERIZATION,142,INTERSTITIAL & ALVEOLAR LUNG DISEASES,04,DISEASES AND DISORDERS OF THE RESPIRATORY SYSTEM,3,Major,Moderate,Medical,Federal/State/Local/VA,,,,,true,26188.1,17404.61
New York City,Manhattan,7002001,001438,Bellevue Hospital Center,50 to 69,113,M,Black/African American,Not Span/Hispanic,15,Elective,Court/Law Enforcement,2019,RSP016,OTHER SPECIFIED AND UNSPECIFIED LOWER RESPIRATORY DISEASE,IMG008,ULTRASONOGRAPHY,142,INTERSTITIAL & ALVEOLAR LUNG DISEASES,04,DISEASES AND DISORDERS OF THE RESPIRATORY SYSTEM,3,Major,Major,Medical,Medicaid,,,,,false,108714.08,72251.38
New York City,Manhattan,7002001,001438,Bellevue Hospital Center,70 or Older,100,M,Other Race,Spanish/Hispanic,3,Emergency,Expired,2019,RSP016,OTHER SPECIFIED AND UNSPECIFIED LOWER RESPIRATORY DISEASE,ESA004,NON-INVASIVE VENTILATION,142,INTERSTITIAL & ALVEOLAR LUNG DISEASES,04,DISEASES AND DISORDERS OF THE RESPIRATORY SYSTEM,4,Extreme,Extreme,Medical,Medicare,Medicare,,,,true,24947.93,16580.39
New York City,Manhattan,7002001,001438,Bellevue Hospital Center,50 to 69,112,F,Other Race,Not Span/Hispanic,1,Emergency,Home or Self Care,2019,RSP016,OTHER SPECIFIED AND UNSPECIFIED LOWER RESPIRATORY DISEASE,IMG006,COMPUTERIZED TOMOGRAPHY (CT) WITH CONTRAST,142,INTERSTITIAL & ALVEOLAR LUNG DISEASES,04,DISEASES AND DISORDERS OF THE RESPIRATORY SYSTEM,2,Moderate,Moderate,Medical,Self-Pay,,,,,true,10067.91,6691.13
New York City,Manhattan,7002001,001438,Bellevue Hospital Center,50 to 69,113,M,Black/African American,Not Span/Hispanic,10,Elective,Court/Law Enforcement,2019,RSP016,OTHER SPECIFIED AND UNSPECIFIED LOWER RESPIRATORY DISEASE,ADM016,ADMINISTRATION OF ANTI-INFLAMMATORY AGENTS,142,INTERSTITIAL & ALVEOLAR LUNG DISEASES,04,DISEASES AND DISORDERS OF THE RESPIRATORY SYSTEM,3,Major,Moderate,Medical,Medicaid,,,,,false,78989.34,52496.32
