Hospital Service Area,Hospital County,Operating Certificate Number,Permanent Facility Id,Facility Name,Age Group,Zip Code - 3 digits,Gender,Race,Ethnicity,Length of Stay,Type of Admission,Patient Disposition,Discharge Year,CCS Diagnosis Code,CCS Diagnosis Description,CCS Procedure Code,CCS Procedure Description,APR DRG Code,APR DRG Description,APR MDC Code,APR MDC Description,APR Severity of Illness Code,APR Severity of Illness Description,APR Risk of Mortality,APR Medical Surgical Description,Payment Typology 1,Payment Typology 2,Payment Typology 3,Birth Weight,Abortion Edit Indicator,Emergency Department Indicator,Total Charges,Total Costs
New York City,Bronx,7000006,001169,Montefiore Medical Center - Henry & Lucy Moses Div,50 to 69,107,M,White,Not Span/Hispanic,2,Emergency,Home or Self Care,2018,RSP017,POSTPROCEDURAL OR POSTOPERATIVE RESPIRATORY SYSTEM COMPLICATION,ENT002,ENT DIAGNOSTIC ENDOSCOPY (EXCLUDING LARYNGOSCOPY),143,"OTHER RESPIRATORY DIAGNOSES EXCEPT SIGNS, SYMPTOMS & MINOR DIAGNOSES",04,DISEASES AND DISORDERS OF THE RESPIRATORY SYSTEM,1,Minor,Minor,Medical,Private Health Insurance,,,,,true,24477.15,4512.98
Long Island,Nassau,2951001,000541,North Shore University Hospital,70 or Older,112,M,White,Not Span/Hispanic,7,Emergency,Home w/ Home Health Services,2018,RSP014,PNEUMOTHORAX,RES005,CHEST TUBE PLACEMENT AND THERAPEUTIC THORACENTESIS,143,"OTHER RESPIRATORY DIAGNOSES EXCEPT SIGNS, SYMPTOMS & MINOR DIAGNOSES",04,DISEASES AND DISORDERS OF THE RESPIRATORY SYSTEM,4,Extreme,Major,Medical,Medicare,Medicaid,,,,true,84170.07,13188.24
Finger Lakes,Monroe,2701005,000413,Strong Memorial Hospital,50 to 69,148,M,White,Not Span/Hispanic,1,Emergency,Home or Self Care,2018,RSP011,"PLEURISY, PLEURAL EFFUSION AND PULMONARY COLLAPSE",,,143,"OTHER RESPIRATORY DIAGNOSES EXCEPT SIGNS, SYMPTOMS & MINOR DIAGNOSES",04,DISEASES AND DISORDERS OF THE RESPIRATORY SYSTEM,2,Moderate,Moderate,Medical,Private Health Insurance,Medicaid,Self-Pay,,,true,7557.12,2479.57
New York City,Kings,7001016,001301,Kings County Hospital Center,30 to 49,112,F,Black/African American,Not Span/Hispanic,5,Emergency,Home or Self Care,2018,END009,OBESITY,ESA004,NON-INVASIVE VENTILATION,143,"OTHER RESPIRATORY DIAGNOSES EXCEPT SIGNS, SYMPTOMS & MINOR DIAGNOSES",04,DISEASES AND DISORDERS OF THE RESPIRATORY SYSTEM,3,Major,Major,Medical,Medicaid,Medicaid,,,,true,33851.55,24046.82
New York City,Kings,7001020,001305,Maimonides Medical Center,50 to 69,112,M,White,Not Span/Hispanic,7,Emergency,Home or Self Care,2018,RSP017,POSTPROCEDURAL OR POSTOPERATIVE RESPIRATORY SYSTEM COMPLICATION,RES005,CHEST TUBE PLACEMENT AND THERAPEUTIC THORACENTESIS,143,"OTHER RESPIRATORY DIAGNOSES EXCEPT SIGNS, SYMPTOMS & MINOR DIAGNOSES",04,DISEASES AND DISORDERS OF THE RESPIRATORY SYSTEM,2,Moderate,Minor,Medical,Medicaid,Self-Pay,,,,false,78871,22095.24
Capital/Adirond,Schenectady,4601001,000829,Ellis Hospital,70 or Older,123,F,White,Not Span/Hispanic,1,Emergency,Expired,2018,RSP014,PNEUMOTHORAX,ESA003,MECHANICAL VENTILATION,143,"OTHER RESPIRATORY DIAGNOSES EXCEPT SIGNS, SYMPTOMS & MINOR DIAGNOSES",04,DISEASES AND DISORDERS OF THE RESPIRATORY SYSTEM,4,Extreme,Extreme,Medical,Medicare,Medicare,Medicaid,,,true,15082.4,5197.32
Central NY,Onondaga,3301003,000630,St. Joseph's Hospital Health Center,50 to 69,130,M,White,Not Span/Hispanic,4,Emergency,Home w/ Home Health Services,2018,RSP014,PNEUMOTHORAX,RES005,CHEST TUBE PLACEMENT AND THERAPEUTIC THORACENTESIS,143,"OTHER RESPIRATORY DIAGNOSES EXCEPT SIGNS, SYMPTOMS & MINOR DIAGNOSES",04,DISEASES AND DISORDERS OF THE RESPIRATORY SYSTEM,3,Major,Moderate,Medical,Medicare,,,,,true,18944.04,6534.99
New York City,Manhattan,7002054,001437,New York-Presbyterian/Lower Manhattan Hospital,18 to 29,100,F,Other Race,Not Span/Hispanic,2,Emergency,Home or Self Care,2018,RSP014,PNEUMOTHORAX,RES005,CHEST TUBE PLACEMENT AND THERAPEUTIC THORACENTESIS,143,"OTHER RESPIRATORY DIAGNOSES EXCEPT SIGNS, SYMPTOMS & MINOR DIAGNOSES",04,DISEASES AND DISORDERS OF THE RESPIRATORY SYSTEM,1,Minor,Minor,Medical,"Managed Care, Unspecified",Medicaid,Self-Pay,,,true,22564.16,5213.51
New York City,Queens,7003003,001629,Jamaica Hospital Medical Center,70 or Older,115,F,White,Not Span/Hispanic,1,Emergency,Expired,2018,RSP011,"PLEURISY, PLEURAL EFFUSION AND PULMONARY COLLAPSE",,,143,"OTHER RESPIRATORY DIAGNOSES EXCEPT SIGNS, SYMPTOMS & MINOR DIAGNOSES",04,DISEASES AND DISORDERS OF THE RESPIRATORY SYSTEM,3,Major,Moderate,Medical,Medicare,Private Health Insurance,,,,true,14980,4026.46
New York City,Manhattan,7002053,001463,NYU Langone Hospitals,70 or Older,100,M,White,Not Span/Hispanic,2,Emergency,Home or Self Care,2018,RSP011,"PLEURISY, PLEURAL EFFUSION AND PULMONARY COLLAPSE",RES005,CHEST TUBE PLACEMENT AND THERAPEUTIC THORACENTESIS,143,"OTHER RESPIRATORY DIAGNOSES EXCEPT SIGNS, SYMPTOMS & MINOR DIAGNOSES",04,DISEASES AND DISORDERS OF THE RESPIRATORY SYSTEM,2,Moderate,Major,Medical,Medicare,,,,,true,28222.65,8789.26
New York City,Manhattan,7002002,001439,Mount Sinai Beth Israel,50 to 69,112,F,Other Race,Unknown,4,Emergency,Home or Self Care,2018,RSP011,"PLEURISY, PLEURAL EFFUSION AND PULMONARY COLLAPSE",ESA001,HEMODIALYSIS,143,"OTHER RESPIRATORY DIAGNOSES EXCEPT SIGNS, SYMPTOMS & MINOR DIAGNOSES",04,DISEASES AND DISORDERS OF THE RESPIRATORY SYSTEM,3,Major,Major,Medical,Medicare,Self-Pay,,,,true,45393.15,12407.25
New York City,Manhattan,7002020,001453,Memorial Hospital for Cancer and Allied Diseases,70 or Older,OOS,F,White,Not Span/Hispanic,2,Emergency,Home or Self Care,2018,RSP014,PNEUMOTHORAX,RES005,CHEST TUBE PLACEMENT AND THERAPEUTIC THORACENTESIS,143,"OTHER RESPIRATORY DIAGNOSES EXCEPT SIGNS, SYMPTOMS & MINOR DIAGNOSES",04,DISEASES AND DISORDERS OF THE RESPIRATORY SYSTEM,1,Minor,Moderate,Medical,Medicare,Private Health Insurance,,,,true,16662.82,7584.16
New York City,Queens,7003000,001626,Elmhurst Hospital Center,30 to 49,113,M,Other Race,Spanish/Hispanic,1,Urgent,Home or Self Care,2018,RSP014,PNEUMOTHORAX,RES005,CHEST TUBE PLACEMENT AND THERAPEUTIC THORACENTESIS,143,"OTHER RESPIRATORY DIAGNOSES EXCEPT SIGNS, SYMPTOMS & MINOR DIAGNOSES",04,DISEASES AND DISORDERS OF THE RESPIRATORY SYSTEM,1,Minor,Minor,Medical,Medicaid,Medicaid,,,,false,6788.17,4038.73
New York City,Bronx,7000006,001169,Montefiore Medical Center - Henry & Lucy Moses Div,50 to 69,104,M,Black/African American,Not Span/Hispanic,2,Emergency,Home or Self Care,2018,RSP011,"PLEURISY, PLEURAL EFFUSION AND PULMONARY COLLAPSE",RES005,CHEST TUBE PLACEMENT AND THERAPEUTIC THORACENTESIS,143,"OTHER RESPIRATORY DIAGNOSES EXCEPT SIGNS, SYMPTOMS & MINOR DIAGNOSES",04,DISEASES AND DISORDERS OF THE RESPIRATORY SYSTEM,2,Moderate,Major,Medical,Medicare,Medicaid,,,,false,53237.95,10539.01
New York City,Bronx,7000006,003058,Montefiore Med Center - Jack D Weiler Hosp of A Einstein College Div,70 or Older,104,M,Other Race,Spanish/Hispanic,3,Emergency,Home w/ Home Health Services,2018,RSP016,OTHER SPECIFIED AND UNSPECIFIED LOWER RESPIRATORY DISEASE,ADM021,"ADMINISTRATION OF THERAPEUTIC SUBSTANCES, NEC",143,"OTHER RESPIRATORY DIAGNOSES EXCEPT SIGNS, SYMPTOMS & MINOR DIAGNOSES",04,DISEASES AND DISORDERS OF THE RESPIRATORY SYSTEM,3,Major,Major,Medical,Medicare,Medicaid,,,,true,34124.49,6575.37
New York City,Queens,7003004,001630,Long Island Jewish Medical Center,70 or Older,110,M,White,Not Span/Hispanic,4,Emergency,Home or Self Care,2018,RSP016,OTHER SPECIFIED AND UNSPECIFIED LOWER RESPIRATORY DISEASE,ADM015,ADMINISTRATION OF ANTIBIOTICS,143,"OTHER RESPIRATORY DIAGNOSES EXCEPT SIGNS, SYMPTOMS & MINOR DIAGNOSES",04,DISEASES AND DISORDERS OF THE RESPIRATORY SYSTEM,3,Major,Major,Medical,Medicare,Blue Cross/Blue Shield,Self-Pay,,,false,45596.91,8713.84
Finger Lakes,Monroe,2701005,000413,Strong Memorial Hospital,70 or Older,148,M,White,Not Span/Hispanic,9,Emergency,Home w/ Home Health Services,2018,RSP011,"PLEURISY, PLEURAL EFFUSION AND PULMONARY COLLAPSE",RES005,CHEST TUBE PLACEMENT AND THERAPEUTIC THORACENTESIS,143,"OTHER RESPIRATORY DIAGNOSES EXCEPT SIGNS, SYMPTOMS & MINOR DIAGNOSES",04,DISEASES AND DISORDERS OF THE RESPIRATORY SYSTEM,3,Major,Moderate,Medical,Medicare,,,,,true,27352.93,12419.46
Central NY,Oswego,3702000,000727,Oswego Hospital,70 or Older,131,F,White,Not Span/Hispanic,7,Emergency,Home w/ Home Health Services,2018,RSP014,PNEUMOTHORAX,RES005,CHEST TUBE PLACEMENT AND THERAPEUTIC THORACENTESIS,143,"OTHER RESPIRATORY DIAGNOSES EXCEPT SIGNS, SYMPTOMS & MINOR DIAGNOSES",04,DISEASES AND DISORDERS OF THE RESPIRATORY SYSTEM,4,Extreme,Major,Medical,Medicare,Private Health Insurance,,,,true,25746.21,10755.22
Central NY,Oneida,3202002,000598,St Elizabeth Medical Center,70 or Older,134,M,White,Not Span/Hispanic,4,Emergency,Home or Self Care,2018,RSP011,"PLEURISY, PLEURAL EFFUSION AND PULMONARY COLLAPSE",RES005,CHEST TUBE PLACEMENT AND THERAPEUTIC THORACENTESIS,143,"OTHER RESPIRATORY DIAGNOSES EXCEPT SIGNS, SYMPTOMS & MINOR DIAGNOSES",04,DISEASES AND DISORDERS OF THE RESPIRATORY SYSTEM,3,Major,Major,Medical,Medicare,Medicaid,,,,true,25450.56,7901.1
New York City,Manhattan,7002020,001453,Memorial Hospital for Cancer and Allied Diseases,50 to 69,OOS,F,White,Not Span/Hispanic,5,Emergency,Home or Self Care,2018,RSP011,"PLEURISY, PLEURAL EFFUSION AND PULMONARY COLLAPSE",RES005,CHEST TUBE PLACEMENT AND THERAPEUTIC THORACENTESIS,143,"OTHER RESPIRATORY DIAGNOSES EXCEPT SIGNS, SYMPTOMS & MINOR DIAGNOSES",04,DISEASES AND DISORDERS OF THE RESPIRATORY SYSTEM,2,Moderate,Moderate,Medical,Blue Cross/Blue Shield,,,,,false,57220.69,21431.44
Western NY,Erie,1401008,000213,Mercy Hospital of Buffalo,30 to 49,142,M,White,Not Span/Hispanic,2,Emergency,Home or Self Care,2018,RSP011,"PLEURISY, PLEURAL EFFUSION AND PULMONARY COLLAPSE",,,143,"OTHER RESPIRATORY DIAGNOSES EXCEPT SIGNS, SYMPTOMS & MINOR DIAGNOSES",04,DISEASES AND DISORDERS OF THE RESPIRATORY SYSTEM,1,Minor,Minor,Medical,Private Health Insurance,,,,,true,14210.9,4305.93
Central NY,Onondaga,3301007,000635,University Hospital SUNY Health Science Center,0 to 17,136,M,White,Not Span/Hispanic,5,Elective,Home w/ Home Health Services,2018,FAC010,OTHER AFTERCARE ENCOUNTER,RES010,TRACHEOSTOMY,143,"OTHER RESPIRATORY DIAGNOSES EXCEPT SIGNS, SYMPTOMS & MINOR DIAGNOSES",04,DISEASES AND DISORDERS OF THE RESPIRATORY SYSTEM,2,Moderate,Minor,Medical,Medicaid,,,,,false,59034.3,15728.88
New York City,Manhattan,7002017,001450,Lenox Hill Hospital,50 to 69,100,M,Other Race,Not Span/Hispanic,2,Emergency,Home w/ Home Health Services,2018,RSP011,"PLEURISY, PLEURAL EFFUSION AND PULMONARY COLLAPSE",RES005,CHEST TUBE PLACEMENT AND THERAPEUTIC THORACENTESIS,143,"OTHER RESPIRATORY DIAGNOSES EXCEPT SIGNS, SYMPTOMS & MINOR DIAGNOSES",04,DISEASES AND DISORDERS OF THE RESPIRATORY SYSTEM,2,Moderate,Minor,Medical,Medicare,Medicare,,,,true,45812,9536.07
Hudson Valley,Orange,3522000,000694,St Luke's Cornwall Hospital/Newburgh,70 or Older,109,F,White,Not Span/Hispanic,8,Emergency,Home w/ Home Health Services,2018,RSP011,"PLEURISY, PLEURAL EFFUSION AND PULMONARY COLLAPSE",MAM007,ELECTROCARDIOGRAM (ECG),143,"OTHER RESPIRATORY DIAGNOSES EXCEPT SIGNS, SYMPTOMS & MINOR DIAGNOSES",04,DISEASES AND DISORDERS OF THE RESPIRATORY SYSTEM,4,Extreme,Extreme,Medical,Medicare,Blue Cross/Blue Shield,,,,true,61717.87,13247.44
Central NY,Tompkins,5401001,000977,Cayuga Medical Center at Ithaca,70 or Older,148,F,White,Not Span/Hispanic,3,Emergency,Home or Self Care,2018,RSP011,"PLEURISY, PLEURAL EFFUSION AND PULMONARY COLLAPSE",,,143,"OTHER RESPIRATORY DIAGNOSES EXCEPT SIGNS, SYMPTOMS & MINOR DIAGNOSES",04,DISEASES AND DISORDERS OF THE RESPIRATORY SYSTEM,3,Major,Major,Medical,Medicare,Self-Pay,Self-Pay,,,true,7171.76,5281.1
New York City,Queens,7003004,001630,Long Island Jewish Medical Center,70 or Older,110,M,Other Race,Not Span/Hispanic,8,Emergency,Home or Self Care,2018,RSP011,"PLEURISY, PLEURAL EFFUSION AND PULMONARY COLLAPSE",RES005,CHEST TUBE PLACEMENT AND THERAPEUTIC THORACENTESIS,143,"OTHER RESPIRATORY DIAGNOSES EXCEPT SIGNS, SYMPTOMS & MINOR DIAGNOSES",04,DISEASES AND DISORDERS OF THE RESPIRATORY SYSTEM,2,Moderate,Moderate,Medical,Medicare,Medicare,Self-Pay,,,false,88066,15732.87
Western NY,Erie,1401014,000208,John R. Oishei Children's Hospital,0 to 17,OOS,F,White,Not Span/Hispanic,1,Emergency,Home or Self Care,2018,RSP011,"PLEURISY, PLEURAL EFFUSION AND PULMONARY COLLAPSE",,,143,"OTHER RESPIRATORY DIAGNOSES EXCEPT SIGNS, SYMPTOMS & MINOR DIAGNOSES",04,DISEASES AND DISORDERS OF THE RESPIRATORY SYSTEM,1,Minor,Minor,Medical,Blue Cross/Blue Shield,Self-Pay,,,,true,5611.23,2803.18
New York City,Manhattan,7002054,001464,New York-Presbyterian Hospital - Columbia Presbyterian Center,70 or Older,121,M,White,Not Span/Hispanic,5,Urgent,Home or Self Care,2018,INJ036,"COMPLICATION OF TRANSPLANTED ORGANS OR TISSUE, INITIAL ENCOUNTER",,,143,"OTHER RESPIRATORY DIAGNOSES EXCEPT SIGNS, SYMPTOMS & MINOR DIAGNOSES",04,DISEASES AND DISORDERS OF THE RESPIRATORY SYSTEM,3,Major,Moderate,Medical,Medicare,Medicare,Self-Pay,,,false,57184.98,12903.43
Capital/Adirond,Albany,0101000,000001,Albany Medical Center Hospital,0 to 17,121,F,Black/African American,Not Span/Hispanic,2,Emergency,Home or Self Care,2018,PNL006,RESPIRATORY PERINATAL CONDITION,CNS002,LUMBAR PUNCTURE,143,"OTHER RESPIRATORY DIAGNOSES EXCEPT SIGNS, SYMPTOMS & MINOR DIAGNOSES",04,DISEASES AND DISORDERS OF THE RESPIRATORY SYSTEM,2,Moderate,Minor,Medical,"Managed Care, Unspecified",,,03000,,true,17407.33,4528.57
Central NY,Madison,2601001,000397,Oneida Health Hospital,30 to 49,134,F,White,Not Span/Hispanic,6,Urgent,Home or Self Care,2018,RSP017,POSTPROCEDURAL OR POSTOPERATIVE RESPIRATORY SYSTEM COMPLICATION,RES005,CHEST TUBE PLACEMENT AND THERAPEUTIC THORACENTESIS,143,"OTHER RESPIRATORY DIAGNOSES EXCEPT SIGNS, SYMPTOMS & MINOR DIAGNOSES",04,DISEASES AND DISORDERS OF THE RESPIRATORY SYSTEM,3,Major,Major,Medical,Blue Cross/Blue Shield,Self-Pay,Self-Pay,,,false,15799.03,8597.46
New York City,Richmond,7004010,001738,Richmond University Medical Center,18 to 29,103,M,White,Not Span/Hispanic,3,Emergency,Short-term Hospital,2018,RSP014,PNEUMOTHORAX,RES005,CHEST TUBE PLACEMENT AND THERAPEUTIC THORACENTESIS,143,"OTHER RESPIRATORY DIAGNOSES EXCEPT SIGNS, SYMPTOMS & MINOR DIAGNOSES",04,DISEASES AND DISORDERS OF THE RESPIRATORY SYSTEM,2,Moderate,Moderate,Medical,Blue Cross/Blue Shield,Self-Pay,Self-Pay,,,true,22733.7,9310.68
Western NY,Erie,1401010,000216,Roswell Park Cancer Institute,50 to 69,142,M,White,Not Span/Hispanic,4,Elective,Expired,2018,RSP011,"PLEURISY, PLEURAL EFFUSION AND PULMONARY COLLAPSE",IMG006,COMPUTERIZED TOMOGRAPHY (CT) WITH CONTRAST,143,"OTHER RESPIRATORY DIAGNOSES EXCEPT SIGNS, SYMPTOMS & MINOR DIAGNOSES",04,DISEASES AND DISORDERS OF THE RESPIRATORY SYSTEM,3,Major,Major,Medical,Medicaid,,,,,false,39461.38,16490.89
New York City,Manhattan,7002054,001464,New York-Presbyterian Hospital - Columbia Presbyterian Center,50 to 69,103,M,Other Race,Not Span/Hispanic,3,Emergency,Skilled Nursing Home,2018,RSP011,"PLEURISY, PLEURAL EFFUSION AND PULMONARY COLLAPSE",RES005,CHEST TUBE PLACEMENT AND THERAPEUTIC THORACENTESIS,143,"OTHER RESPIRATORY DIAGNOSES EXCEPT SIGNS, SYMPTOMS & MINOR DIAGNOSES",04,DISEASES AND DISORDERS OF THE RESPIRATORY SYSTEM,4,Extreme,Major,Medical,Private Health Insurance,Self-Pay,,,,true,56286.87,15055.16
Central NY,Onondaga,3301003,000630,St. Joseph's Hospital Health Center,30 to 49,132,F,White,Not Span/Hispanic,2,Emergency,Skilled Nursing Home,2018,RSP016,OTHER SPECIFIED AND UNSPECIFIED LOWER RESPIRATORY DISEASE,ESA001,HEMODIALYSIS,143,"OTHER RESPIRATORY DIAGNOSES EXCEPT SIGNS, SYMPTOMS & MINOR DIAGNOSES",04,DISEASES AND DISORDERS OF THE RESPIRATORY SYSTEM,3,Major,Moderate,Medical,Medicaid,,,,,true,10322.15,3593.77
New York City,Manhattan,7002054,001458,New York-Presbyterian Hospital - New York Weill Cornell Center,70 or Older,104,M,Other Race,Spanish/Hispanic,2,Emergency,Home or Self Care,2018,RSP017,POSTPROCEDURAL OR POSTOPERATIVE RESPIRATORY SYSTEM COMPLICATION,RES010,TRACHEOSTOMY,143,"OTHER RESPIRATORY DIAGNOSES EXCEPT SIGNS, SYMPTOMS & MINOR DIAGNOSES",04,DISEASES AND DISORDERS OF THE RESPIRATORY SYSTEM,3,Major,Major,Medical,Blue Cross/Blue Shield,Medicare,Self-Pay,,,true,37520.4,10320.73
Long Island,Suffolk,5157003,000943,St Catherine of Siena Hospital,70 or Older,119,F,White,Not Span/Hispanic,7,Emergency,Home w/ Home Health Services,2018,RSP014,PNEUMOTHORAX,RES005,CHEST TUBE PLACEMENT AND THERAPEUTIC THORACENTESIS,143,"OTHER RESPIRATORY DIAGNOSES EXCEPT SIGNS, SYMPTOMS & MINOR DIAGNOSES",04,DISEASES AND DISORDERS OF THE RESPIRATORY SYSTEM,1,Minor,Moderate,Medical,Medicare,Blue Cross/Blue Shield,,,,true,70396,18996.73
Western NY,Erie,1401005,000210,Erie County Medical Center,50 to 69,142,M,Black/African American,Not Span/Hispanic,3,Emergency,Federal Health Care Facility,2018,RSP014,PNEUMOTHORAX,RES002,"LUNG, PLEURA, OR DIAPHRAGM BIOPSY (NON-ENDOSCOPIC)",143,"OTHER RESPIRATORY DIAGNOSES EXCEPT SIGNS, SYMPTOMS & MINOR DIAGNOSES",04,DISEASES AND DISORDERS OF THE RESPIRATORY SYSTEM,2,Moderate,Minor,Medical,Federal/State/Local/VA,,,,,true,14480.74,6820.69
Long Island,Suffolk,5149001,000896,St. Charles Hospital,18 to 29,117,M,White,Not Span/Hispanic,1,Emergency,Home or Self Care,2018,RSP014,PNEUMOTHORAX,,,143,"OTHER RESPIRATORY DIAGNOSES EXCEPT SIGNS, SYMPTOMS & MINOR DIAGNOSES",04,DISEASES AND DISORDERS OF THE RESPIRATORY SYSTEM,2,Moderate,Minor,Medical,Blue Cross/Blue Shield,,,,,true,15000,3632.23
Long Island,Nassau,2951001,000541,North Shore University Hospital,50 to 69,113,F,White,Not Span/Hispanic,2,Emergency,Home or Self Care,2018,END009,OBESITY,,,143,"OTHER RESPIRATORY DIAGNOSES EXCEPT SIGNS, SYMPTOMS & MINOR DIAGNOSES",04,DISEASES AND DISORDERS OF THE RESPIRATORY SYSTEM,2,Moderate,Minor,Medical,Medicare,Medicare,,,,true,39565.33,5485.21
New York City,Manhattan,7002054,001464,New York-Presbyterian Hospital - Columbia Presbyterian Center,18 to 29,104,F,Other Race,Spanish/Hispanic,4,Emergency,Home or Self Care,2018,RSP011,"PLEURISY, PLEURAL EFFUSION AND PULMONARY COLLAPSE",GIS001,ESOPHAGOGASTRODUODENOSCOPY (EGD) WITH BIOPSY,143,"OTHER RESPIRATORY DIAGNOSES EXCEPT SIGNS, SYMPTOMS & MINOR DIAGNOSES",04,DISEASES AND DISORDERS OF THE RESPIRATORY SYSTEM,1,Minor,Minor,Medical,Medicaid,Medicaid,Self-Pay,,,true,55141.99,13309.5
New York City,Bronx,7000006,003058,Montefiore Med Center - Jack D Weiler Hosp of A Einstein College Div,70 or Older,104,M,Black/African American,Not Span/Hispanic,21,Emergency,Home or Self Care,2018,RSP014,PNEUMOTHORAX,CAR024,VENOUS AND ARTERIAL CATHETER PLACEMENT,143,"OTHER RESPIRATORY DIAGNOSES EXCEPT SIGNS, SYMPTOMS & MINOR DIAGNOSES",04,DISEASES AND DISORDERS OF THE RESPIRATORY SYSTEM,3,Major,Major,Medical,Medicare,Private Health Insurance,,,,true,183646.36,37468.73
New York City,Bronx,7000006,001169,Montefiore Medical Center - Henry & Lucy Moses Div,0 to 17,104,F,Other Race,Not Span/Hispanic,1,Emergency,Home or Self Care,2018,RSP014,PNEUMOTHORAX,,,143,"OTHER RESPIRATORY DIAGNOSES EXCEPT SIGNS, SYMPTOMS & MINOR DIAGNOSES",04,DISEASES AND DISORDERS OF THE RESPIRATORY SYSTEM,1,Minor,Minor,Medical,Private Health Insurance,,,,,true,13049.32,3136.19
Capital/Adirond,Albany,0101004,000005,St. Peter's Hospital,50 to 69,124,M,White,Not Span/Hispanic,6,Elective,Home or Self Care,2018,RSP014,PNEUMOTHORAX,RES005,CHEST TUBE PLACEMENT AND THERAPEUTIC THORACENTESIS,143,"OTHER RESPIRATORY DIAGNOSES EXCEPT SIGNS, SYMPTOMS & MINOR DIAGNOSES",04,DISEASES AND DISORDERS OF THE RESPIRATORY SYSTEM,3,Major,Major,Medical,Blue Cross/Blue Shield,,,,,false,20747.85,9447.11
Central NY,Onondaga,3301007,000635,University Hospital SUNY Health Science Center,50 to 69,133,F,White,Not Span/Hispanic,2,Emergency,Home or Self Care,2018,RSP013,LUNG DISEASE DUE TO EXTERNAL AGENTS,,,143,"OTHER RESPIRATORY DIAGNOSES EXCEPT SIGNS, SYMPTOMS & MINOR DIAGNOSES",04,DISEASES AND DISORDERS OF THE RESPIRATORY SYSTEM,3,Major,Major,Medical,Medicaid,,,,,true,22988.45,5908.63
Long Island,Suffolk,5154000,000924,South Shore University Hospital,50 to 69,119,M,White,Not Span/Hispanic,2,Emergency,Home or Self Care,2018,RSP017,POSTPROCEDURAL OR POSTOPERATIVE RESPIRATORY SYSTEM COMPLICATION,,,143,"OTHER RESPIRATORY DIAGNOSES EXCEPT SIGNS, SYMPTOMS & MINOR DIAGNOSES",04,DISEASES AND DISORDERS OF THE RESPIRATORY SYSTEM,1,Minor,Minor,Medical,Private Health Insurance,,,,,true,29747.59,5560.23
New York City,Manhattan,7002054,001464,New York-Presbyterian Hospital - Columbia Presbyterian Center,30 to 49,104,F,White,Not Span/Hispanic,2,Emergency,Home or Self Care,2018,RSP017,POSTPROCEDURAL OR POSTOPERATIVE RESPIRATORY SYSTEM COMPLICATION,ADM020,"ADMINISTRATION OF DIAGNOSTIC SUBSTANCES, NEC",143,"OTHER RESPIRATORY DIAGNOSES EXCEPT SIGNS, SYMPTOMS & MINOR DIAGNOSES",04,DISEASES AND DISORDERS OF THE RESPIRATORY SYSTEM,3,Major,Major,Medical,Medicaid,Medicaid,Self-Pay,,,true,28105.29,6649.07
New York City,Manhattan,7002009,001445,Harlem Hospital Center,50 to 69,100,F,Black/African American,Not Span/Hispanic,11,Emergency,Home w/ Home Health Services,2018,RSP016,OTHER SPECIFIED AND UNSPECIFIED LOWER RESPIRATORY DISEASE,,,143,"OTHER RESPIRATORY DIAGNOSES EXCEPT SIGNS, SYMPTOMS & MINOR DIAGNOSES",04,DISEASES AND DISORDERS OF THE RESPIRATORY SYSTEM,4,Extreme,Extreme,Medical,Private Health Insurance,Medicaid,,,,true,71090.21,52829.34
Western NY,Cattaraugus,0401001,000066,Olean General Hospital,50 to 69,147,M,White,Not Span/Hispanic,9,Emergency,Short-term Hospital,2018,RSP011,"PLEURISY, PLEURAL EFFUSION AND PULMONARY COLLAPSE",RES005,CHEST TUBE PLACEMENT AND THERAPEUTIC THORACENTESIS,143,"OTHER RESPIRATORY DIAGNOSES EXCEPT SIGNS, SYMPTOMS & MINOR DIAGNOSES",04,DISEASES AND DISORDERS OF THE RESPIRATORY SYSTEM,3,Major,Major,Medical,Private Health Insurance,Medicare,,,,true,34143.09,13660.2
New York City,Queens,7002024,001639,Mount Sinai Hospital - Mount Sinai Hospital of Queens,70 or Older,113,M,White,Not Span/Hispanic,5,Emergency,Home or Self Care,2018,RSP011,"PLEURISY, PLEURAL EFFUSION AND PULMONARY COLLAPSE",RES005,CHEST TUBE PLACEMENT AND THERAPEUTIC THORACENTESIS,143,"OTHER RESPIRATORY DIAGNOSES EXCEPT SIGNS, SYMPTOMS & MINOR DIAGNOSES",04,DISEASES AND DISORDERS OF THE RESPIRATORY SYSTEM,3,Major,Major,Medical,Medicare,Blue Cross/Blue Shield,,,,true,19065.96,5744.4
Long Island,Nassau,2952006,000551,St. Joseph Hospital,70 or Older,117,M,White,Not Span/Hispanic,5,Emergency,Home or Self Care,2018,RSP013,LUNG DISEASE DUE TO EXTERNAL AGENTS,ESA004,NON-INVASIVE VENTILATION,143,"OTHER RESPIRATORY DIAGNOSES EXCEPT SIGNS, SYMPTOMS & MINOR DIAGNOSES",04,DISEASES AND DISORDERS OF THE RESPIRATORY SYSTEM,3,Major,Major,Medical,Medicare,Medicare,Medicaid,,,true,45189.33,9869.95
New York City,Manhattan,7002024,001456,Mount Sinai Hospital,70 or Older,,F,White,Spanish/Hispanic,4,Emergency,Home or Self Care,2018,RSP011,"PLEURISY, PLEURAL EFFUSION AND PULMONARY COLLAPSE",RES005,CHEST TUBE PLACEMENT AND THERAPEUTIC THORACENTESIS,143,"OTHER RESPIRATORY DIAGNOSES EXCEPT SIGNS, SYMPTOMS & MINOR DIAGNOSES",04,DISEASES AND DISORDERS OF THE RESPIRATORY SYSTEM,3,Major,Major,Medical,Medicare,Private Health Insurance,Self-Pay,,,true,48001.49,13917.67
New York City,Bronx,7000006,001169,Montefiore Medical Center - Henry & Lucy Moses Div,70 or Older,104,F,Other Race,Spanish/Hispanic,6,Emergency,Home w/ Home Health Services,2018,RSP013,LUNG DISEASE DUE TO EXTERNAL AGENTS,ADM015,ADMINISTRATION OF ANTIBIOTICS,143,"OTHER RESPIRATORY DIAGNOSES EXCEPT SIGNS, SYMPTOMS & MINOR DIAGNOSES",04,DISEASES AND DISORDERS OF THE RESPIRATORY SYSTEM,3,Major,Major,Medical,Medicare,,,,,true,61753.89,12216.08
Long Island,Suffolk,5154000,000924,South Shore University Hospital,18 to 29,117,M,Other Race,Not Span/Hispanic,1,Emergency,Home or Self Care,2018,RSP014,PNEUMOTHORAX,,,143,"OTHER RESPIRATORY DIAGNOSES EXCEPT SIGNS, SYMPTOMS & MINOR DIAGNOSES",04,DISEASES AND DISORDERS OF THE RESPIRATORY SYSTEM,1,Minor,Minor,Medical,Medicaid,,,,,true,11466.03,2573.3