Hospital Service Area,Hospital County,Operating Certificate Number,Permanent Facility Id,Facility Name,Age Group,Zip Code - 3 digits,Gender,Race,Ethnicity,Length of Stay,Type of Admission,Patient Disposition,Discharge Year,CCS Diagnosis Code,CCS Diagnosis Description,CCS Procedure Code,CCS Procedure Description,APR DRG Code,APR DRG Description,APR MDC Code,APR MDC Description,APR Severity of Illness Code,APR Severity of Illness Description,APR Risk of Mortality,APR Medical Surgical Description,Payment Typology 1,Payment Typology 2,Payment Typology 3,Birth Weight,Abortion Edit Indicator,Emergency Department Indicator,Total Charges,Total Costs
New York City,Manhattan,7002024,001456,Mount Sinai Hospital,70 or Older,104,F,Black/African American,Not Span/Hispanic,6,Urgent,Home or Self Care,2017,132,Lung disease due to external agents,037,DX BRONCHOSCOPY & BIOPS,144,"Respiratory signs, symptoms & minor diagnoses",04,Diseases and Disorders of the Respiratory System,2,Moderate,Minor,Medical,Medicare,Private Health Insurance,Self-Pay,,N,N,50401.67,16759.44
New York City,Bronx,7000006,001168,Montefiore Medical Center-Wakefield Hospital,50 to 69,104,F,Black/African American,Not Span/Hispanic,2,Emergency,Home or Self Care,2017,133,Other lower respiratory disease,000,NO PROC,144,"Respiratory signs, symptoms & minor diagnoses",04,Diseases and Disorders of the Respiratory System,1,Minor,Minor,Medical,Private Health Insurance,,,,N,Y,43814.57,12938.62
New York City,Bronx,7000006,001169,Montefiore Medical Center - Henry & Lucy Moses Div,50 to 69,104,F,Black/African American,Not Span/Hispanic,1,Emergency,Home or Self Care,2017,133,Other lower respiratory disease,000,NO PROC,144,"Respiratory signs, symptoms & minor diagnoses",04,Diseases and Disorders of the Respiratory System,2,Moderate,Minor,Medical,Medicare,,,,N,Y,27223.90,2859.67
New York City,Bronx,7000006,001169,Montefiore Medical Center - Henry & Lucy Moses Div,50 to 69,104,M,Other Race,Spanish/Hispanic,4,Emergency,Home or Self Care,2017,133,Other lower respiratory disease,037,DX BRONCHOSCOPY & BIOPS,144,"Respiratory signs, symptoms & minor diagnoses",04,Diseases and Disorders of the Respiratory System,3,Major,Major,Medical,Medicaid,,,,N,N,114213.91,25804.60
New York City,Bronx,7000006,001169,Montefiore Medical Center - Henry & Lucy Moses Div,50 to 69,104,M,Other Race,Not Span/Hispanic,3,Emergency,Home or Self Care,2017,125,Acute bronchitis,000,NO PROC,144,"Respiratory signs, symptoms & minor diagnoses",04,Diseases and Disorders of the Respiratory System,3,Major,Moderate,Medical,Medicaid,,,,N,Y,35466.01,5945.73
New York City,Bronx,7000006,001169,Montefiore Medical Center - Henry & Lucy Moses Div,50 to 69,104,M,Other Race,Not Span/Hispanic,2,Emergency,Home or Self Care,2017,133,Other lower respiratory disease,041,OT NON-OR THER PRC RESP,144,"Respiratory signs, symptoms & minor diagnoses",04,Diseases and Disorders of the Respiratory System,2,Moderate,Moderate,Medical,Medicaid,,,,N,Y,26648.86,5479.97
New York City,Bronx,7000006,001169,Montefiore Medical Center - Henry & Lucy Moses Div,70 or Older,104,M,Other Race,Spanish/Hispanic,5,Emergency,Home or Self Care,2017,125,Acute bronchitis,231,OTHER THERAPEUTIC PRCS,144,"Respiratory signs, symptoms & minor diagnoses",04,Diseases and Disorders of the Respiratory System,3,Major,Major,Medical,Medicare,,,,N,Y,50839.50,11179.61
New York City,Bronx,7000006,001169,Montefiore Medical Center - Henry & Lucy Moses Div,0 to 17,104,M,Black/African American,Not Span/Hispanic,1,Emergency,Home or Self Care,2017,133,Other lower respiratory disease,031,DX PRCS ON NOSE & MOUTH,144,"Respiratory signs, symptoms & minor diagnoses",04,Diseases and Disorders of the Respiratory System,1,Minor,Minor,Medical,Private Health Insurance,,,,N,Y,6559.00,1242.27
New York City,Bronx,7000006,003058,Montefiore Med Center - Jack D Weiler Hosp of A Einstein College Div,70 or Older,104,M,Black/African American,Not Span/Hispanic,5,Emergency,Skilled Nursing Home,2017,133,Other lower respiratory disease,231,OTHER THERAPEUTIC PRCS,144,"Respiratory signs, symptoms & minor diagnoses",04,Diseases and Disorders of the Respiratory System,3,Major,Moderate,Medical,Medicare,,,,N,Y,63204.15,10221.44
New York City,Bronx,7000006,003058,Montefiore Med Center - Jack D Weiler Hosp of A Einstein College Div,50 to 69,104,F,Black/African American,Not Span/Hispanic,3,Emergency,Home w/ Home Health Services,2017,125,Acute bronchitis,000,NO PROC,144,"Respiratory signs, symptoms & minor diagnoses",04,Diseases and Disorders of the Respiratory System,2,Moderate,Minor,Medical,Medicare,,,,N,Y,22847.59,4969.01
New York City,Bronx,7000006,003058,Montefiore Med Center - Jack D Weiler Hosp of A Einstein College Div,50 to 69,104,F,White,Not Span/Hispanic,2,Emergency,Home or Self Care,2017,133,Other lower respiratory disease,231,OTHER THERAPEUTIC PRCS,144,"Respiratory signs, symptoms & minor diagnoses",04,Diseases and Disorders of the Respiratory System,2,Moderate,Minor,Medical,Medicaid,,,,N,Y,20971.79,4309.77
New York City,Bronx,7000006,003058,Montefiore Med Center - Jack D Weiler Hosp of A Einstein College Div,50 to 69,104,F,White,Spanish/Hispanic,3,Emergency,Home or Self Care,2017,125,Acute bronchitis,041,OT NON-OR THER PRC RESP,144,"Respiratory signs, symptoms & minor diagnoses",04,Diseases and Disorders of the Respiratory System,3,Major,Major,Medical,Medicare,Private Health Insurance,,,N,Y,40484.80,7276.47
New York City,Bronx,7000006,003058,Montefiore Med Center - Jack D Weiler Hosp of A Einstein College Div,50 to 69,104,M,Other Race,Spanish/Hispanic,1,Emergency,Home or Self Care,2017,133,Other lower respiratory disease,000,NO PROC,144,"Respiratory signs, symptoms & minor diagnoses",04,Diseases and Disorders of the Respiratory System,2,Moderate,Minor,Medical,Private Health Insurance,,,,N,Y,20866.85,2995.04
New York City,Kings,7001033,001315,Kingsbrook Jewish Medical Center,70 or Older,112,F,Black/African American,Not Span/Hispanic,6,Emergency,Inpatient Rehabilitation Facility,2017,125,Acute bronchitis,216,RESP INTUB/MECH VENTIL,144,"Respiratory signs, symptoms & minor diagnoses",04,Diseases and Disorders of the Respiratory System,3,Major,Major,Medical,Medicare,Medicaid,Self-Pay,,N,Y,46960.00,14974.42
New York City,Kings,7002002,001324,Mount Sinai Brooklyn,30 to 49,112,M,White,Not Span/Hispanic,6,Emergency,Home or Self Care,2017,125,Acute bronchitis,231,OTHER THERAPEUTIC PRCS,144,"Respiratory signs, symptoms & minor diagnoses",04,Diseases and Disorders of the Respiratory System,2,Moderate,Minor,Medical,Medicare,Medicaid,Self-Pay,,N,Y,43663.15,7519.62
New York City,Kings,7002002,001324,Mount Sinai Brooklyn,50 to 69,112,M,Black/African American,Not Span/Hispanic,2,Emergency,Home or Self Care,2017,133,Other lower respiratory disease,202,ELECTROCARDIOGRAM,144,"Respiratory signs, symptoms & minor diagnoses",04,Diseases and Disorders of the Respiratory System,1,Minor,Minor,Medical,Private Health Insurance,Blue Cross/Blue Shield,Self-Pay,,N,N,15385.89,2426.95
New York City,Manhattan,7002024,001456,Mount Sinai Hospital,50 to 69,113,M,Other Race,Not Span/Hispanic,2,Urgent,Home or Self Care,2017,231,Other fractures,000,NO PROC,144,"Respiratory signs, symptoms & minor diagnoses",04,Diseases and Disorders of the Respiratory System,1,Minor,Minor,Medical,Medicaid,Medicaid,Self-Pay,,N,N,20849.04,5866.84
New York City,Manhattan,7002024,001456,Mount Sinai Hospital,50 to 69,112,F,White,Not Span/Hispanic,5,Emergency,Home w/ Home Health Services,2017,126,Other upper respiratory infections,000,NO PROC,144,"Respiratory signs, symptoms & minor diagnoses",04,Diseases and Disorders of the Respiratory System,3,Major,Moderate,Medical,Medicare,Medicaid,Self-Pay,,N,Y,46385.03,16344.93
New York City,Manhattan,7002032,001469,Mount Sinai St. Luke's,50 to 69,100,F,Black/African American,Not Span/Hispanic,6,Emergency,Home or Self Care,2017,125,Acute bronchitis,183,ROUTINE CHEST X-RAY,144,"Respiratory signs, symptoms & minor diagnoses",04,Diseases and Disorders of the Respiratory System,3,Major,Moderate,Medical,Medicare,Self-Pay,,,N,Y,57782.53,15937.08
New York City,Manhattan,7002032,001469,Mount Sinai St. Luke's,70 or Older,104,F,White,Not Span/Hispanic,4,Emergency,Inpatient Rehabilitation Facility,2017,125,Acute bronchitis,231,OTHER THERAPEUTIC PRCS,144,"Respiratory signs, symptoms & minor diagnoses",04,Diseases and Disorders of the Respiratory System,2,Moderate,Moderate,Medical,Medicare,Blue Cross/Blue Shield,Self-Pay,,N,Y,34111.50,8927.10
New York City,Manhattan,7002032,001469,Mount Sinai St. Luke's,70 or Older,100,F,Black/African American,Not Span/Hispanic,2,Emergency,Home or Self Care,2017,134,Other upper respiratory disease,193,DX ULTRASOUND HEART,144,"Respiratory signs, symptoms & minor diagnoses",04,Diseases and Disorders of the Respiratory System,1,Minor,Minor,Medical,Medicare,Blue Cross/Blue Shield,Self-Pay,,N,Y,23110.97,7614.10
New York City,Manhattan,7002032,001469,Mount Sinai St. Luke's,70 or Older,100,M,Black/African American,Not Span/Hispanic,1,Emergency,Home w/ Home Health Services,2017,133,Other lower respiratory disease,180,OTHER CT SCAN,144,"Respiratory signs, symptoms & minor diagnoses",04,Diseases and Disorders of the Respiratory System,3,Major,Moderate,Medical,Medicare,Medicaid,Self-Pay,,N,Y,16366.90,3925.22
Hudson Valley,Orange,3523000,000699,Orange Regional Medical Center,50 to 69,109,F,White,Not Span/Hispanic,2,Emergency,Home or Self Care,2017,133,Other lower respiratory disease,000,NO PROC,144,"Respiratory signs, symptoms & minor diagnoses",04,Diseases and Disorders of the Respiratory System,3,Major,Moderate,Medical,Blue Cross/Blue Shield,,,,N,Y,17367.71,5947.41
Hudson Valley,Rockland,4329000,000779,Good Samaritan Hospital of Suffern,70 or Older,109,M,Black/African American,Not Span/Hispanic,5,Emergency,Home or Self Care,2017,125,Acute bronchitis,000,NO PROC,144,"Respiratory signs, symptoms & minor diagnoses",04,Diseases and Disorders of the Respiratory System,2,Moderate,Moderate,Medical,Medicare,,,,N,Y,35378.33,8736.30
Hudson Valley,Rockland,4329000,000779,Good Samaritan Hospital of Suffern,70 or Older,109,F,White,Not Span/Hispanic,3,Emergency,Skilled Nursing Home,2017,127,Chronic obstructive pulmonary disease and bronchiectasis,000,NO PROC,144,"Respiratory signs, symptoms & minor diagnoses",04,Diseases and Disorders of the Respiratory System,2,Moderate,Minor,Medical,Medicare,Private Health Insurance,,,N,Y,36578.23,8104.31
Hudson Valley,Rockland,4329000,000779,Good Samaritan Hospital of Suffern,70 or Older,109,M,Other Race,Not Span/Hispanic,3,Emergency,Home w/ Home Health Services,2017,127,Chronic obstructive pulmonary disease and bronchiectasis,000,NO PROC,144,"Respiratory signs, symptoms & minor diagnoses",04,Diseases and Disorders of the Respiratory System,3,Major,Major,Medical,Medicare,Private Health Insurance,,,N,Y,39938.09,8959.71
New York City,Bronx,7000006,001168,Montefiore Medical Center-Wakefield Hospital,70 or Older,104,M,White,Not Span/Hispanic,2,Emergency,Home or Self Care,2017,125,Acute bronchitis,058,HEMODIALYSIS,144,"Respiratory signs, symptoms & minor diagnoses",04,Diseases and Disorders of the Respiratory System,3,Major,Moderate,Medical,Medicare,Private Health Insurance,,,N,Y,32891.19,6523.49
New York City,Bronx,7000006,001169,Montefiore Medical Center - Henry & Lucy Moses Div,70 or Older,104,F,Other Race,Spanish/Hispanic,6,Emergency,Home or Self Care,2017,125,Acute bronchitis,041,OT NON-OR THER PRC RESP,144,"Respiratory signs, symptoms & minor diagnoses",04,Diseases and Disorders of the Respiratory System,2,Moderate,Minor,Medical,Medicare,,,,N,Y,47686.24,10188.35
New York City,Bronx,7000006,003058,Montefiore Med Center - Jack D Weiler Hosp of A Einstein College Div,50 to 69,,M,Other Race,Spanish/Hispanic,4,Emergency,Home or Self Care,2017,133,Other lower respiratory disease,000,NO PROC,144,"Respiratory signs, symptoms & minor diagnoses",04,Diseases and Disorders of the Respiratory System,2,Moderate,Minor,Medical,Medicare,Medicaid,,,N,Y,39918.71,7303.47
New York City,Bronx,7000006,003058,Montefiore Med Center - Jack D Weiler Hosp of A Einstein College Div,50 to 69,104,M,Other Race,Spanish/Hispanic,4,Emergency,Home or Self Care,2017,125,Acute bronchitis,041,OT NON-OR THER PRC RESP,144,"Respiratory signs, symptoms & minor diagnoses",04,Diseases and Disorders of the Respiratory System,2,Moderate,Moderate,Medical,Medicaid,,,,N,Y,40116.37,8687.07
New York City,Bronx,7000006,003058,Montefiore Med Center - Jack D Weiler Hosp of A Einstein College Div,70 or Older,104,F,Other Race,Spanish/Hispanic,1,Emergency,Home or Self Care,2017,125,Acute bronchitis,000,NO PROC,144,"Respiratory signs, symptoms & minor diagnoses",04,Diseases and Disorders of the Respiratory System,3,Major,Moderate,Medical,Medicare,Medicaid,,,N,Y,15675.87,2883.36
New York City,Manhattan,7002024,001456,Mount Sinai Hospital,50 to 69,104,F,Black/African American,Not Span/Hispanic,4,Elective,Home w/ Home Health Services,2017,133,Other lower respiratory disease,000,NO PROC,144,"Respiratory signs, symptoms & minor diagnoses",04,Diseases and Disorders of the Respiratory System,3,Major,Moderate,Medical,Medicare,Medicaid,Self-Pay,,N,N,34947.57,11476.15
New York City,Manhattan,7002024,001456,Mount Sinai Hospital,18 to 29,112,F,White,Not Span/Hispanic,2,Elective,Home or Self Care,2017,133,Other lower respiratory disease,047,DX CARDIAC CATHETERIZTN,144,"Respiratory signs, symptoms & minor diagnoses",04,Diseases and Disorders of the Respiratory System,2,Moderate,Moderate,Medical,Private Health Insurance,Self-Pay,,,N,N,26884.60,7913.07
New York City,Manhattan,7002024,001456,Mount Sinai Hospital,0 to 17,104,M,Black/African American,Not Span/Hispanic,5,Emergency,Home w/ Home Health Services,2017,133,Other lower respiratory disease,216,RESP INTUB/MECH VENTIL,144,"Respiratory signs, symptoms & minor diagnoses",04,Diseases and Disorders of the Respiratory System,4,Extreme,Moderate,Medical,Medicaid,Medicaid,Self-Pay,,N,Y,72487.02,13135.89
New York City,Manhattan,7002024,001456,Mount Sinai Hospital,50 to 69,112,F,Other Race,Not Span/Hispanic,3,Emergency,Home w/ Home Health Services,2017,133,Other lower respiratory disease,058,HEMODIALYSIS,144,"Respiratory signs, symptoms & minor diagnoses",04,Diseases and Disorders of the Respiratory System,3,Major,Moderate,Medical,Medicare,Medicaid,Self-Pay,,N,Y,31708.36,9901.69
New York City,Manhattan,7002032,001466,Mount Sinai West,70 or Older,100,F,Black/African American,Not Span/Hispanic,2,Emergency,Home w/ Home Health Services,2017,125,Acute bronchitis,231,OTHER THERAPEUTIC PRCS,144,"Respiratory signs, symptoms & minor diagnoses",04,Diseases and Disorders of the Respiratory System,1,Minor,Moderate,Medical,Medicare,Medicare,Medicaid,,N,Y,17009.14,4609.64
Capital/Adirond,Delaware,1229700,000174,Delaware Valley Hospital Inc,30 to 49,138,M,White,Not Span/Hispanic,3,Emergency,Hosp Basd Medicare Approved Swing Bed,2017,125,Acute bronchitis,000,NO PROC,144,"Respiratory signs, symptoms & minor diagnoses",04,Diseases and Disorders of the Respiratory System,3,Major,Moderate,Medical,Medicare,Medicaid,,,N,N,12800.00,11514.73
Hudson Valley,Westchester,5904001,001072,Montefiore New Rochelle Hospital,70 or Older,105,M,White,Unknown,3,Emergency,Home or Self Care,2017,231,Other fractures,180,OTHER CT SCAN,144,"Respiratory signs, symptoms & minor diagnoses",04,Diseases and Disorders of the Respiratory System,1,Minor,Minor,Medical,Miscellaneous/Other,Self-Pay,,,N,N,37797.00,12530.67
New York City,Bronx,7000006,001168,Montefiore Medical Center-Wakefield Hospital,50 to 69,104,F,White,Not Span/Hispanic,2,Emergency,Home or Self Care,2017,133,Other lower respiratory disease,000,NO PROC,144,"Respiratory signs, symptoms & minor diagnoses",04,Diseases and Disorders of the Respiratory System,2,Moderate,Minor,Medical,Medicaid,,,,N,Y,39906.61,7598.39
New York City,Bronx,7000006,001169,Montefiore Medical Center - Henry & Lucy Moses Div,50 to 69,104,F,Other Race,Not Span/Hispanic,2,Emergency,Home or Self Care,2017,127,Chronic obstructive pulmonary disease and bronchiectasis,000,NO PROC,144,"Respiratory signs, symptoms & minor diagnoses",04,Diseases and Disorders of the Respiratory System,2,Moderate,Minor,Medical,Medicare,,,,N,Y,46012.80,13442.74
New York City,Bronx,7000006,001169,Montefiore Medical Center - Henry & Lucy Moses Div,50 to 69,104,F,Other Race,Spanish/Hispanic,10,Emergency,Home w/ Home Health Services,2017,125,Acute bronchitis,058,HEMODIALYSIS,144,"Respiratory signs, symptoms & minor diagnoses",04,Diseases and Disorders of the Respiratory System,2,Moderate,Moderate,Medical,Medicare,,,,N,Y,132263.99,26061.32
New York City,Bronx,7000006,001169,Montefiore Medical Center - Henry & Lucy Moses Div,50 to 69,104,F,Other Race,Spanish/Hispanic,2,Emergency,Home or Self Care,2017,133,Other lower respiratory disease,193,DX ULTRASOUND HEART,144,"Respiratory signs, symptoms & minor diagnoses",04,Diseases and Disorders of the Respiratory System,2,Moderate,Minor,Medical,Medicare,Medicaid,,,N,Y,24850.21,6547.59
New York City,Bronx,7000006,001169,Montefiore Medical Center - Henry & Lucy Moses Div,30 to 49,104,F,Black/African American,Not Span/Hispanic,3,Emergency,Home or Self Care,2017,133,Other lower respiratory disease,025,DX PRCS ON EAR,144,"Respiratory signs, symptoms & minor diagnoses",04,Diseases and Disorders of the Respiratory System,2,Moderate,Minor,Medical,Medicare,Medicaid,,,N,Y,36126.41,5773.59
New York City,Bronx,7000006,001169,Montefiore Medical Center - Henry & Lucy Moses Div,50 to 69,104,F,Black/African American,Not Span/Hispanic,1,Emergency,Home or Self Care,2017,125,Acute bronchitis,000,NO PROC,144,"Respiratory signs, symptoms & minor diagnoses",04,Diseases and Disorders of the Respiratory System,1,Minor,Minor,Medical,Medicaid,,,,N,Y,18219.24,2889.18
New York City,Bronx,7000006,001169,Montefiore Medical Center - Henry & Lucy Moses Div,70 or Older,104,F,White,Not Span/Hispanic,3,Emergency,Home w/ Home Health Services,2017,125,Acute bronchitis,231,OTHER THERAPEUTIC PRCS,144,"Respiratory signs, symptoms & minor diagnoses",04,Diseases and Disorders of the Respiratory System,2,Moderate,Major,Medical,Medicare,Medicaid,,,N,Y,32510.91,6607.84
New York City,Bronx,7000006,003058,Montefiore Med Center - Jack D Weiler Hosp of A Einstein College Div,30 to 49,104,M,White,Not Span/Hispanic,3,Emergency,Home or Self Care,2017,127,Chronic obstructive pulmonary disease and bronchiectasis,231,OTHER THERAPEUTIC PRCS,144,"Respiratory signs, symptoms & minor diagnoses",04,Diseases and Disorders of the Respiratory System,2,Moderate,Moderate,Medical,Medicare,,,,N,Y,28248.30,5403.50
New York City,Bronx,7000006,003058,Montefiore Med Center - Jack D Weiler Hosp of A Einstein College Div,50 to 69,104,F,Black/African American,Spanish/Hispanic,1,Emergency,Home or Self Care,2017,133,Other lower respiratory disease,231,OTHER THERAPEUTIC PRCS,144,"Respiratory signs, symptoms & minor diagnoses",04,Diseases and Disorders of the Respiratory System,2,Moderate,Moderate,Medical,Medicare,Medicaid,,,N,Y,14652.37,2523.54
New York City,Kings,7001003,001288,Brooklyn Hospital Center - Downtown Campus,50 to 69,112,M,Black/African American,Unknown,7,Urgent,Inpatient Rehabilitation Facility,2017,133,Other lower respiratory disease,058,HEMODIALYSIS,144,"Respiratory signs, symptoms & minor diagnoses",04,Diseases and Disorders of the Respiratory System,3,Major,Moderate,Medical,Medicare,Blue Cross/Blue Shield,Self-Pay,,N,N,47171.27,8938.04
New York City,Kings,7001003,001288,Brooklyn Hospital Center - Downtown Campus,70 or Older,112,M,Black/African American,Unknown,8,Emergency,Home or Self Care,2017,125,Acute bronchitis,231,OTHER THERAPEUTIC PRCS,144,"Respiratory signs, symptoms & minor diagnoses",04,Diseases and Disorders of the Respiratory System,2,Moderate,Moderate,Medical,Medicare,Medicare,Self-Pay,,N,Y,61148.99,11576.36
New York City,Kings,7001003,001288,Brooklyn Hospital Center - Downtown Campus,70 or Older,112,F,Black/African American,Unknown,4,Emergency,Home w/ Home Health Services,2017,125,Acute bronchitis,000,NO PROC,144,"Respiratory signs, symptoms & minor diagnoses",04,Diseases and Disorders of the Respiratory System,3,Major,Major,Medical,Medicare,Self-Pay,,,N,Y,50523.92,8581.90
New York City,Kings,7001003,001288,Brooklyn Hospital Center - Downtown Campus,70 or Older,112,M,Black/African American,Unknown,3,Emergency,Home or Self Care,2017,125,Acute bronchitis,000,NO PROC,144,"Respiratory signs, symptoms & minor diagnoses",04,Diseases and Disorders of the Respiratory System,2,Moderate,Major,Medical,Medicare,Medicare,Self-Pay,,N,Y,45462.95,7411.30
New York City,Kings,7001003,001288,Brooklyn Hospital Center - Downtown Campus,50 to 69,112,M,Black/African American,Unknown,1,Emergency,Home or Self Care,2017,127,Chronic obstructive pulmonary disease and bronchiectasis,000,NO PROC,144,"Respiratory signs, symptoms & minor diagnoses",04,Diseases and Disorders of the Respiratory System,2,Moderate,Moderate,Medical,Medicare,Medicaid,Self-Pay,,N,Y,8778.04,1782.64
New York City,Kings,7001003,001288,Brooklyn Hospital Center - Downtown Campus,70 or Older,112,M,Black/African American,Unknown,5,Emergency,Home w/ Home Health Services,2017,125,Acute bronchitis,000,NO PROC,144,"Respiratory signs, symptoms & minor diagnoses",04,Diseases and Disorders of the Respiratory System,2,Moderate,Major,Medical,Medicare,Medicare,Self-Pay,,N,Y,47469.67,8393.97
New York City,Kings,7001003,001288,Brooklyn Hospital Center - Downtown Campus,70 or Older,112,M,Black/African American,Not Span/Hispanic,5,Emergency,Home or Self Care,2017,125,Acute bronchitis,000,NO PROC,144,"Respiratory signs, symptoms & minor diagnoses",04,Diseases and Disorders of the Respiratory System,3,Major,Moderate,Medical,Medicare,Blue Cross/Blue Shield,Self-Pay,,N,Y,43113.59,8294.34
New York City,Kings,7001037,001320,University Hospital of Brooklyn,50 to 69,112,F,Black/African American,Not Span/Hispanic,3,Emergency,Home or Self Care,2017,133,Other lower respiratory disease,180,OTHER CT SCAN,144,"Respiratory signs, symptoms & minor diagnoses",04,Diseases and Disorders of the Respiratory System,2,Moderate,Moderate,Medical,Private Health Insurance,Medicaid,Self-Pay,,N,Y,24536.00,19144.89
New York City,Kings,7001037,001320,University Hospital of Brooklyn,50 to 69,112,M,Black/African American,Not Span/Hispanic,1,Emergency,Home or Self Care,2017,127,Chronic obstructive pulmonary disease and bronchiectasis,041,OT NON-OR THER PRC RESP,144,"Respiratory signs, symptoms & minor diagnoses",04,Diseases and Disorders of the Respiratory System,1,Minor,Minor,Medical,Private Health Insurance,Medicaid,Self-Pay,,N,Y,9119.45,5328.46
New York City,Kings,7002002,001324,Mount Sinai Brooklyn,50 to 69,112,M,White,Not Span/Hispanic,8,Emergency,Left Against Medical Advice,2017,125,Acute bronchitis,231,OTHER THERAPEUTIC PRCS,144,"Respiratory signs, symptoms & minor diagnoses",04,Diseases and Disorders of the Respiratory System,3,Major,Moderate,Medical,Medicare,Blue Cross/Blue Shield,Medicaid,,N,Y,63031.33,10154.14
New York City,Kings,7002002,001324,Mount Sinai Brooklyn,70 or Older,112,F,Black/African American,Not Span/Hispanic,8,Emergency,Home w/ Home Health Services,2017,125,Acute bronchitis,193,DX ULTRASOUND HEART,144,"Respiratory signs, symptoms & minor diagnoses",04,Diseases and Disorders of the Respiratory System,3,Major,Moderate,Medical,Medicare,Medicaid,Self-Pay,,N,Y,59070.65,9862.41
New York City,Manhattan,7002002,001439,Mount Sinai Beth Israel,50 to 69,112,M,Black/African American,Not Span/Hispanic,7,Emergency,Home or Self Care,2017,133,Other lower respiratory disease,069,ESOPHAGEAL DILATATION,144,"Respiratory signs, symptoms & minor diagnoses",04,Diseases and Disorders of the Respiratory System,3,Major,Moderate,Medical,Medicaid,Medicaid,Self-Pay,,N,N,60333.25,18747.60