Hospital Service Area,Hospital County,Operating Certificate Number,Permanent Facility Id,Facility Name,Age Group,Zip Code - 3 digits,Gender,Race,Ethnicity,Length of Stay,Type of Admission,Patient Disposition,Discharge Year,CCS Diagnosis Code,CCS Diagnosis Description,CCS Procedure Code,CCS Procedure Description,APR DRG Code,APR DRG Description,APR MDC Code,APR MDC Description,APR Severity of Illness Code,APR Severity of Illness Description,APR Risk of Mortality,APR Medical Surgical Description,Payment Typology 1,Payment Typology 2,Payment Typology 3,Birth Weight,Abortion Edit Indicator,Emergency Department Indicator,Total Charges,Total Costs
New York City,Manhattan,7002001,001438,Bellevue Hospital Center,50 to 69,100,M,Black/African American,Not Span/Hispanic,62,Emergency,Skilled Nursing Home,2017,133,Other lower respiratory disease,216,RESP INTUB/MECH VENTIL,144,"Respiratory signs, symptoms & minor diagnoses",04,Diseases and Disorders of the Respiratory System,2,Moderate,Moderate,Medical,Self-Pay,,,,N,Y,300774.52,193923.77
New York City,Manhattan,7002001,001438,Bellevue Hospital Center,50 to 69,100,M,Black/African American,Not Span/Hispanic,1,Emergency,Left Against Medical Advice,2017,133,Other lower respiratory disease,041,OT NON-OR THER PRC RESP,144,"Respiratory signs, symptoms & minor diagnoses",04,Diseases and Disorders of the Respiratory System,2,Moderate,Moderate,Medical,Self-Pay,,,,N,Y,7235.09,4664.81
New York City,Manhattan,7002001,001438,Bellevue Hospital Center,70 or Older,104,F,Other Race,Spanish/Hispanic,1,Emergency,Home or Self Care,2017,133,Other lower respiratory disease,041,OT NON-OR THER PRC RESP,144,"Respiratory signs, symptoms & minor diagnoses",04,Diseases and Disorders of the Respiratory System,2,Moderate,Moderate,Medical,Self-Pay,,,,N,Y,7298.89,4705.94
New York City,Manhattan,7002001,001438,Bellevue Hospital Center,30 to 49,113,M,Other Race,Not Span/Hispanic,4,Emergency,Home or Self Care,2017,125,Acute bronchitis,000,NO PROC,144,"Respiratory signs, symptoms & minor diagnoses",04,Diseases and Disorders of the Respiratory System,1,Minor,Minor,Medical,Medicaid,Medicaid,,,N,Y,24667.51,15904.33
New York City,Manhattan,7002001,001438,Bellevue Hospital Center,18 to 29,117,M,Black/African American,Not Span/Hispanic,1,Emergency,Left Against Medical Advice,2017,133,Other lower respiratory disease,000,NO PROC,144,"Respiratory signs, symptoms & minor diagnoses",04,Diseases and Disorders of the Respiratory System,1,Minor,Minor,Medical,Medicaid,Medicaid,,,N,Y,7091.88,4572.48
New York City,Manhattan,7002001,001438,Bellevue Hospital Center,50 to 69,114,M,Black/African American,Not Span/Hispanic,1,Emergency,Home or Self Care,2017,133,Other lower respiratory disease,000,NO PROC,144,"Respiratory signs, symptoms & minor diagnoses",04,Diseases and Disorders of the Respiratory System,1,Minor,Minor,Medical,Medicare,Medicare,Medicaid,,N,Y,6826.61,4401.44
New York City,Manhattan,7002001,001438,Bellevue Hospital Center,50 to 69,109,M,Other Race,Not Span/Hispanic,1,Emergency,Home or Self Care,2017,133,Other lower respiratory disease,000,NO PROC,144,"Respiratory signs, symptoms & minor diagnoses",04,Diseases and Disorders of the Respiratory System,1,Minor,Minor,Medical,Medicaid,Medicaid,,,N,Y,9085.45,5857.83
New York City,Manhattan,7002001,001438,Bellevue Hospital Center,30 to 49,113,F,Other Race,Not Span/Hispanic,5,Emergency,Home or Self Care,2017,133,Other lower respiratory disease,000,NO PROC,144,"Respiratory signs, symptoms & minor diagnoses",04,Diseases and Disorders of the Respiratory System,1,Minor,Minor,Medical,Self-Pay,,,,N,Y,32804.01,21150.32
New York City,Manhattan,7002001,001438,Bellevue Hospital Center,0 to 17,112,M,White,Not Span/Hispanic,5,Emergency,Another Type Not Listed,2017,231,Other fractures,180,OTHER CT SCAN,144,"Respiratory signs, symptoms & minor diagnoses",04,Diseases and Disorders of the Respiratory System,2,Moderate,Minor,Medical,Miscellaneous/Other,Blue Cross/Blue Shield,,,N,Y,44425.94,28643.54
New York City,Manhattan,7002001,001438,Bellevue Hospital Center,50 to 69,100,M,Other Race,Not Span/Hispanic,7,Emergency,Home w/ Home Health Services,2017,125,Acute bronchitis,231,OTHER THERAPEUTIC PRCS,144,"Respiratory signs, symptoms & minor diagnoses",04,Diseases and Disorders of the Respiratory System,2,Moderate,Moderate,Medical,Medicaid,Medicaid,,,N,Y,40186.80,25910.36
New York City,Manhattan,7002001,001438,Bellevue Hospital Center,18 to 29,100,F,Other Race,Not Span/Hispanic,1,Elective,Home or Self Care,2017,133,Other lower respiratory disease,037,DX BRONCHOSCOPY & BIOPS,144,"Respiratory signs, symptoms & minor diagnoses",04,Diseases and Disorders of the Respiratory System,1,Minor,Minor,Medical,Medicaid,,,,N,N,2927.39,1887.43
New York City,Manhattan,7002001,001438,Bellevue Hospital Center,50 to 69,112,M,Other Race,Not Span/Hispanic,4,Emergency,Home or Self Care,2017,125,Acute bronchitis,193,DX ULTRASOUND HEART,144,"Respiratory signs, symptoms & minor diagnoses",04,Diseases and Disorders of the Respiratory System,2,Moderate,Moderate,Medical,Medicare,Medicare,,,N,Y,25744.53,16598.73
New York City,Manhattan,7002001,001438,Bellevue Hospital Center,30 to 49,100,M,Other Race,Not Span/Hispanic,16,Emergency,Skilled Nursing Home,2017,126,Other upper respiratory infections,231,OTHER THERAPEUTIC PRCS,144,"Respiratory signs, symptoms & minor diagnoses",04,Diseases and Disorders of the Respiratory System,4,Extreme,Major,Medical,Medicare,Medicare,Medicaid,,N,Y,88298.58,56930.33
New York City,Manhattan,7002001,001438,Bellevue Hospital Center,50 to 69,104,F,Other Race,Not Span/Hispanic,3,Emergency,Home or Self Care,2017,125,Acute bronchitis,058,HEMODIALYSIS,144,"Respiratory signs, symptoms & minor diagnoses",04,Diseases and Disorders of the Respiratory System,3,Major,Major,Medical,Medicaid,,,,N,Y,22468.27,14486.37
New York City,Manhattan,7002001,001438,Bellevue Hospital Center,30 to 49,100,M,Black/African American,Not Span/Hispanic,1,Emergency,Home or Self Care,2017,133,Other lower respiratory disease,193,DX ULTRASOUND HEART,144,"Respiratory signs, symptoms & minor diagnoses",04,Diseases and Disorders of the Respiratory System,2,Moderate,Minor,Medical,Self-Pay,,,,N,Y,9953.29,6417.36
New York City,Manhattan,7002001,001438,Bellevue Hospital Center,50 to 69,100,M,Other Race,Not Span/Hispanic,11,Emergency,Skilled Nursing Home,2017,127,Chronic obstructive pulmonary disease and bronchiectasis,039,INCISION OF PLEURA,144,"Respiratory signs, symptoms & minor diagnoses",04,Diseases and Disorders of the Respiratory System,3,Major,Moderate,Medical,Medicaid,,,,N,Y,63885.02,41189.74
New York City,Manhattan,7002001,001438,Bellevue Hospital Center,18 to 29,113,F,Other Race,Spanish/Hispanic,1,Emergency,Home or Self Care,2017,133,Other lower respiratory disease,000,NO PROC,144,"Respiratory signs, symptoms & minor diagnoses",04,Diseases and Disorders of the Respiratory System,1,Minor,Minor,Medical,Self-Pay,,,,N,Y,8385.38,5406.46
New York City,Manhattan,7002001,001438,Bellevue Hospital Center,30 to 49,100,M,White,Not Span/Hispanic,3,Emergency,Psychiatric Hospital or Unit of Hosp,2017,125,Acute bronchitis,231,OTHER THERAPEUTIC PRCS,144,"Respiratory signs, symptoms & minor diagnoses",04,Diseases and Disorders of the Respiratory System,2,Moderate,Minor,Medical,Medicare,,,,N,Y,20564.79,13259.11
New York City,Manhattan,7002001,001438,Bellevue Hospital Center,50 to 69,100,F,Other Race,Spanish/Hispanic,1,Emergency,Home or Self Care,2017,133,Other lower respiratory disease,000,NO PROC,144,"Respiratory signs, symptoms & minor diagnoses",04,Diseases and Disorders of the Respiratory System,1,Minor,Minor,Medical,Medicare,Blue Cross/Blue Shield,,,N,Y,7161.62,4617.44
New York City,Manhattan,7002001,001438,Bellevue Hospital Center,50 to 69,100,M,Black/African American,Not Span/Hispanic,1,Emergency,Left Against Medical Advice,2017,133,Other lower respiratory disease,180,OTHER CT SCAN,144,"Respiratory signs, symptoms & minor diagnoses",04,Diseases and Disorders of the Respiratory System,2,Moderate,Minor,Medical,Private Health Insurance,,,,N,Y,9172.08,5913.68
New York City,Manhattan,7002001,001438,Bellevue Hospital Center,70 or Older,112,F,Black/African American,Not Span/Hispanic,4,Emergency,Home or Self Care,2017,133,Other lower respiratory disease,058,HEMODIALYSIS,144,"Respiratory signs, symptoms & minor diagnoses",04,Diseases and Disorders of the Respiratory System,2,Moderate,Moderate,Medical,Medicare,Medicaid,,,N,Y,26734.39,17236.94
New York City,Manhattan,7002001,001438,Bellevue Hospital Center,70 or Older,112,M,White,Not Span/Hispanic,2,Emergency,Home or Self Care,2017,133,Other lower respiratory disease,041,OT NON-OR THER PRC RESP,144,"Respiratory signs, symptoms & minor diagnoses",04,Diseases and Disorders of the Respiratory System,2,Moderate,Moderate,Medical,Medicare,,,,N,Y,13852.22,8931.19
New York City,Manhattan,7002001,001438,Bellevue Hospital Center,50 to 69,100,M,White,Spanish/Hispanic,1,Emergency,Left Against Medical Advice,2017,133,Other lower respiratory disease,222,BLOOD TRANSFUSION,144,"Respiratory signs, symptoms & minor diagnoses",04,Diseases and Disorders of the Respiratory System,1,Minor,Minor,Medical,Medicaid,Medicaid,,,N,Y,9610.11,6196.10
New York City,Manhattan,7002001,001438,Bellevue Hospital Center,70 or Older,113,F,Other Race,Not Span/Hispanic,1,Emergency,Home or Self Care,2017,133,Other lower respiratory disease,000,NO PROC,144,"Respiratory signs, symptoms & minor diagnoses",04,Diseases and Disorders of the Respiratory System,2,Moderate,Moderate,Medical,Medicare,Medicaid,,,N,Y,7137.04,4601.59
New York City,Manhattan,7002001,001438,Bellevue Hospital Center,50 to 69,113,M,Other Race,Spanish/Hispanic,1,Emergency,Home or Self Care,2017,133,Other lower respiratory disease,201,CARDIAC STRESS TESTS,144,"Respiratory signs, symptoms & minor diagnoses",04,Diseases and Disorders of the Respiratory System,1,Minor,Minor,Medical,Medicaid,,,,N,Y,12542.47,8086.73
New York City,Manhattan,7002001,001438,Bellevue Hospital Center,50 to 69,100,M,Other Race,Not Span/Hispanic,2,Emergency,Home or Self Care,2017,125,Acute bronchitis,180,OTHER CT SCAN,144,"Respiratory signs, symptoms & minor diagnoses",04,Diseases and Disorders of the Respiratory System,3,Major,Moderate,Medical,Medicaid,Medicaid,,,N,Y,15169.52,9780.52
New York City,Manhattan,7002001,001438,Bellevue Hospital Center,0 to 17,100,M,Other Race,Not Span/Hispanic,1,Emergency,Home or Self Care,2017,224,Other perinatal conditions,041,OT NON-OR THER PRC RESP,144,"Respiratory signs, symptoms & minor diagnoses",04,Diseases and Disorders of the Respiratory System,1,Minor,Minor,Medical,Medicaid,Medicaid,,03700,N,Y,6778.50,4370.42
New York City,Manhattan,7002001,001438,Bellevue Hospital Center,50 to 69,100,F,Other Race,Not Span/Hispanic,2,Emergency,Home or Self Care,2017,125,Acute bronchitis,000,NO PROC,144,"Respiratory signs, symptoms & minor diagnoses",04,Diseases and Disorders of the Respiratory System,2,Moderate,Minor,Medical,Medicaid,,,,N,Y,15742.64,10150.04
New York City,Manhattan,7002001,001438,Bellevue Hospital Center,50 to 69,112,F,Black/African American,Not Span/Hispanic,2,Emergency,Home or Self Care,2017,125,Acute bronchitis,000,NO PROC,144,"Respiratory signs, symptoms & minor diagnoses",04,Diseases and Disorders of the Respiratory System,3,Major,Moderate,Medical,Medicare,Medicare,,,N,Y,13347.42,8605.72
New York City,Manhattan,7002001,001438,Bellevue Hospital Center,70 or Older,100,F,White,Not Span/Hispanic,2,Emergency,Psychiatric Hospital or Unit of Hosp,2017,133,Other lower respiratory disease,000,NO PROC,144,"Respiratory signs, symptoms & minor diagnoses",04,Diseases and Disorders of the Respiratory System,2,Moderate,Moderate,Medical,Medicare,Medicaid,,,N,N,14891.60,9601.33
New York City,Manhattan,7002001,001438,Bellevue Hospital Center,50 to 69,112,M,Black/African American,Not Span/Hispanic,3,Emergency,Home or Self Care,2017,127,Chronic obstructive pulmonary disease and bronchiectasis,231,OTHER THERAPEUTIC PRCS,144,"Respiratory signs, symptoms & minor diagnoses",04,Diseases and Disorders of the Respiratory System,1,Minor,Minor,Medical,Medicaid,Medicaid,,,N,Y,18554.43,11962.93
New York City,Manhattan,7002001,001438,Bellevue Hospital Center,0 to 17,112,M,Other Race,Spanish/Hispanic,1,Emergency,Home or Self Care,2017,133,Other lower respiratory disease,222,BLOOD TRANSFUSION,144,"Respiratory signs, symptoms & minor diagnoses",04,Diseases and Disorders of the Respiratory System,2,Moderate,Minor,Medical,Medicaid,Medicaid,,,N,Y,6929.73,4467.93
New York City,Manhattan,7002001,001438,Bellevue Hospital Center,70 or Older,104,F,Other Race,Spanish/Hispanic,3,Emergency,Home or Self Care,2017,133,Other lower respiratory disease,041,OT NON-OR THER PRC RESP,144,"Respiratory signs, symptoms & minor diagnoses",04,Diseases and Disorders of the Respiratory System,1,Minor,Minor,Medical,Medicaid,,,,N,Y,17965.39,11583.15
New York City,Manhattan,7002001,001438,Bellevue Hospital Center,70 or Older,112,F,Other Race,Spanish/Hispanic,4,Emergency,Home w/ Home Health Services,2017,133,Other lower respiratory disease,183,ROUTINE CHEST X-RAY,144,"Respiratory signs, symptoms & minor diagnoses",04,Diseases and Disorders of the Respiratory System,2,Moderate,Moderate,Medical,Medicare,Medicare,Medicaid,,N,Y,22525.66,14523.37
New York City,Manhattan,7002001,001438,Bellevue Hospital Center,70 or Older,112,F,Other Race,Spanish/Hispanic,1,Emergency,Home or Self Care,2017,231,Other fractures,177,COMP AXIAL TOMOGR (CT),144,"Respiratory signs, symptoms & minor diagnoses",04,Diseases and Disorders of the Respiratory System,2,Moderate,Minor,Medical,Medicare,Medicaid,,,N,Y,8750.11,5641.62
New York City,Manhattan,7002001,001438,Bellevue Hospital Center,50 to 69,100,M,White,Not Span/Hispanic,1,Emergency,Home or Self Care,2017,125,Acute bronchitis,041,OT NON-OR THER PRC RESP,144,"Respiratory signs, symptoms & minor diagnoses",04,Diseases and Disorders of the Respiratory System,2,Moderate,Minor,Medical,Medicare,Medicaid,,,N,Y,10527.78,6787.77
New York City,Manhattan,7002001,001438,Bellevue Hospital Center,50 to 69,100,M,White,Not Span/Hispanic,5,Emergency,Home or Self Care,2017,133,Other lower respiratory disease,180,OTHER CT SCAN,144,"Respiratory signs, symptoms & minor diagnoses",04,Diseases and Disorders of the Respiratory System,2,Moderate,Moderate,Medical,Medicaid,Medicaid,,,N,Y,29638.34,19109.26
New York City,Manhattan,7002001,001438,Bellevue Hospital Center,50 to 69,100,F,Other Race,Spanish/Hispanic,1,Emergency,Home or Self Care,2017,133,Other lower respiratory disease,000,NO PROC,144,"Respiratory signs, symptoms & minor diagnoses",04,Diseases and Disorders of the Respiratory System,2,Moderate,Moderate,Medical,Medicaid,,,,N,Y,6870.41,4429.68
New York City,Manhattan,7002001,001438,Bellevue Hospital Center,50 to 69,127,M,Black/African American,Not Span/Hispanic,1,Emergency,Home or Self Care,2017,133,Other lower respiratory disease,202,ELECTROCARDIOGRAM,144,"Respiratory signs, symptoms & minor diagnoses",04,Diseases and Disorders of the Respiratory System,1,Minor,Minor,Medical,Private Health Insurance,,,,N,Y,8198.44,5285.93
New York City,Manhattan,7002001,001438,Bellevue Hospital Center,70 or Older,112,F,Black/African American,Not Span/Hispanic,3,Emergency,Home or Self Care,2017,133,Other lower respiratory disease,203,ELECTROGR CARDIAC MONIT,144,"Respiratory signs, symptoms & minor diagnoses",04,Diseases and Disorders of the Respiratory System,1,Minor,Moderate,Medical,Medicaid,,,,N,Y,24872.43,16036.45
New York City,Manhattan,7002001,001438,Bellevue Hospital Center,30 to 49,113,M,Other Race,Not Span/Hispanic,4,Emergency,Left Against Medical Advice,2017,133,Other lower respiratory disease,041,OT NON-OR THER PRC RESP,144,"Respiratory signs, symptoms & minor diagnoses",04,Diseases and Disorders of the Respiratory System,2,Moderate,Minor,Medical,Medicaid,Medicaid,,,N,N,27888.72,17981.20
New York City,Manhattan,7002001,001438,Bellevue Hospital Center,18 to 29,114,M,Other Race,Spanish/Hispanic,2,Emergency,Home or Self Care,2017,133,Other lower respiratory disease,037,DX BRONCHOSCOPY & BIOPS,144,"Respiratory signs, symptoms & minor diagnoses",04,Diseases and Disorders of the Respiratory System,1,Minor,Minor,Medical,Self-Pay,,,,N,Y,18564.69,11969.55
New York City,Manhattan,7002001,001438,Bellevue Hospital Center,18 to 29,112,F,Black/African American,Not Span/Hispanic,7,Emergency,Home or Self Care,2017,133,Other lower respiratory disease,037,DX BRONCHOSCOPY & BIOPS,144,"Respiratory signs, symptoms & minor diagnoses",04,Diseases and Disorders of the Respiratory System,3,Major,Moderate,Medical,Medicaid,,,,N,Y,43259.65,27891.57
New York City,Manhattan,7002001,001438,Bellevue Hospital Center,30 to 49,112,M,Other Race,Not Span/Hispanic,1,Emergency,Left Against Medical Advice,2017,133,Other lower respiratory disease,180,OTHER CT SCAN,144,"Respiratory signs, symptoms & minor diagnoses",04,Diseases and Disorders of the Respiratory System,2,Moderate,Minor,Medical,Medicaid,Medicaid,,,N,Y,8927.52,5756.00
New York City,Manhattan,7002001,001438,Bellevue Hospital Center,50 to 69,112,M,Other Race,Spanish/Hispanic,1,Emergency,Home or Self Care,2017,231,Other fractures,222,BLOOD TRANSFUSION,144,"Respiratory signs, symptoms & minor diagnoses",04,Diseases and Disorders of the Respiratory System,2,Moderate,Minor,Medical,Medicaid,,,,N,Y,11112.35,7164.67
New York City,Manhattan,7002001,001438,Bellevue Hospital Center,50 to 69,104,M,Black/African American,Not Span/Hispanic,5,Emergency,Home or Self Care,2017,133,Other lower respiratory disease,041,OT NON-OR THER PRC RESP,144,"Respiratory signs, symptoms & minor diagnoses",04,Diseases and Disorders of the Respiratory System,2,Moderate,Moderate,Medical,Medicare,Medicare,Medicaid,,N,Y,30030.52,19362.12
New York City,Manhattan,7002001,001438,Bellevue Hospital Center,70 or Older,112,F,Other Race,Spanish/Hispanic,4,Emergency,Home or Self Care,2017,133,Other lower respiratory disease,000,NO PROC,144,"Respiratory signs, symptoms & minor diagnoses",04,Diseases and Disorders of the Respiratory System,1,Minor,Minor,Medical,Medicare,Medicaid,,,N,Y,22531.42,14527.09
New York City,Manhattan,7002001,001438,Bellevue Hospital Center,70 or Older,113,M,Other Race,Spanish/Hispanic,1,Emergency,Home or Self Care,2017,133,Other lower respiratory disease,041,OT NON-OR THER PRC RESP,144,"Respiratory signs, symptoms & minor diagnoses",04,Diseases and Disorders of the Respiratory System,1,Minor,Minor,Medical,Self-Pay,,,,N,Y,7586.34,4891.28
New York City,Manhattan,7002001,001438,Bellevue Hospital Center,30 to 49,100,F,Other Race,Not Span/Hispanic,2,Emergency,Home or Self Care,2017,133,Other lower respiratory disease,000,NO PROC,144,"Respiratory signs, symptoms & minor diagnoses",04,Diseases and Disorders of the Respiratory System,2,Moderate,Minor,Medical,Private Health Insurance,,,,N,Y,15014.23,9680.39
New York City,Manhattan,7002001,001438,Bellevue Hospital Center,50 to 69,114,M,Other Race,Not Span/Hispanic,1,Emergency,Home or Self Care,2017,127,Chronic obstructive pulmonary disease and bronchiectasis,041,OT NON-OR THER PRC RESP,144,"Respiratory signs, symptoms & minor diagnoses",04,Diseases and Disorders of the Respiratory System,3,Major,Moderate,Medical,Medicaid,,,,N,Y,7347.64,4737.38
New York City,Manhattan,7002001,001438,Bellevue Hospital Center,50 to 69,100,F,Other Race,Not Span/Hispanic,3,Emergency,Home or Self Care,2017,134,Other upper respiratory disease,000,NO PROC,144,"Respiratory signs, symptoms & minor diagnoses",04,Diseases and Disorders of the Respiratory System,3,Major,Major,Medical,Private Health Insurance,,,,N,Y,32338.73,20850.33
New York City,Manhattan,7002001,001438,Bellevue Hospital Center,50 to 69,100,M,White,Not Span/Hispanic,2,Emergency,Left Against Medical Advice,2017,133,Other lower respiratory disease,041,OT NON-OR THER PRC RESP,144,"Respiratory signs, symptoms & minor diagnoses",04,Diseases and Disorders of the Respiratory System,1,Minor,Moderate,Medical,Medicaid,,,,N,Y,20085.97,12950.39
New York City,Manhattan,7002001,001438,Bellevue Hospital Center,50 to 69,112,M,Other Race,Spanish/Hispanic,1,Emergency,Home or Self Care,2017,133,Other lower respiratory disease,183,ROUTINE CHEST X-RAY,144,"Respiratory signs, symptoms & minor diagnoses",04,Diseases and Disorders of the Respiratory System,3,Major,Major,Medical,Medicaid,Medicaid,,,N,N,7428.64,4789.60
New York City,Manhattan,7002001,001438,Bellevue Hospital Center,30 to 49,113,M,Black/African American,Not Span/Hispanic,2,Emergency,Home or Self Care,2017,133,Other lower respiratory disease,047,DX CARDIAC CATHETERIZTN,144,"Respiratory signs, symptoms & minor diagnoses",04,Diseases and Disorders of the Respiratory System,1,Minor,Moderate,Medical,Department of Corrections,,,,N,N,12889.27,8310.33
New York City,Manhattan,7002001,001438,Bellevue Hospital Center,30 to 49,113,F,Other Race,Not Span/Hispanic,2,Emergency,Home or Self Care,2017,133,Other lower respiratory disease,000,NO PROC,144,"Respiratory signs, symptoms & minor diagnoses",04,Diseases and Disorders of the Respiratory System,2,Moderate,Minor,Medical,Medicaid,Medicaid,,,N,Y,21079.60,13591.03
New York City,Manhattan,7002001,001438,Bellevue Hospital Center,70 or Older,100,F,Other Race,Not Span/Hispanic,3,Emergency,Home w/ Home Health Services,2017,231,Other fractures,183,ROUTINE CHEST X-RAY,144,"Respiratory signs, symptoms & minor diagnoses",04,Diseases and Disorders of the Respiratory System,2,Moderate,Moderate,Medical,Medicare,Medicare,Medicaid,,N,Y,18407.57,11868.24
New York City,Manhattan,7002001,001438,Bellevue Hospital Center,50 to 69,113,M,Other Race,Spanish/Hispanic,4,Emergency,Home or Self Care,2017,133,Other lower respiratory disease,000,NO PROC,144,"Respiratory signs, symptoms & minor diagnoses",04,Diseases and Disorders of the Respiratory System,1,Minor,Minor,Medical,Medicaid,,,,N,Y,23965.83,15451.92
New York City,Manhattan,7002001,001438,Bellevue Hospital Center,30 to 49,113,M,Other Race,Spanish/Hispanic,1,Elective,Home or Self Care,2017,133,Other lower respiratory disease,227,"OT DX PRC (INTERVW,EVAL",144,"Respiratory signs, symptoms & minor diagnoses",04,Diseases and Disorders of the Respiratory System,2,Moderate,Minor,Medical,Department of Corrections,,,,N,N,6110.00,3939.41
New York City,Manhattan,7002001,001438,Bellevue Hospital Center,30 to 49,112,M,White,Not Span/Hispanic,1,Emergency,Home or Self Care,2017,231,Other fractures,177,COMP AXIAL TOMOGR (CT),144,"Respiratory signs, symptoms & minor diagnoses",04,Diseases and Disorders of the Respiratory System,2,Moderate,Minor,Medical,Private Health Insurance,,,,N,Y,18798.12,12120.05
New York City,Manhattan,7002001,001438,Bellevue Hospital Center,50 to 69,100,F,Black/African American,Not Span/Hispanic,2,Emergency,Another Type Not Listed,2017,133,Other lower respiratory disease,193,DX ULTRASOUND HEART,144,"Respiratory signs, symptoms & minor diagnoses",04,Diseases and Disorders of the Respiratory System,2,Moderate,Minor,Medical,Medicare,Medicaid,,,N,N,17229.22,11108.51
New York City,Manhattan,7002001,001438,Bellevue Hospital Center,50 to 69,100,M,White,Not Span/Hispanic,5,Emergency,Home or Self Care,2017,125,Acute bronchitis,000,NO PROC,144,"Respiratory signs, symptoms & minor diagnoses",04,Diseases and Disorders of the Respiratory System,2,Moderate,Moderate,Medical,Medicaid,Medicaid,,,N,Y,27711.93,17867.21
New York City,Manhattan,7002001,001438,Bellevue Hospital Center,0 to 17,100,M,Other Race,Not Span/Hispanic,2,Emergency,Home or Self Care,2017,133,Other lower respiratory disease,193,DX ULTRASOUND HEART,144,"Respiratory signs, symptoms & minor diagnoses",04,Diseases and Disorders of the Respiratory System,1,Minor,Minor,Medical,Medicaid,Medicaid,,04500,N,Y,13097.98,8444.90