Hospital Service Area,Hospital County,Operating Certificate Number,Permanent Facility Id,Facility Name,Age Group,Zip Code - 3 digits,Gender,Race,Ethnicity,Length of Stay,Type of Admission,Patient Disposition,Discharge Year,CCS Diagnosis Code,CCS Diagnosis Description,CCS Procedure Code,CCS Procedure Description,APR DRG Code,APR DRG Description,APR MDC Code,APR MDC Description,APR Severity of Illness Code,APR Severity of Illness Description,APR Risk of Mortality,APR Medical Surgical Description,Payment Typology 1,Payment Typology 2,Payment Typology 3,Birth Weight,Abortion Edit Indicator,Emergency Department Indicator,Total Charges,Total Costs
Long Island,Nassau,2908000,000511,NYU Winthrop Hospital,50 to 69,117,F,White,Not Span/Hispanic,3,Urgent,Home or Self Care,2017,134,Other upper respiratory disease,000,NO PROC,144,"Respiratory signs, symptoms & minor diagnoses",04,Diseases and Disorders of the Respiratory System,2,Moderate,Minor,Medical,Medicare,Medicare,Medicaid,,N,Y,56839.81,12211.13
Long Island,Nassau,2908000,000511,NYU Winthrop Hospital,0 to 17,115,F,White,Not Span/Hispanic,4,Emergency,Home or Self Care,2017,125,Acute bronchitis,000,NO PROC,144,"Respiratory signs, symptoms & minor diagnoses",04,Diseases and Disorders of the Respiratory System,1,Minor,Minor,Medical,Private Health Insurance,,,03900,N,Y,22439.61,5188.40
Long Island,Nassau,2908000,000511,NYU Winthrop Hospital,50 to 69,,M,White,Not Span/Hispanic,1,Emergency,Home or Self Care,2017,125,Acute bronchitis,000,NO PROC,144,"Respiratory signs, symptoms & minor diagnoses",04,Diseases and Disorders of the Respiratory System,2,Moderate,Minor,Medical,Blue Cross/Blue Shield,,,,N,Y,35148.77,5186.59
Long Island,Nassau,2908000,000511,NYU Winthrop Hospital,0 to 17,117,F,White,Not Span/Hispanic,1,Emergency,Home or Self Care,2017,125,Acute bronchitis,000,NO PROC,144,"Respiratory signs, symptoms & minor diagnoses",04,Diseases and Disorders of the Respiratory System,2,Moderate,Minor,Medical,Blue Cross/Blue Shield,,,,N,Y,10400.93,2171.39
Long Island,Nassau,2908000,000511,NYU Winthrop Hospital,70 or Older,115,M,White,Not Span/Hispanic,6,Emergency,Home w/ Home Health Services,2017,010,Immunizations and screening for infectious disease,222,BLOOD TRANSFUSION,144,"Respiratory signs, symptoms & minor diagnoses",04,Diseases and Disorders of the Respiratory System,3,Major,Moderate,Medical,Medicare,Medicare,,,N,Y,92182.37,20782.35
Long Island,Nassau,2908000,000511,NYU Winthrop Hospital,70 or Older,117,M,White,Not Span/Hispanic,3,Emergency,Home or Self Care,2017,125,Acute bronchitis,000,NO PROC,144,"Respiratory signs, symptoms & minor diagnoses",04,Diseases and Disorders of the Respiratory System,2,Moderate,Minor,Medical,Medicare,Medicare,Blue Cross/Blue Shield,,N,Y,25062.40,5260.85
Long Island,Nassau,2908000,000511,NYU Winthrop Hospital,70 or Older,117,M,White,Not Span/Hispanic,2,Emergency,Home w/ Home Health Services,2017,244,Other injuries and conditions due to external causes,000,NO PROC,144,"Respiratory signs, symptoms & minor diagnoses",04,Diseases and Disorders of the Respiratory System,3,Major,Moderate,Medical,Medicare,Medicare,Blue Cross/Blue Shield,,N,Y,39737.70,8978.75
Long Island,Nassau,2908000,000511,NYU Winthrop Hospital,70 or Older,115,M,White,Not Span/Hispanic,5,Emergency,Home or Self Care,2017,133,Other lower respiratory disease,058,HEMODIALYSIS,144,"Respiratory signs, symptoms & minor diagnoses",04,Diseases and Disorders of the Respiratory System,3,Major,Major,Medical,Medicare,Medicare,Blue Cross/Blue Shield,,N,Y,55481.45,9905.85
Long Island,Nassau,2908000,000511,NYU Winthrop Hospital,0 to 17,115,M,White,Spanish/Hispanic,1,Emergency,Home or Self Care,2017,125,Acute bronchitis,000,NO PROC,144,"Respiratory signs, symptoms & minor diagnoses",04,Diseases and Disorders of the Respiratory System,1,Minor,Minor,Medical,Medicaid,,,,N,Y,21416.18,3647.77
Long Island,Nassau,2908000,000511,NYU Winthrop Hospital,70 or Older,110,M,White,Not Span/Hispanic,1,Emergency,Home or Self Care,2017,231,Other fractures,000,NO PROC,144,"Respiratory signs, symptoms & minor diagnoses",04,Diseases and Disorders of the Respiratory System,2,Moderate,Moderate,Medical,Medicare,Medicare,Private Health Insurance,,N,Y,58428.93,9405.96
Long Island,Nassau,2908000,000511,NYU Winthrop Hospital,70 or Older,115,M,White,Spanish/Hispanic,2,Emergency,Home or Self Care,2017,125,Acute bronchitis,000,NO PROC,144,"Respiratory signs, symptoms & minor diagnoses",04,Diseases and Disorders of the Respiratory System,2,Moderate,Moderate,Medical,Medicare,Medicare,,,N,Y,20846.04,3779.01
Long Island,Nassau,2908000,000511,NYU Winthrop Hospital,70 or Older,115,M,Other Race,Not Span/Hispanic,1,Emergency,Home or Self Care,2017,133,Other lower respiratory disease,000,NO PROC,144,"Respiratory signs, symptoms & minor diagnoses",04,Diseases and Disorders of the Respiratory System,3,Major,Major,Medical,Medicaid,Medicaid,,,N,Y,20881.29,4666.10
Long Island,Nassau,2908000,000511,NYU Winthrop Hospital,0 to 17,116,M,Black/African American,Not Span/Hispanic,1,Urgent,Home or Self Care,2017,133,Other lower respiratory disease,000,NO PROC,144,"Respiratory signs, symptoms & minor diagnoses",04,Diseases and Disorders of the Respiratory System,2,Moderate,Minor,Medical,Medicaid,Medicaid,,,N,N,6972.96,1299.72
Long Island,Nassau,2908000,000511,NYU Winthrop Hospital,70 or Older,110,M,White,Not Span/Hispanic,4,Emergency,Home w/ Home Health Services,2017,125,Acute bronchitis,000,NO PROC,144,"Respiratory signs, symptoms & minor diagnoses",04,Diseases and Disorders of the Respiratory System,2,Moderate,Moderate,Medical,Medicare,Medicare,,,N,Y,44813.49,9440.32
Long Island,Nassau,2908000,000511,NYU Winthrop Hospital,30 to 49,117,F,White,Not Span/Hispanic,2,Emergency,Home or Self Care,2017,133,Other lower respiratory disease,229,NONOP RMVL FOREIGN BODY,144,"Respiratory signs, symptoms & minor diagnoses",04,Diseases and Disorders of the Respiratory System,1,Minor,Minor,Medical,Federal/State/Local/VA,,,,N,Y,32442.14,9571.18
Long Island,Nassau,2908000,000511,NYU Winthrop Hospital,50 to 69,115,F,Black/African American,Not Span/Hispanic,5,Emergency,Home or Self Care,2017,130,Pleurisy; pneumothorax; pulmonary collapse,037,DX BRONCHOSCOPY & BIOPS,144,"Respiratory signs, symptoms & minor diagnoses",04,Diseases and Disorders of the Respiratory System,2,Moderate,Minor,Medical,Medicare,Medicare,Medicaid,,N,Y,100121.46,24016.16
Long Island,Nassau,2908000,000511,NYU Winthrop Hospital,50 to 69,115,M,White,Not Span/Hispanic,3,Emergency,Home w/ Home Health Services,2017,133,Other lower respiratory disease,054,OT VASC CATH; NOT HEART,144,"Respiratory signs, symptoms & minor diagnoses",04,Diseases and Disorders of the Respiratory System,2,Moderate,Moderate,Medical,Medicare,Medicare,Private Health Insurance,,N,Y,68432.34,11082.21
Long Island,Nassau,2908000,000511,NYU Winthrop Hospital,0 to 17,115,M,White,Spanish/Hispanic,1,Emergency,Home or Self Care,2017,125,Acute bronchitis,000,NO PROC,144,"Respiratory signs, symptoms & minor diagnoses",04,Diseases and Disorders of the Respiratory System,1,Minor,Minor,Medical,Self-Pay,,,,N,Y,22317.85,4579.92
Long Island,Nassau,2908000,000511,NYU Winthrop Hospital,70 or Older,115,M,White,Not Span/Hispanic,7,Urgent,Home w/ Home Health Services,2017,125,Acute bronchitis,000,NO PROC,144,"Respiratory signs, symptoms & minor diagnoses",04,Diseases and Disorders of the Respiratory System,2,Moderate,Moderate,Medical,Medicare,Medicare,,,N,Y,109173.49,26118.76
Long Island,Nassau,2908000,000511,NYU Winthrop Hospital,50 to 69,115,M,White,Not Span/Hispanic,1,Emergency,Home or Self Care,2017,133,Other lower respiratory disease,201,CARDIAC STRESS TESTS,144,"Respiratory signs, symptoms & minor diagnoses",04,Diseases and Disorders of the Respiratory System,1,Minor,Minor,Medical,Medicare,Medicare,,,N,Y,29706.75,6322.24
Long Island,Nassau,2908000,000511,NYU Winthrop Hospital,50 to 69,117,M,Black/African American,Not Span/Hispanic,1,Emergency,Home or Self Care,2017,231,Other fractures,000,NO PROC,144,"Respiratory signs, symptoms & minor diagnoses",04,Diseases and Disorders of the Respiratory System,1,Minor,Minor,Medical,Miscellaneous/Other,,,,N,Y,31018.93,5360.42
Long Island,Nassau,2908000,000511,NYU Winthrop Hospital,18 to 29,115,F,Black/African American,Not Span/Hispanic,2,Emergency,Home or Self Care,2017,125,Acute bronchitis,000,NO PROC,144,"Respiratory signs, symptoms & minor diagnoses",04,Diseases and Disorders of the Respiratory System,1,Minor,Minor,Medical,Private Health Insurance,,,,N,Y,35610.27,6118.58
Long Island,Nassau,2908000,000511,NYU Winthrop Hospital,70 or Older,115,M,White,Not Span/Hispanic,3,Emergency,Hospice - Home,2017,125,Acute bronchitis,000,NO PROC,144,"Respiratory signs, symptoms & minor diagnoses",04,Diseases and Disorders of the Respiratory System,3,Major,Major,Medical,Medicare,Medicare,Private Health Insurance,,N,Y,42824.22,8201.97
Long Island,Nassau,2908000,000511,NYU Winthrop Hospital,70 or Older,115,F,Other Race,Spanish/Hispanic,5,Emergency,Home w/ Home Health Services,2017,125,Acute bronchitis,000,NO PROC,144,"Respiratory signs, symptoms & minor diagnoses",04,Diseases and Disorders of the Respiratory System,2,Moderate,Minor,Medical,Medicare,Medicare,Blue Cross/Blue Shield,,N,Y,83500.72,19419.43
Long Island,Nassau,2908000,000511,NYU Winthrop Hospital,70 or Older,110,F,White,Not Span/Hispanic,4,Trauma,Skilled Nursing Home,2017,231,Other fractures,000,NO PROC,144,"Respiratory signs, symptoms & minor diagnoses",04,Diseases and Disorders of the Respiratory System,2,Moderate,Minor,Medical,Medicare,Medicare,,,N,Y,87533.17,18258.55
Long Island,Nassau,2908000,000511,NYU Winthrop Hospital,30 to 49,115,F,Black/African American,Not Span/Hispanic,1,Emergency,Home or Self Care,2017,133,Other lower respiratory disease,000,NO PROC,144,"Respiratory signs, symptoms & minor diagnoses",04,Diseases and Disorders of the Respiratory System,1,Minor,Minor,Medical,Private Health Insurance,,,,N,Y,28394.53,5198.00
Long Island,Nassau,2908000,000511,NYU Winthrop Hospital,50 to 69,115,F,White,Unknown,4,Emergency,Home or Self Care,2017,125,Acute bronchitis,000,NO PROC,144,"Respiratory signs, symptoms & minor diagnoses",04,Diseases and Disorders of the Respiratory System,3,Major,Moderate,Medical,Blue Cross/Blue Shield,Medicaid,,,N,Y,36625.33,7998.94
Long Island,Nassau,2908000,000511,NYU Winthrop Hospital,70 or Older,115,F,White,Not Span/Hispanic,7,Emergency,Home or Self Care,2017,200,Other skin disorders,040,OT DX PRCS OF RESP TRCT,144,"Respiratory signs, symptoms & minor diagnoses",04,Diseases and Disorders of the Respiratory System,2,Moderate,Minor,Medical,Medicare,Medicare,Private Health Insurance,,N,Y,121979.40,28605.52
Long Island,Nassau,2908000,000511,NYU Winthrop Hospital,30 to 49,117,F,White,Not Span/Hispanic,6,Emergency,Home or Self Care,2017,133,Other lower respiratory disease,047,DX CARDIAC CATHETERIZTN,144,"Respiratory signs, symptoms & minor diagnoses",04,Diseases and Disorders of the Respiratory System,2,Moderate,Minor,Medical,Medicaid,Medicaid,,,N,Y,87413.90,22399.14
Long Island,Nassau,2908000,000511,NYU Winthrop Hospital,50 to 69,112,F,Black/African American,Not Span/Hispanic,5,Emergency,Home or Self Care,2017,133,Other lower respiratory disease,070,UP GASTRO ENDOSC/BIOPSY,144,"Respiratory signs, symptoms & minor diagnoses",04,Diseases and Disorders of the Respiratory System,2,Moderate,Minor,Medical,Medicare,Medicare,,,N,Y,106580.01,23081.53
Long Island,Nassau,2908000,000511,NYU Winthrop Hospital,70 or Older,115,F,White,Not Span/Hispanic,1,Emergency,Home or Self Care,2017,133,Other lower respiratory disease,210,OTHER RADIOISOTOPE SCAN,144,"Respiratory signs, symptoms & minor diagnoses",04,Diseases and Disorders of the Respiratory System,2,Moderate,Moderate,Medical,Medicare,Medicare,,,N,Y,44061.77,8499.48
Long Island,Nassau,2908000,000511,NYU Winthrop Hospital,50 to 69,110,M,White,Spanish/Hispanic,2,Emergency,Home or Self Care,2017,130,Pleurisy; pneumothorax; pulmonary collapse,201,CARDIAC STRESS TESTS,144,"Respiratory signs, symptoms & minor diagnoses",04,Diseases and Disorders of the Respiratory System,1,Minor,Minor,Medical,Blue Cross/Blue Shield,,,,N,N,19230.00,5848.72
Long Island,Nassau,2908000,000511,NYU Winthrop Hospital,18 to 29,115,M,White,Not Span/Hispanic,3,Emergency,Home w/ Home Health Services,2017,125,Acute bronchitis,223,ENTERAL/PARENTERAL NUTR,144,"Respiratory signs, symptoms & minor diagnoses",04,Diseases and Disorders of the Respiratory System,4,Extreme,Major,Medical,Medicaid,Medicaid,,,N,Y,29612.45,5947.39
Long Island,Nassau,2908000,000511,NYU Winthrop Hospital,0 to 17,110,M,White,Not Span/Hispanic,1,Emergency,Home or Self Care,2017,125,Acute bronchitis,231,OTHER THERAPEUTIC PRCS,144,"Respiratory signs, symptoms & minor diagnoses",04,Diseases and Disorders of the Respiratory System,1,Minor,Minor,Medical,Private Health Insurance,,,,N,Y,15669.99,3051.33
Long Island,Nassau,2908000,000511,NYU Winthrop Hospital,50 to 69,117,F,White,Not Span/Hispanic,2,Emergency,Home or Self Care,2017,133,Other lower respiratory disease,193,DX ULTRASOUND HEART,144,"Respiratory signs, symptoms & minor diagnoses",04,Diseases and Disorders of the Respiratory System,3,Major,Moderate,Medical,Private Health Insurance,Medicare,Medicare,,N,Y,65914.33,9430.26
Long Island,Nassau,2908000,000511,NYU Winthrop Hospital,70 or Older,115,F,White,Not Span/Hispanic,5,Emergency,Home w/ Home Health Services,2017,125,Acute bronchitis,000,NO PROC,144,"Respiratory signs, symptoms & minor diagnoses",04,Diseases and Disorders of the Respiratory System,4,Extreme,Extreme,Medical,Medicare,Medicare,Blue Cross/Blue Shield,,N,Y,52952.82,10590.59
Long Island,Nassau,2908000,000511,NYU Winthrop Hospital,70 or Older,115,F,White,Not Span/Hispanic,7,Emergency,Home w/ Home Health Services,2017,125,Acute bronchitis,000,NO PROC,144,"Respiratory signs, symptoms & minor diagnoses",04,Diseases and Disorders of the Respiratory System,2,Moderate,Moderate,Medical,Medicare,Medicare,,,N,Y,51782.69,10950.08
Long Island,Nassau,2908000,000511,NYU Winthrop Hospital,70 or Older,110,F,White,Not Span/Hispanic,5,Emergency,Skilled Nursing Home,2017,133,Other lower respiratory disease,000,NO PROC,144,"Respiratory signs, symptoms & minor diagnoses",04,Diseases and Disorders of the Respiratory System,2,Moderate,Major,Medical,Medicare,Medicare,Private Health Insurance,,N,Y,71985.43,18465.03
Long Island,Nassau,2908000,000511,NYU Winthrop Hospital,70 or Older,117,F,White,Not Span/Hispanic,2,Emergency,Home or Self Care,2017,133,Other lower respiratory disease,065,BONE MARROW BIOPSY,144,"Respiratory signs, symptoms & minor diagnoses",04,Diseases and Disorders of the Respiratory System,2,Moderate,Moderate,Medical,Medicare,Medicare,Private Health Insurance,,N,Y,55749.44,6510.63
Long Island,Nassau,2908000,000511,NYU Winthrop Hospital,70 or Older,117,M,White,Not Span/Hispanic,2,Emergency,Home w/ Home Health Services,2017,125,Acute bronchitis,000,NO PROC,144,"Respiratory signs, symptoms & minor diagnoses",04,Diseases and Disorders of the Respiratory System,2,Moderate,Major,Medical,Medicare,Medicare,Private Health Insurance,,N,Y,43262.91,9649.80
Long Island,Nassau,2908000,000511,NYU Winthrop Hospital,70 or Older,115,M,White,Not Span/Hispanic,6,Emergency,Home w/ Home Health Services,2017,127,Chronic obstructive pulmonary disease and bronchiectasis,000,NO PROC,144,"Respiratory signs, symptoms & minor diagnoses",04,Diseases and Disorders of the Respiratory System,3,Major,Major,Medical,Medicare,Medicare,Blue Cross/Blue Shield,,N,Y,95312.36,23179.50
Long Island,Nassau,2908000,000511,NYU Winthrop Hospital,50 to 69,118,F,White,Not Span/Hispanic,2,Emergency,Home or Self Care,2017,134,Other upper respiratory disease,000,NO PROC,144,"Respiratory signs, symptoms & minor diagnoses",04,Diseases and Disorders of the Respiratory System,3,Major,Moderate,Medical,Medicare,Medicare,Private Health Insurance,,N,Y,53554.21,11239.52
Long Island,Nassau,2908000,000511,NYU Winthrop Hospital,70 or Older,115,F,White,Not Span/Hispanic,4,Emergency,Home or Self Care,2017,127,Chronic obstructive pulmonary disease and bronchiectasis,062,OT DX CARDIOVASC PRCS,144,"Respiratory signs, symptoms & minor diagnoses",04,Diseases and Disorders of the Respiratory System,2,Moderate,Minor,Medical,Medicare,Medicare,Private Health Insurance,,N,Y,49276.55,10584.78
Long Island,Nassau,2908000,000511,NYU Winthrop Hospital,50 to 69,115,M,White,Not Span/Hispanic,6,Emergency,Home or Self Care,2017,125,Acute bronchitis,219,ALCO/DRUG REHAB/DETOX,144,"Respiratory signs, symptoms & minor diagnoses",04,Diseases and Disorders of the Respiratory System,3,Major,Minor,Medical,Medicaid,Medicaid,,,N,Y,42568.87,8883.17
Long Island,Nassau,2908000,000511,NYU Winthrop Hospital,50 to 69,110,M,White,Not Span/Hispanic,4,Emergency,Home or Self Care,2017,125,Acute bronchitis,000,NO PROC,144,"Respiratory signs, symptoms & minor diagnoses",04,Diseases and Disorders of the Respiratory System,1,Minor,Minor,Medical,Medicare,Medicare,,,N,Y,40217.55,7406.96
Long Island,Nassau,2908000,000511,NYU Winthrop Hospital,70 or Older,113,M,White,Not Span/Hispanic,2,Emergency,Home or Self Care,2017,133,Other lower respiratory disease,000,NO PROC,144,"Respiratory signs, symptoms & minor diagnoses",04,Diseases and Disorders of the Respiratory System,2,Moderate,Major,Medical,Medicare,Medicare,Private Health Insurance,,N,Y,35245.37,7827.30
Long Island,Nassau,2908000,000511,NYU Winthrop Hospital,70 or Older,115,F,Black/African American,Not Span/Hispanic,4,Emergency,Home w/ Home Health Services,2017,125,Acute bronchitis,000,NO PROC,144,"Respiratory signs, symptoms & minor diagnoses",04,Diseases and Disorders of the Respiratory System,2,Moderate,Moderate,Medical,Medicare,Medicare,Blue Cross/Blue Shield,,N,Y,65264.19,14801.52
Long Island,Nassau,2908000,000511,NYU Winthrop Hospital,30 to 49,115,F,White,Not Span/Hispanic,3,Emergency,Home or Self Care,2017,125,Acute bronchitis,000,NO PROC,144,"Respiratory signs, symptoms & minor diagnoses",04,Diseases and Disorders of the Respiratory System,1,Minor,Minor,Medical,Self-Pay,,,,N,Y,31506.04,6537.43
Long Island,Nassau,2908000,000511,NYU Winthrop Hospital,0 to 17,115,M,White,Not Span/Hispanic,1,Emergency,Home or Self Care,2017,224,Other perinatal conditions,000,NO PROC,144,"Respiratory signs, symptoms & minor diagnoses",04,Diseases and Disorders of the Respiratory System,1,Minor,Minor,Medical,Medicaid,Medicaid,,03800,N,Y,12317.44,2317.69
Long Island,Nassau,2908000,000511,NYU Winthrop Hospital,50 to 69,115,M,White,Not Span/Hispanic,5,Emergency,Home or Self Care,2017,125,Acute bronchitis,231,OTHER THERAPEUTIC PRCS,144,"Respiratory signs, symptoms & minor diagnoses",04,Diseases and Disorders of the Respiratory System,3,Major,Moderate,Medical,Private Health Insurance,,,,N,Y,72735.48,17929.32
Long Island,Nassau,2908000,000511,NYU Winthrop Hospital,70 or Older,115,M,White,Not Span/Hispanic,1,Emergency,Home or Self Care,2017,133,Other lower respiratory disease,000,NO PROC,144,"Respiratory signs, symptoms & minor diagnoses",04,Diseases and Disorders of the Respiratory System,3,Major,Major,Medical,Medicare,Medicare,,,N,Y,64957.52,14050.94
Long Island,Nassau,2908000,000511,NYU Winthrop Hospital,50 to 69,110,M,White,Not Span/Hispanic,12,Emergency,Skilled Nursing Home,2017,133,Other lower respiratory disease,216,RESP INTUB/MECH VENTIL,144,"Respiratory signs, symptoms & minor diagnoses",04,Diseases and Disorders of the Respiratory System,2,Moderate,Moderate,Medical,Blue Cross/Blue Shield,Medicare,Medicare,,N,Y,184515.87,44436.08
Long Island,Nassau,2908000,000511,NYU Winthrop Hospital,70 or Older,OOS,F,Black/African American,Not Span/Hispanic,5,Emergency,Home or Self Care,2017,133,Other lower respiratory disease,037,DX BRONCHOSCOPY & BIOPS,144,"Respiratory signs, symptoms & minor diagnoses",04,Diseases and Disorders of the Respiratory System,3,Major,Moderate,Medical,Medicare,Medicare,Private Health Insurance,,N,Y,69174.63,13079.87
Long Island,Nassau,2908000,000511,NYU Winthrop Hospital,50 to 69,115,M,White,Not Span/Hispanic,1,Emergency,Home or Self Care,2017,133,Other lower respiratory disease,201,CARDIAC STRESS TESTS,144,"Respiratory signs, symptoms & minor diagnoses",04,Diseases and Disorders of the Respiratory System,2,Moderate,Minor,Medical,Miscellaneous/Other,,,,N,Y,39173.61,7318.36
Long Island,Nassau,2908000,000511,NYU Winthrop Hospital,30 to 49,115,M,White,Spanish/Hispanic,2,Emergency,Home or Self Care,2017,231,Other fractures,171,SUTURE SKIN/SUBCUT TISS,144,"Respiratory signs, symptoms & minor diagnoses",04,Diseases and Disorders of the Respiratory System,2,Moderate,Moderate,Medical,Private Health Insurance,,,,N,Y,82801.38,13359.76
Long Island,Nassau,2908000,000511,NYU Winthrop Hospital,70 or Older,115,F,White,Spanish/Hispanic,4,Emergency,Home w/ Home Health Services,2017,133,Other lower respiratory disease,000,NO PROC,144,"Respiratory signs, symptoms & minor diagnoses",04,Diseases and Disorders of the Respiratory System,2,Moderate,Moderate,Medical,Private Health Insurance,Medicaid,,,N,Y,54930.05,10948.03
Long Island,Nassau,2908000,000511,NYU Winthrop Hospital,30 to 49,115,M,White,Not Span/Hispanic,2,Emergency,Home or Self Care,2017,231,Other fractures,000,NO PROC,144,"Respiratory signs, symptoms & minor diagnoses",04,Diseases and Disorders of the Respiratory System,2,Moderate,Minor,Medical,Miscellaneous/Other,,,,N,Y,46730.57,8759.85
Long Island,Nassau,2908000,000511,NYU Winthrop Hospital,70 or Older,117,F,White,Not Span/Hispanic,1,Elective,Home or Self Care,2017,133,Other lower respiratory disease,047,DX CARDIAC CATHETERIZTN,144,"Respiratory signs, symptoms & minor diagnoses",04,Diseases and Disorders of the Respiratory System,1,Minor,Minor,Medical,Medicare,Medicare,,,N,N,37391.16,8073.38
Long Island,Nassau,2908000,000511,NYU Winthrop Hospital,70 or Older,115,M,White,Not Span/Hispanic,4,Emergency,Home or Self Care,2017,133,Other lower respiratory disease,201,CARDIAC STRESS TESTS,144,"Respiratory signs, symptoms & minor diagnoses",04,Diseases and Disorders of the Respiratory System,1,Minor,Minor,Medical,Medicare,Medicare,,,N,Y,70218.00,16286.26
Long Island,Nassau,2908000,000511,NYU Winthrop Hospital,70 or Older,115,F,White,Not Span/Hispanic,6,Emergency,Home w/ Home Health Services,2017,133,Other lower respiratory disease,000,NO PROC,144,"Respiratory signs, symptoms & minor diagnoses",04,Diseases and Disorders of the Respiratory System,2,Moderate,Moderate,Medical,Medicare,Medicare,Private Health Insurance,,N,Y,62260.18,12067.99
Long Island,Nassau,2908000,000511,NYU Winthrop Hospital,50 to 69,117,M,White,Not Span/Hispanic,1,Emergency,Home or Self Care,2017,133,Other lower respiratory disease,047,DX CARDIAC CATHETERIZTN,144,"Respiratory signs, symptoms & minor diagnoses",04,Diseases and Disorders of the Respiratory System,1,Minor,Minor,Medical,Medicare,Medicare,,,N,Y,40422.83,8691.92
Long Island,Nassau,2908000,000511,NYU Winthrop Hospital,0 to 17,117,M,Black/African American,Not Span/Hispanic,5,Elective,Home or Self Care,2017,217,Other congenital anomalies,148,OT FRACTURE/DISLOC PRC,144,"Respiratory signs, symptoms & minor diagnoses",04,Diseases and Disorders of the Respiratory System,1,Minor,Minor,Medical,Blue Cross/Blue Shield,,,,N,N,167790.59,43278.71
Long Island,Nassau,2908000,000511,NYU Winthrop Hospital,70 or Older,115,F,White,Not Span/Hispanic,1,Emergency,Home or Self Care,2017,231,Other fractures,000,NO PROC,144,"Respiratory signs, symptoms & minor diagnoses",04,Diseases and Disorders of the Respiratory System,2,Moderate,Minor,Medical,Private Health Insurance,Medicare,Medicare,,N,Y,39910.93,6298.60