Hospital Service Area,Hospital County,Operating Certificate Number,Permanent Facility Id,Facility Name,Age Group,Zip Code - 3 digits,Gender,Race,Ethnicity,Length of Stay,Type of Admission,Patient Disposition,Discharge Year,CCS Diagnosis Code,CCS Diagnosis Description,CCS Procedure Code,CCS Procedure Description,APR DRG Code,APR DRG Description,APR MDC Code,APR MDC Description,APR Severity of Illness Code,APR Severity of Illness Description,APR Risk of Mortality,APR Medical Surgical Description,Payment Typology 1,Payment Typology 2,Payment Typology 3,Birth Weight,Abortion Edit Indicator,Emergency Department Indicator,Total Charges,Total Costs
New York City,Manhattan,7002053,001463,NYU Langone Hospitals,30 to 49,100,M,Other Race,Spanish/Hispanic,3,Emergency,Home or Self Care,2020,INF003,BACTERIAL INFECTIONS,OTR004,ISOLATION PROCEDURES,144,"RESPIRATORY SIGNS, SYMPTOMS & MINOR DIAGNOSES",04,DISEASES AND DISORDERS OF THE RESPIRATORY SYSTEM,2,Moderate,Minor,Medical,Medicaid,,,,,Y,57958.06,17320.25
New York City,Manhattan,7002053,001463,NYU Langone Hospitals,70 or Older,100,M,White,Not Span/Hispanic,5,Emergency,Home w/ Home Health Services,2020,INJ030,DRUG INDUCED OR TOXIC RELATED CONDITION,,,144,"RESPIRATORY SIGNS, SYMPTOMS & MINOR DIAGNOSES",04,DISEASES AND DISORDERS OF THE RESPIRATORY SYSTEM,3,Major,Major,Medical,Medicare,Private Health Insurance,,,,Y,92159.88,21051.14
New York City,Manhattan,7002053,001463,NYU Langone Hospitals,70 or Older,117,F,White,Not Span/Hispanic,4,Emergency,Skilled Nursing Home,2020,RSP005,ACUTE BRONCHITIS,SKB006,SKIN LACERATION REPAIR (EXCLUDING PERINEUM),144,"RESPIRATORY SIGNS, SYMPTOMS & MINOR DIAGNOSES",04,DISEASES AND DISORDERS OF THE RESPIRATORY SYSTEM,3,Major,Moderate,Medical,Medicare,Blue Cross/Blue Shield,,,,Y,67931.15,20759.59
New York City,Manhattan,7002053,001463,NYU Langone Hospitals,0 to 17,100,M,White,Not Span/Hispanic,3,Emergency,Home or Self Care,2020,RSP005,ACUTE BRONCHITIS,ADM021,"ADMINISTRATION OF THERAPEUTIC SUBSTANCES, NEC",144,"RESPIRATORY SIGNS, SYMPTOMS & MINOR DIAGNOSES",04,DISEASES AND DISORDERS OF THE RESPIRATORY SYSTEM,3,Major,Moderate,Medical,Private Health Insurance,,,,,Y,44795.59,12672.91
New York City,Manhattan,7002053,001463,NYU Langone Hospitals,0 to 17,100,F,White,Not Span/Hispanic,2,Emergency,Home or Self Care,2020,RSP005,ACUTE BRONCHITIS,,,144,"RESPIRATORY SIGNS, SYMPTOMS & MINOR DIAGNOSES",04,DISEASES AND DISORDERS OF THE RESPIRATORY SYSTEM,3,Major,Major,Medical,Private Health Insurance,,,,,N,28477.56,8859.97
New York City,Manhattan,7002053,001463,NYU Langone Hospitals,70 or Older,112,M,Other Race,Not Span/Hispanic,3,Emergency,Home or Self Care,2020,INJ030,DRUG INDUCED OR TOXIC RELATED CONDITION,ADM017,ADMINISTRATION OF NUTRITIONAL AND ELECTROLYTIC SUBSTANCES,144,"RESPIRATORY SIGNS, SYMPTOMS & MINOR DIAGNOSES",04,DISEASES AND DISORDERS OF THE RESPIRATORY SYSTEM,4,Extreme,Extreme,Medical,Medicare,,,,,Y,38426.61,11744.68
New York City,Manhattan,7002053,001463,NYU Langone Hospitals,30 to 49,112,M,Black/African American,Not Span/Hispanic,1,Emergency,Home or Self Care,2020,SYM013,RESPIRATORY SIGNS AND SYMPTOMS,,,144,"RESPIRATORY SIGNS, SYMPTOMS & MINOR DIAGNOSES",04,DISEASES AND DISORDERS OF THE RESPIRATORY SYSTEM,2,Moderate,Moderate,Medical,Private Health Insurance,,,,,Y,39918.09,10553.19
New York City,Manhattan,7002053,001463,NYU Langone Hospitals,70 or Older,108,F,White,Not Span/Hispanic,16,Elective,Home w/ Home Health Services,2020,RSP016,OTHER SPECIFIED AND UNSPECIFIED LOWER RESPIRATORY DISEASE,RHB002,"PHYSICAL, OCCUPATIONAL, AND RESPIRATORY THERAPY TREATMENT",144,"RESPIRATORY SIGNS, SYMPTOMS & MINOR DIAGNOSES",04,DISEASES AND DISORDERS OF THE RESPIRATORY SYSTEM,2,Moderate,Minor,Medical,Medicare,Medicare,,,,N,206007.5,52753.24
New York City,Manhattan,7002053,001463,NYU Langone Hospitals,70 or Older,104,M,Black/African American,Not Span/Hispanic,1,Emergency,Home or Self Care,2020,SYM013,RESPIRATORY SIGNS AND SYMPTOMS,,,144,"RESPIRATORY SIGNS, SYMPTOMS & MINOR DIAGNOSES",04,DISEASES AND DISORDERS OF THE RESPIRATORY SYSTEM,1,Minor,Minor,Medical,Medicare,,,,,Y,34574.1,7919.4
New York City,Manhattan,7002053,001463,NYU Langone Hospitals,50 to 69,117,M,White,Not Span/Hispanic,2,Emergency,Home or Self Care,2020,SYM013,RESPIRATORY SIGNS AND SYMPTOMS,,,144,"RESPIRATORY SIGNS, SYMPTOMS & MINOR DIAGNOSES",04,DISEASES AND DISORDERS OF THE RESPIRATORY SYSTEM,2,Moderate,Moderate,Medical,Blue Cross/Blue Shield,,,,,Y,50792.4,11474.46
New York City,Manhattan,7002053,001463,NYU Langone Hospitals,30 to 49,100,M,Other Race,Not Span/Hispanic,8,Emergency,Home or Self Care,2020,RSP016,OTHER SPECIFIED AND UNSPECIFIED LOWER RESPIRATORY DISEASE,OTR004,ISOLATION PROCEDURES,144,"RESPIRATORY SIGNS, SYMPTOMS & MINOR DIAGNOSES",04,DISEASES AND DISORDERS OF THE RESPIRATORY SYSTEM,3,Major,Major,Medical,Medicaid,,,,,Y,61786.19,26251.8
New York City,Manhattan,7002053,001463,NYU Langone Hospitals,50 to 69,100,M,Other Race,Unknown,2,Emergency,Home or Self Care,2020,RSP016,OTHER SPECIFIED AND UNSPECIFIED LOWER RESPIRATORY DISEASE,OTR004,ISOLATION PROCEDURES,144,"RESPIRATORY SIGNS, SYMPTOMS & MINOR DIAGNOSES",04,DISEASES AND DISORDERS OF THE RESPIRATORY SYSTEM,1,Minor,Minor,Medical,Private Health Insurance,,,,,Y,28640.56,8245.41
New York City,Manhattan,7002053,001463,NYU Langone Hospitals,30 to 49,103,M,White,Not Span/Hispanic,2,Emergency,Home or Self Care,2020,RSP016,OTHER SPECIFIED AND UNSPECIFIED LOWER RESPIRATORY DISEASE,OTR004,ISOLATION PROCEDURES,144,"RESPIRATORY SIGNS, SYMPTOMS & MINOR DIAGNOSES",04,DISEASES AND DISORDERS OF THE RESPIRATORY SYSTEM,2,Moderate,Minor,Medical,Private Health Insurance,,,,,Y,22509.34,7635.37
New York City,Manhattan,7002053,001463,NYU Langone Hospitals,50 to 69,112,F,White,Not Span/Hispanic,2,Emergency,Home or Self Care,2020,RSP016,OTHER SPECIFIED AND UNSPECIFIED LOWER RESPIRATORY DISEASE,,,144,"RESPIRATORY SIGNS, SYMPTOMS & MINOR DIAGNOSES",04,DISEASES AND DISORDERS OF THE RESPIRATORY SYSTEM,2,Moderate,Moderate,Medical,Medicare,Blue Cross/Blue Shield,,,,Y,28195.19,8189.48
New York City,Manhattan,7002053,001463,NYU Langone Hospitals,50 to 69,OOS,M,Black/African American,Not Span/Hispanic,3,Emergency,Home or Self Care,2020,RSP016,OTHER SPECIFIED AND UNSPECIFIED LOWER RESPIRATORY DISEASE,,,144,"RESPIRATORY SIGNS, SYMPTOMS & MINOR DIAGNOSES",04,DISEASES AND DISORDERS OF THE RESPIRATORY SYSTEM,1,Minor,Minor,Medical,Private Health Insurance,,,,,Y,39537.82,11688.43
New York City,Manhattan,7002053,001463,NYU Langone Hospitals,50 to 69,OOS,F,White,Not Span/Hispanic,3,Emergency,Home or Self Care,2020,RSP016,OTHER SPECIFIED AND UNSPECIFIED LOWER RESPIRATORY DISEASE,OTR004,ISOLATION PROCEDURES,144,"RESPIRATORY SIGNS, SYMPTOMS & MINOR DIAGNOSES",04,DISEASES AND DISORDERS OF THE RESPIRATORY SYSTEM,2,Moderate,Minor,Medical,Private Health Insurance,,,,,Y,43491.25,11660.55
New York City,Manhattan,7002053,001463,NYU Langone Hospitals,70 or Older,116,F,White,Not Span/Hispanic,2,Emergency,Home or Self Care,2020,RSP016,OTHER SPECIFIED AND UNSPECIFIED LOWER RESPIRATORY DISEASE,OTR004,ISOLATION PROCEDURES,144,"RESPIRATORY SIGNS, SYMPTOMS & MINOR DIAGNOSES",04,DISEASES AND DISORDERS OF THE RESPIRATORY SYSTEM,1,Minor,Minor,Medical,Medicare,Medicare,,,,Y,29938.9,8117.76
New York City,Manhattan,7002053,001463,NYU Langone Hospitals,50 to 69,100,M,Black/African American,Not Span/Hispanic,5,Emergency,Home or Self Care,2020,RSP016,OTHER SPECIFIED AND UNSPECIFIED LOWER RESPIRATORY DISEASE,OTR004,ISOLATION PROCEDURES,144,"RESPIRATORY SIGNS, SYMPTOMS & MINOR DIAGNOSES",04,DISEASES AND DISORDERS OF THE RESPIRATORY SYSTEM,2,Moderate,Minor,Medical,Medicaid,,,,,Y,70726.41,22478.06
New York City,Manhattan,7002053,001463,NYU Langone Hospitals,0 to 17,103,M,Other Race,Spanish/Hispanic,4,Emergency,Home or Self Care,2020,RSP016,OTHER SPECIFIED AND UNSPECIFIED LOWER RESPIRATORY DISEASE,LYM007,BONE MARROW BIOPSY,144,"RESPIRATORY SIGNS, SYMPTOMS & MINOR DIAGNOSES",04,DISEASES AND DISORDERS OF THE RESPIRATORY SYSTEM,3,Major,Moderate,Medical,Medicaid,,,,,Y,89950.98,16156.87
New York City,Manhattan,7002053,001463,NYU Langone Hospitals,70 or Older,112,F,Black/African American,Not Span/Hispanic,5,Emergency,Home w/ Home Health Services,2020,RSP016,OTHER SPECIFIED AND UNSPECIFIED LOWER RESPIRATORY DISEASE,OTR004,ISOLATION PROCEDURES,144,"RESPIRATORY SIGNS, SYMPTOMS & MINOR DIAGNOSES",04,DISEASES AND DISORDERS OF THE RESPIRATORY SYSTEM,2,Moderate,Minor,Medical,Medicare,Medicaid,,,,Y,65400.5,18885.39
New York City,Manhattan,7002053,001463,NYU Langone Hospitals,50 to 69,112,M,White,Not Span/Hispanic,4,Emergency,Home or Self Care,2020,RSP016,OTHER SPECIFIED AND UNSPECIFIED LOWER RESPIRATORY DISEASE,OTR004,ISOLATION PROCEDURES,144,"RESPIRATORY SIGNS, SYMPTOMS & MINOR DIAGNOSES",04,DISEASES AND DISORDERS OF THE RESPIRATORY SYSTEM,2,Moderate,Minor,Medical,Private Health Insurance,,,,,Y,49602.9,15103.67
New York City,Manhattan,7002053,001463,NYU Langone Hospitals,50 to 69,100,M,White,Not Span/Hispanic,1,Emergency,Home or Self Care,2020,RSP016,OTHER SPECIFIED AND UNSPECIFIED LOWER RESPIRATORY DISEASE,ESA004,NON-INVASIVE VENTILATION,144,"RESPIRATORY SIGNS, SYMPTOMS & MINOR DIAGNOSES",04,DISEASES AND DISORDERS OF THE RESPIRATORY SYSTEM,2,Moderate,Major,Medical,Blue Cross/Blue Shield,,,,,Y,26745.85,5376.79
New York City,Manhattan,7002053,001463,NYU Langone Hospitals,50 to 69,100,M,White,Not Span/Hispanic,2,Emergency,Home or Self Care,2020,RSP016,OTHER SPECIFIED AND UNSPECIFIED LOWER RESPIRATORY DISEASE,,,144,"RESPIRATORY SIGNS, SYMPTOMS & MINOR DIAGNOSES",04,DISEASES AND DISORDERS OF THE RESPIRATORY SYSTEM,2,Moderate,Major,Medical,Medicare,,,,,Y,43331.89,9022.38
New York City,Manhattan,7002053,001463,NYU Langone Hospitals,30 to 49,112,F,White,Not Span/Hispanic,2,Emergency,Home or Self Care,2020,RSP016,OTHER SPECIFIED AND UNSPECIFIED LOWER RESPIRATORY DISEASE,OTR004,ISOLATION PROCEDURES,144,"RESPIRATORY SIGNS, SYMPTOMS & MINOR DIAGNOSES",04,DISEASES AND DISORDERS OF THE RESPIRATORY SYSTEM,1,Minor,Minor,Medical,Medicare,Medicaid,,,,Y,26753.52,7854.58
New York City,Manhattan,7002053,001463,NYU Langone Hospitals,70 or Older,112,M,White,Not Span/Hispanic,1,Emergency,Home w/ Home Health Services,2020,SYM013,RESPIRATORY SIGNS AND SYMPTOMS,URN006,BLADDER CATHETERIZATION AND DRAINAGE,144,"RESPIRATORY SIGNS, SYMPTOMS & MINOR DIAGNOSES",04,DISEASES AND DISORDERS OF THE RESPIRATORY SYSTEM,1,Minor,Moderate,Medical,Medicare,,,,,Y,24219.55,5276.52
New York City,Manhattan,7002053,001463,NYU Langone Hospitals,50 to 69,112,M,White,Not Span/Hispanic,3,Emergency,Home or Self Care,2020,RSP016,OTHER SPECIFIED AND UNSPECIFIED LOWER RESPIRATORY DISEASE,OTR004,ISOLATION PROCEDURES,144,"RESPIRATORY SIGNS, SYMPTOMS & MINOR DIAGNOSES",04,DISEASES AND DISORDERS OF THE RESPIRATORY SYSTEM,2,Moderate,Minor,Medical,Medicare,Medicaid,,,,Y,58473.03,17107.08
New York City,Manhattan,7002053,001463,NYU Langone Hospitals,18 to 29,100,F,White,Not Span/Hispanic,1,Emergency,Home or Self Care,2020,RSP016,OTHER SPECIFIED AND UNSPECIFIED LOWER RESPIRATORY DISEASE,,,144,"RESPIRATORY SIGNS, SYMPTOMS & MINOR DIAGNOSES",04,DISEASES AND DISORDERS OF THE RESPIRATORY SYSTEM,1,Minor,Minor,Medical,Private Health Insurance,,,,,Y,15642.89,4321.35
New York City,Manhattan,7002053,001463,NYU Langone Hospitals,50 to 69,112,F,Other Race,Not Span/Hispanic,1,Emergency,Home or Self Care,2020,SYM013,RESPIRATORY SIGNS AND SYMPTOMS,,,144,"RESPIRATORY SIGNS, SYMPTOMS & MINOR DIAGNOSES",04,DISEASES AND DISORDERS OF THE RESPIRATORY SYSTEM,1,Minor,Minor,Medical,Private Health Insurance,,,,,Y,27997.02,5823.85
New York City,Manhattan,7002053,001463,NYU Langone Hospitals,70 or Older,100,F,White,Not Span/Hispanic,2,Elective,Home or Self Care,2020,SYM013,RESPIRATORY SIGNS AND SYMPTOMS,RES001,BRONCHOSCOPY (DIAGNOSTIC),144,"RESPIRATORY SIGNS, SYMPTOMS & MINOR DIAGNOSES",04,DISEASES AND DISORDERS OF THE RESPIRATORY SYSTEM,2,Moderate,Moderate,Medical,Medicare,Medicare,,,,N,46658.43,10428.44
New York City,Manhattan,7002053,001463,NYU Langone Hospitals,50 to 69,112,F,Black/African American,Not Span/Hispanic,1,Emergency,Home or Self Care,2020,SYM013,RESPIRATORY SIGNS AND SYMPTOMS,,,144,"RESPIRATORY SIGNS, SYMPTOMS & MINOR DIAGNOSES",04,DISEASES AND DISORDERS OF THE RESPIRATORY SYSTEM,1,Minor,Minor,Medical,Medicare,Blue Cross/Blue Shield,,,,Y,40283.67,7226.38
New York City,Manhattan,7002053,001463,NYU Langone Hospitals,70 or Older,100,M,White,Not Span/Hispanic,2,Emergency,Home w/ Home Health Services,2020,SYM013,RESPIRATORY SIGNS AND SYMPTOMS,,,144,"RESPIRATORY SIGNS, SYMPTOMS & MINOR DIAGNOSES",04,DISEASES AND DISORDERS OF THE RESPIRATORY SYSTEM,1,Minor,Minor,Medical,Medicare,Medicare,,,,Y,41475.59,9510.48
New York City,Manhattan,7002053,001463,NYU Langone Hospitals,70 or Older,113,M,Black/African American,Not Span/Hispanic,2,Emergency,Home or Self Care,2020,SYM013,RESPIRATORY SIGNS AND SYMPTOMS,RES001,BRONCHOSCOPY (DIAGNOSTIC),144,"RESPIRATORY SIGNS, SYMPTOMS & MINOR DIAGNOSES",04,DISEASES AND DISORDERS OF THE RESPIRATORY SYSTEM,3,Major,Major,Medical,Medicare,,,,,Y,66639.37,13293.22
New York City,Manhattan,7002053,001463,NYU Langone Hospitals,50 to 69,OOS,M,White,Not Span/Hispanic,3,Emergency,Home or Self Care,2020,INJ030,DRUG INDUCED OR TOXIC RELATED CONDITION,,,144,"RESPIRATORY SIGNS, SYMPTOMS & MINOR DIAGNOSES",04,DISEASES AND DISORDERS OF THE RESPIRATORY SYSTEM,2,Moderate,Minor,Medical,Private Health Insurance,,,,,Y,86434.79,18304.35
New York City,Manhattan,7002053,001463,NYU Langone Hospitals,70 or Older,112,F,White,Not Span/Hispanic,1,Emergency,Home w/ Home Health Services,2020,SYM013,RESPIRATORY SIGNS AND SYMPTOMS,,,144,"RESPIRATORY SIGNS, SYMPTOMS & MINOR DIAGNOSES",04,DISEASES AND DISORDERS OF THE RESPIRATORY SYSTEM,1,Minor,Minor,Medical,Medicare,Blue Cross/Blue Shield,,,,Y,45606.05,11629.75
New York City,Manhattan,7002053,001463,NYU Langone Hospitals,18 to 29,100,F,Other Race,Spanish/Hispanic,3,Emergency,Home or Self Care,2020,RSP013,LUNG DISEASE DUE TO EXTERNAL AGENTS,,,144,"RESPIRATORY SIGNS, SYMPTOMS & MINOR DIAGNOSES",04,DISEASES AND DISORDERS OF THE RESPIRATORY SYSTEM,2,Moderate,Moderate,Medical,Private Health Insurance,,,,,Y,74624.18,14973.49
New York City,Manhattan,7002053,001463,NYU Langone Hospitals,30 to 49,114,F,Black/African American,Not Span/Hispanic,1,Emergency,Left Against Medical Advice,2020,SYM013,RESPIRATORY SIGNS AND SYMPTOMS,,,144,"RESPIRATORY SIGNS, SYMPTOMS & MINOR DIAGNOSES",04,DISEASES AND DISORDERS OF THE RESPIRATORY SYSTEM,2,Moderate,Minor,Medical,Medicare,,,,,Y,16777.03,5551.07
New York City,Manhattan,7002053,001463,NYU Langone Hospitals,70 or Older,112,F,White,Not Span/Hispanic,2,Emergency,Home or Self Care,2020,SYM013,RESPIRATORY SIGNS AND SYMPTOMS,,,144,"RESPIRATORY SIGNS, SYMPTOMS & MINOR DIAGNOSES",04,DISEASES AND DISORDERS OF THE RESPIRATORY SYSTEM,2,Moderate,Minor,Medical,Medicare,Medicaid,,,,Y,31100.68,10732.32
New York City,Manhattan,7002053,001463,NYU Langone Hospitals,0 to 17,112,F,Other Race,Unknown,2,Elective,Skilled Nursing Home,2020,RSP016,OTHER SPECIFIED AND UNSPECIFIED LOWER RESPIRATORY DISEASE,RES001,BRONCHOSCOPY (DIAGNOSTIC),144,"RESPIRATORY SIGNS, SYMPTOMS & MINOR DIAGNOSES",04,DISEASES AND DISORDERS OF THE RESPIRATORY SYSTEM,2,Moderate,Minor,Medical,Medicaid,,,,,N,43579.06,11397.61
New York City,Manhattan,7002053,001463,NYU Langone Hospitals,50 to 69,100,M,Black/African American,Not Span/Hispanic,7,Emergency,Home or Self Care,2020,SYM013,RESPIRATORY SIGNS AND SYMPTOMS,,,144,"RESPIRATORY SIGNS, SYMPTOMS & MINOR DIAGNOSES",04,DISEASES AND DISORDERS OF THE RESPIRATORY SYSTEM,2,Moderate,Moderate,Medical,Self-Pay,,,,,Y,92545.92,36597.85
New York City,Manhattan,7002053,001463,NYU Langone Hospitals,70 or Older,100,F,White,Not Span/Hispanic,4,Elective,Home or Self Care,2020,SYM017,ABNORMAL FINDINGS WITHOUT DIAGNOSIS,RES001,BRONCHOSCOPY (DIAGNOSTIC),144,"RESPIRATORY SIGNS, SYMPTOMS & MINOR DIAGNOSES",04,DISEASES AND DISORDERS OF THE RESPIRATORY SYSTEM,3,Major,Moderate,Medical,Medicare,,,,,N,107442.5,26602.4
New York City,Manhattan,7002053,001463,NYU Langone Hospitals,70 or Older,100,M,White,Not Span/Hispanic,9,Emergency,Inpatient Rehabilitation Facility,2020,RSP016,OTHER SPECIFIED AND UNSPECIFIED LOWER RESPIRATORY DISEASE,RES005,CHEST TUBE PLACEMENT AND THERAPEUTIC THORACENTESIS,144,"RESPIRATORY SIGNS, SYMPTOMS & MINOR DIAGNOSES",04,DISEASES AND DISORDERS OF THE RESPIRATORY SYSTEM,4,Extreme,Extreme,Medical,Medicare,Medicare,,,,Y,160908.57,47868.19
New York City,Manhattan,7002053,001463,NYU Langone Hospitals,0 to 17,OOS,M,White,Unknown,1,Elective,Home or Self Care,2020,MAL008,MUSCULOSKELETAL CONGENITAL CONDITIONS,MST012,BONE FIXATION (EXCLUDING EXTREMITIES),144,"RESPIRATORY SIGNS, SYMPTOMS & MINOR DIAGNOSES",04,DISEASES AND DISORDERS OF THE RESPIRATORY SYSTEM,2,Moderate,Minor,Medical,Blue Cross/Blue Shield,Private Health Insurance,,,,N,255229.31,38513.24
New York City,Manhattan,7002053,001463,NYU Langone Hospitals,30 to 49,100,F,Other Race,Not Span/Hispanic,1,Emergency,Home or Self Care,2020,INJ030,DRUG INDUCED OR TOXIC RELATED CONDITION,,,144,"RESPIRATORY SIGNS, SYMPTOMS & MINOR DIAGNOSES",04,DISEASES AND DISORDERS OF THE RESPIRATORY SYSTEM,4,Extreme,Extreme,Medical,Blue Cross/Blue Shield,,,,,Y,30211.75,9622.72
New York City,Manhattan,7002053,001463,NYU Langone Hospitals,70 or Older,105,F,Other Race,Not Span/Hispanic,1,Elective,Home or Self Care,2020,MAL007,RESPIRATORY CONGENITAL MALFORMATIONS,,,144,"RESPIRATORY SIGNS, SYMPTOMS & MINOR DIAGNOSES",04,DISEASES AND DISORDERS OF THE RESPIRATORY SYSTEM,2,Moderate,Minor,Medical,Medicare,,,,,N,8521.96,4537.76
New York City,Manhattan,7002053,001463,NYU Langone Hospitals,50 to 69,100,F,Black/African American,Not Span/Hispanic,2,Emergency,Home or Self Care,2020,SYM017,ABNORMAL FINDINGS WITHOUT DIAGNOSIS,OTR004,ISOLATION PROCEDURES,144,"RESPIRATORY SIGNS, SYMPTOMS & MINOR DIAGNOSES",04,DISEASES AND DISORDERS OF THE RESPIRATORY SYSTEM,1,Minor,Minor,Medical,Medicaid,,,,,Y,38130.23,11653.85
New York City,Manhattan,7002053,001463,NYU Langone Hospitals,30 to 49,112,M,Black/African American,Not Span/Hispanic,6,Emergency,Skilled Nursing Home,2020,RSP013,LUNG DISEASE DUE TO EXTERNAL AGENTS,,,144,"RESPIRATORY SIGNS, SYMPTOMS & MINOR DIAGNOSES",04,DISEASES AND DISORDERS OF THE RESPIRATORY SYSTEM,3,Major,Moderate,Medical,Medicare,Medicaid,,,,Y,83231.6,29605.51
New York City,Manhattan,7002053,001463,NYU Langone Hospitals,70 or Older,OOS,F,White,Not Span/Hispanic,4,Urgent,Home w/ Home Health Services,2020,RSP013,LUNG DISEASE DUE TO EXTERNAL AGENTS,ESA004,NON-INVASIVE VENTILATION,144,"RESPIRATORY SIGNS, SYMPTOMS & MINOR DIAGNOSES",04,DISEASES AND DISORDERS OF THE RESPIRATORY SYSTEM,3,Major,Major,Medical,Medicare,Medicare,,,,N,48951.2,19971.69
New York City,Manhattan,7002053,001463,NYU Langone Hospitals,0 to 17,100,F,Other Race,Not Span/Hispanic,1,Emergency,Home or Self Care,2020,SYM013,RESPIRATORY SIGNS AND SYMPTOMS,MAM011,ELECTROENCEPHALOGRAM (EEG),144,"RESPIRATORY SIGNS, SYMPTOMS & MINOR DIAGNOSES",04,DISEASES AND DISORDERS OF THE RESPIRATORY SYSTEM,2,Moderate,Minor,Medical,Medicaid,,,,,Y,40962.48,4946.9
New York City,Manhattan,7002053,001463,NYU Langone Hospitals,70 or Older,100,M,White,Not Span/Hispanic,7,Emergency,Inpatient Rehabilitation Facility,2020,INJ030,DRUG INDUCED OR TOXIC RELATED CONDITION,ADM016,ADMINISTRATION OF ANTI-INFLAMMATORY AGENTS,144,"RESPIRATORY SIGNS, SYMPTOMS & MINOR DIAGNOSES",04,DISEASES AND DISORDERS OF THE RESPIRATORY SYSTEM,4,Extreme,Major,Medical,Medicare,Medicare,,,,Y,119940.47,39063.8
New York City,Manhattan,7002053,001463,NYU Langone Hospitals,70 or Older,104,M,Other Race,Not Span/Hispanic,1,Emergency,Home w/ Home Health Services,2020,SYM013,RESPIRATORY SIGNS AND SYMPTOMS,,,144,"RESPIRATORY SIGNS, SYMPTOMS & MINOR DIAGNOSES",04,DISEASES AND DISORDERS OF THE RESPIRATORY SYSTEM,1,Minor,Minor,Medical,Medicare,Medicaid,,,,Y,52055.47,15828.3
New York City,Manhattan,7002053,001463,NYU Langone Hospitals,70 or Older,100,M,White,Not Span/Hispanic,7,Elective,Skilled Nursing Home,2020,INJ030,DRUG INDUCED OR TOXIC RELATED CONDITION,RHB002,"PHYSICAL, OCCUPATIONAL, AND RESPIRATORY THERAPY TREATMENT",144,"RESPIRATORY SIGNS, SYMPTOMS & MINOR DIAGNOSES",04,DISEASES AND DISORDERS OF THE RESPIRATORY SYSTEM,3,Major,Moderate,Medical,Medicare,Medicare,,,,N,68282.2,22835.25
New York City,Manhattan,7002053,001463,NYU Langone Hospitals,50 to 69,100,F,Other Race,Spanish/Hispanic,1,Elective,Home or Self Care,2020,SYM017,ABNORMAL FINDINGS WITHOUT DIAGNOSIS,,,144,"RESPIRATORY SIGNS, SYMPTOMS & MINOR DIAGNOSES",04,DISEASES AND DISORDERS OF THE RESPIRATORY SYSTEM,1,Minor,Moderate,Medical,Medicare,,,,,N,8521.96,4537.76
New York City,Manhattan,7002053,001463,NYU Langone Hospitals,50 to 69,112,M,White,Not Span/Hispanic,6,Emergency,Home or Self Care,2020,RSP013,LUNG DISEASE DUE TO EXTERNAL AGENTS,,,144,"RESPIRATORY SIGNS, SYMPTOMS & MINOR DIAGNOSES",04,DISEASES AND DISORDERS OF THE RESPIRATORY SYSTEM,3,Major,Major,Medical,Blue Cross/Blue Shield,,,,,Y,164304.28,47139.9
New York City,Manhattan,7002053,001463,NYU Langone Hospitals,50 to 69,112,M,Black/African American,Not Span/Hispanic,7,Emergency,Home w/ Home Health Services,2020,INJ030,DRUG INDUCED OR TOXIC RELATED CONDITION,CAR028,INFERIOR VENA CAVA (IVC) FILTER PROCEDURES,144,"RESPIRATORY SIGNS, SYMPTOMS & MINOR DIAGNOSES",04,DISEASES AND DISORDERS OF THE RESPIRATORY SYSTEM,4,Extreme,Extreme,Medical,Medicare,,,,,Y,157161.33,41549.73
New York City,Manhattan,7002053,001463,NYU Langone Hospitals,50 to 69,,M,Black/African American,Not Span/Hispanic,1,Emergency,Home or Self Care,2020,SYM013,RESPIRATORY SIGNS AND SYMPTOMS,,,144,"RESPIRATORY SIGNS, SYMPTOMS & MINOR DIAGNOSES",04,DISEASES AND DISORDERS OF THE RESPIRATORY SYSTEM,1,Minor,Minor,Medical,Blue Cross/Blue Shield,,,,,Y,50738.81,12821.46
New York City,Manhattan,7002053,001463,NYU Langone Hospitals,50 to 69,112,F,Black/African American,Not Span/Hispanic,1,Emergency,Home or Self Care,2020,SYM013,RESPIRATORY SIGNS AND SYMPTOMS,,,144,"RESPIRATORY SIGNS, SYMPTOMS & MINOR DIAGNOSES",04,DISEASES AND DISORDERS OF THE RESPIRATORY SYSTEM,2,Moderate,Moderate,Medical,Medicare,Medicaid,,,,Y,51654.9,11033.9
New York City,Manhattan,7002053,001463,NYU Langone Hospitals,50 to 69,119,F,White,Not Span/Hispanic,7,Emergency,Home w/ Home Health Services,2020,INJ030,DRUG INDUCED OR TOXIC RELATED CONDITION,ESA004,NON-INVASIVE VENTILATION,144,"RESPIRATORY SIGNS, SYMPTOMS & MINOR DIAGNOSES",04,DISEASES AND DISORDERS OF THE RESPIRATORY SYSTEM,3,Major,Major,Medical,Blue Cross/Blue Shield,,,,,Y,157409.12,55149.02
New York City,Manhattan,7002053,001463,NYU Langone Hospitals,30 to 49,114,M,Black/African American,Not Span/Hispanic,2,Emergency,Home or Self Care,2020,SYM013,RESPIRATORY SIGNS AND SYMPTOMS,,,144,"RESPIRATORY SIGNS, SYMPTOMS & MINOR DIAGNOSES",04,DISEASES AND DISORDERS OF THE RESPIRATORY SYSTEM,2,Moderate,Moderate,Medical,Self-Pay,,,,,Y,31518.42,11004.55
New York City,Manhattan,7002053,001463,NYU Langone Hospitals,0 to 17,112,F,Other Race,Unknown,2,Emergency,Home or Self Care,2020,INF003,BACTERIAL INFECTIONS,OTR004,ISOLATION PROCEDURES,144,"RESPIRATORY SIGNS, SYMPTOMS & MINOR DIAGNOSES",04,DISEASES AND DISORDERS OF THE RESPIRATORY SYSTEM,1,Minor,Minor,Medical,Medicaid,,,,,Y,29972.91,7768.11
New York City,Manhattan,7002053,001463,NYU Langone Hospitals,50 to 69,112,M,White,Not Span/Hispanic,5,Emergency,Home w/ Home Health Services,2020,INJ003,"FRACTURE OF TORSO, INITIAL ENCOUNTER",ADM021,"ADMINISTRATION OF THERAPEUTIC SUBSTANCES, NEC",144,"RESPIRATORY SIGNS, SYMPTOMS & MINOR DIAGNOSES",04,DISEASES AND DISORDERS OF THE RESPIRATORY SYSTEM,3,Major,Extreme,Medical,Private Health Insurance,,,,,Y,95209.13,28177.22