Hospital Service Area,Hospital County,Operating Certificate Number,Permanent Facility Id,Facility Name,Age Group,Zip Code - 3 digits,Gender,Race,Ethnicity,Length of Stay,Type of Admission,Patient Disposition,Discharge Year,CCS Diagnosis Code,CCS Diagnosis Description,CCS Procedure Code,CCS Procedure Description,APR DRG Code,APR DRG Description,APR MDC Code,APR MDC Description,APR Severity of Illness Code,APR Severity of Illness Description,APR Risk of Mortality,APR Medical Surgical Description,Payment Typology 1,Payment Typology 2,Payment Typology 3,Birth Weight,Abortion Edit Indicator,Emergency Department Indicator,Total Charges,Total Costs
New York City,Kings,7001016,001301,Kings County Hospital Center,50 to 69,112,F,Black/African American,Not Span/Hispanic,1,Emergency,Left Against Medical Advice,2018,SYM013,RESPIRATORY SIGNS AND SYMPTOMS,ESA004,NON-INVASIVE VENTILATION,145,ACUTE BRONCHITIS AND RELATED SYMPTOMS,04,DISEASES AND DISORDERS OF THE RESPIRATORY SYSTEM,3,Major,Major,Medical,Medicaid,Medicaid,,,,true,10666.99,7577.41
Hudson Valley,Westchester,5907002,001098,St. Joseph's Medical Center,0 to 17,107,M,Other Race,Not Span/Hispanic,1,Emergency,Home or Self Care,2018,RSP005,ACUTE BRONCHITIS,,,145,ACUTE BRONCHITIS AND RELATED SYMPTOMS,04,DISEASES AND DISORDERS OF THE RESPIRATORY SYSTEM,1,Minor,Minor,Medical,Medicaid,Medicaid,,,,true,4703.96,2464.99
New York City,Kings,7001035,001318,Wyckoff Heights Medical Center,30 to 49,112,F,Black/African American,Not Span/Hispanic,1,Emergency,Left Against Medical Advice,2018,RSP005,ACUTE BRONCHITIS,,,145,ACUTE BRONCHITIS AND RELATED SYMPTOMS,04,DISEASES AND DISORDERS OF THE RESPIRATORY SYSTEM,3,Major,Moderate,Medical,Medicaid,Miscellaneous/Other,,,,true,11964.6,3678.07
New York City,Bronx,7000001,001178,BronxCare Hospital Center,70 or Older,104,M,Other Race,Spanish/Hispanic,3,Emergency,Home or Self Care,2018,RSP005,ACUTE BRONCHITIS,,,145,ACUTE BRONCHITIS AND RELATED SYMPTOMS,04,DISEASES AND DISORDERS OF THE RESPIRATORY SYSTEM,3,Major,Major,Medical,Medicare,,,,,true,11569.19,13924.48
Finger Lakes,Monroe,2701005,000413,Strong Memorial Hospital,70 or Older,145,M,White,Not Span/Hispanic,2,Emergency,Skilled Nursing Home,2018,SYM013,RESPIRATORY SIGNS AND SYMPTOMS,,,145,ACUTE BRONCHITIS AND RELATED SYMPTOMS,04,DISEASES AND DISORDERS OF THE RESPIRATORY SYSTEM,2,Moderate,Moderate,Medical,Medicare,Medicare,Self-Pay,,,true,9830.22,4273.9
Central NY,Oneida,3201002,000589,"Rome Memorial Hospital, Inc",70 or Older,134,F,White,Not Span/Hispanic,4,Emergency,Home or Self Care,2018,SYM013,RESPIRATORY SIGNS AND SYMPTOMS,GIS004,GI SYSTEM ENDOSCOPY WITHOUT BIOPSY (DIAGNOSTIC),145,ACUTE BRONCHITIS AND RELATED SYMPTOMS,04,DISEASES AND DISORDERS OF THE RESPIRATORY SYSTEM,3,Major,Moderate,Medical,Medicare,Private Health Insurance,,,,true,29899,9103.38
Long Island,Nassau,2951001,000541,North Shore University Hospital,70 or Older,110,F,White,Not Span/Hispanic,4,Emergency,Home w/ Home Health Services,2018,RSP005,ACUTE BRONCHITIS,,,145,ACUTE BRONCHITIS AND RELATED SYMPTOMS,04,DISEASES AND DISORDERS OF THE RESPIRATORY SYSTEM,2,Moderate,Moderate,Medical,Medicare,Private Health Insurance,,,,true,51601.3,8314.61
New York City,Bronx,7000006,003058,Montefiore Med Center - Jack D Weiler Hosp of A Einstein College Div,70 or Older,104,F,Black/African American,Not Span/Hispanic,3,Emergency,Home w/ Home Health Services,2018,RSP005,ACUTE BRONCHITIS,ADM021,"ADMINISTRATION OF THERAPEUTIC SUBSTANCES, NEC",145,ACUTE BRONCHITIS AND RELATED SYMPTOMS,04,DISEASES AND DISORDERS OF THE RESPIRATORY SYSTEM,3,Major,Moderate,Medical,Medicare,,,,,true,38362.89,5809.98
New York City,Queens,7003001,001628,Flushing Hospital Medical Center,30 to 49,113,F,White,Spanish/Hispanic,1,Emergency,Home or Self Care,2018,SYM013,RESPIRATORY SIGNS AND SYMPTOMS,,,145,ACUTE BRONCHITIS AND RELATED SYMPTOMS,04,DISEASES AND DISORDERS OF THE RESPIRATORY SYSTEM,1,Minor,Minor,Medical,Blue Cross/Blue Shield,,,,,true,5347,3011.57
Long Island,Nassau,2908000,000511,NYU Langone Hospital-Long Island,30 to 49,115,M,White,Spanish/Hispanic,1,Emergency,Home or Self Care,2018,SYM013,RESPIRATORY SIGNS AND SYMPTOMS,MAM004,CARDIAC STRESS TESTS,145,ACUTE BRONCHITIS AND RELATED SYMPTOMS,04,DISEASES AND DISORDERS OF THE RESPIRATORY SYSTEM,1,Minor,Minor,Medical,Private Health Insurance,,,,,true,35802.47,5733.17
New York City,Manhattan,7002009,001445,Harlem Hospital Center,50 to 69,104,F,Black/African American,Not Span/Hispanic,3,Emergency,Home or Self Care,2018,RSP005,ACUTE BRONCHITIS,,,145,ACUTE BRONCHITIS AND RELATED SYMPTOMS,04,DISEASES AND DISORDERS OF THE RESPIRATORY SYSTEM,3,Major,Moderate,Medical,Medicare,Medicare,,,,true,16790.21,12477.33
New York City,Queens,7003004,001638,Long Island Jewish Forest Hills,50 to 69,114,M,White,Not Span/Hispanic,2,Emergency,Home or Self Care,2018,RSP005,ACUTE BRONCHITIS,,,145,ACUTE BRONCHITIS AND RELATED SYMPTOMS,04,DISEASES AND DISORDERS OF THE RESPIRATORY SYSTEM,2,Moderate,Minor,Medical,Medicare,Private Health Insurance,,,,true,35961.71,6436.22
New York City,Queens,7003004,001638,Long Island Jewish Forest Hills,18 to 29,113,M,Black/African American,Not Span/Hispanic,1,Emergency,Home or Self Care,2018,SYM013,RESPIRATORY SIGNS AND SYMPTOMS,,,145,ACUTE BRONCHITIS AND RELATED SYMPTOMS,04,DISEASES AND DISORDERS OF THE RESPIRATORY SYSTEM,1,Minor,Minor,Medical,Private Health Insurance,,,,,true,18682,3379.05
New York City,Bronx,7000001,001178,BronxCare Hospital Center,50 to 69,113,M,Other Race,Spanish/Hispanic,3,Emergency,Home or Self Care,2018,RSP005,ACUTE BRONCHITIS,,,145,ACUTE BRONCHITIS AND RELATED SYMPTOMS,04,DISEASES AND DISORDERS OF THE RESPIRATORY SYSTEM,2,Moderate,Moderate,Medical,Private Health Insurance,,,,,true,12639.82,14629.27
Capital/Adirond,Albany,0101004,000005,St. Peter's Hospital,50 to 69,OOS,F,White,Not Span/Hispanic,2,Urgent,Home or Self Care,2018,RSP005,ACUTE BRONCHITIS,RES001,BRONCHOSCOPY (DIAGNOSTIC),145,ACUTE BRONCHITIS AND RELATED SYMPTOMS,04,DISEASES AND DISORDERS OF THE RESPIRATORY SYSTEM,3,Major,Major,Medical,Medicaid,,,,,false,17686.75,5959.08
Long Island,Nassau,2951001,000541,North Shore University Hospital,70 or Older,114,M,Other Race,Not Span/Hispanic,1,Emergency,Home or Self Care,2018,SYM013,RESPIRATORY SIGNS AND SYMPTOMS,,,145,ACUTE BRONCHITIS AND RELATED SYMPTOMS,04,DISEASES AND DISORDERS OF THE RESPIRATORY SYSTEM,2,Moderate,Major,Medical,Medicaid,Medicaid,,,,true,21095.66,3123.23
Southern Tier,Chenango,0824000,000128,Chenango Memorial Hospital Inc,50 to 69,134,M,White,Not Span/Hispanic,2,Emergency,Home or Self Care,2018,RSP005,ACUTE BRONCHITIS,,,145,ACUTE BRONCHITIS AND RELATED SYMPTOMS,04,DISEASES AND DISORDERS OF THE RESPIRATORY SYSTEM,2,Moderate,Moderate,Medical,Medicare,Medicare,Medicaid,,,true,11784.8,3977.59
New York City,Manhattan,7002017,001450,Lenox Hill Hospital,70 or Older,100,F,Black/African American,Not Span/Hispanic,2,Emergency,Home or Self Care,2018,SYM013,RESPIRATORY SIGNS AND SYMPTOMS,,,145,ACUTE BRONCHITIS AND RELATED SYMPTOMS,04,DISEASES AND DISORDERS OF THE RESPIRATORY SYSTEM,1,Minor,Minor,Medical,Medicare,Medicare,,,,true,36166.14,6855.32
Long Island,Nassau,2952005,000552,Plainview Hospital,70 or Older,118,F,White,Not Span/Hispanic,3,Emergency,Home w/ Home Health Services,2018,RSP005,ACUTE BRONCHITIS,,,145,ACUTE BRONCHITIS AND RELATED SYMPTOMS,04,DISEASES AND DISORDERS OF THE RESPIRATORY SYSTEM,2,Moderate,Moderate,Medical,Medicare,Blue Cross/Blue Shield,,,,true,21007.81,7436.73
Long Island,Nassau,2909000,000513,Mercy Hospital,70 or Older,115,M,White,Not Span/Hispanic,2,Emergency,Home w/ Home Health Services,2018,RSP005,ACUTE BRONCHITIS,,,145,ACUTE BRONCHITIS AND RELATED SYMPTOMS,04,DISEASES AND DISORDERS OF THE RESPIRATORY SYSTEM,1,Minor,Minor,Medical,Medicare,Medicaid,,,,true,24192,5598.64
Capital/Adirond,Schenectady,4601001,000829,Ellis Hospital,18 to 29,123,F,Other Race,Not Span/Hispanic,1,Emergency,Home or Self Care,2018,RSP005,ACUTE BRONCHITIS,,,145,ACUTE BRONCHITIS AND RELATED SYMPTOMS,04,DISEASES AND DISORDERS OF THE RESPIRATORY SYSTEM,2,Moderate,Minor,Medical,Self-Pay,,,,,true,7302.35,1894.57
New York City,Kings,7001016,001301,Kings County Hospital Center,30 to 49,112,M,Black/African American,Not Span/Hispanic,2,Emergency,Home or Self Care,2018,SYM013,RESPIRATORY SIGNS AND SYMPTOMS,,,145,ACUTE BRONCHITIS AND RELATED SYMPTOMS,04,DISEASES AND DISORDERS OF THE RESPIRATORY SYSTEM,2,Moderate,Moderate,Medical,Blue Cross/Blue Shield,,,,,true,19354.88,13748.95
Long Island,Suffolk,5151001,000245,Stony Brook University Hospital,70 or Older,117,M,White,Not Span/Hispanic,2,Emergency,Home or Self Care,2018,RSP005,ACUTE BRONCHITIS,,,145,ACUTE BRONCHITIS AND RELATED SYMPTOMS,04,DISEASES AND DISORDERS OF THE RESPIRATORY SYSTEM,3,Major,Major,Medical,Medicare,Private Health Insurance,,,,true,24703.4,6629.71
Hudson Valley,Sullivan,5263000,000971,Garnet Health Medical Center - Catskills,70 or Older,127,M,Other Race,Spanish/Hispanic,4,Emergency,Home or Self Care,2018,RSP005,ACUTE BRONCHITIS,ESA001,HEMODIALYSIS,145,ACUTE BRONCHITIS AND RELATED SYMPTOMS,04,DISEASES AND DISORDERS OF THE RESPIRATORY SYSTEM,3,Major,Major,Medical,Medicare,Private Health Insurance,,,,true,25298.92,6683.44
Western NY,Erie,1401014,000207,Buffalo General Medical Center,18 to 29,142,F,Black/African American,Not Span/Hispanic,1,Emergency,Home or Self Care,2018,SYM013,RESPIRATORY SIGNS AND SYMPTOMS,,,145,ACUTE BRONCHITIS AND RELATED SYMPTOMS,04,DISEASES AND DISORDERS OF THE RESPIRATORY SYSTEM,2,Moderate,Minor,Medical,Private Health Insurance,Self-Pay,,,,true,9926.55,2244.43
Long Island,Nassau,2908000,000511,NYU Langone Hospital-Long Island,70 or Older,115,F,White,Not Span/Hispanic,5,Emergency,Home or Self Care,2018,RSP005,ACUTE BRONCHITIS,,,145,ACUTE BRONCHITIS AND RELATED SYMPTOMS,04,DISEASES AND DISORDERS OF THE RESPIRATORY SYSTEM,3,Major,Major,Medical,Medicare,Medicare,Private Health Insurance,,,true,55971.8,10917.45
Central NY,Onondaga,3301007,000635,University Hospital SUNY Health Science Center,50 to 69,130,F,White,Not Span/Hispanic,2,Emergency,Home or Self Care,2018,SYM013,RESPIRATORY SIGNS AND SYMPTOMS,IMG008,ULTRASONOGRAPHY,145,ACUTE BRONCHITIS AND RELATED SYMPTOMS,04,DISEASES AND DISORDERS OF THE RESPIRATORY SYSTEM,2,Moderate,Moderate,Medical,Medicare,,,,,true,22043.7,4722
Capital/Adirond,Albany,0101004,000005,St. Peter's Hospital,70 or Older,122,M,Black/African American,Not Span/Hispanic,1,Emergency,Home w/ Home Health Services,2018,RSP005,ACUTE BRONCHITIS,,,145,ACUTE BRONCHITIS AND RELATED SYMPTOMS,04,DISEASES AND DISORDERS OF THE RESPIRATORY SYSTEM,2,Moderate,Moderate,Medical,Medicare,,,,,true,10764.75,2485.45
Western NY,Erie,1401014,000207,Buffalo General Medical Center,70 or Older,140,F,White,Not Span/Hispanic,2,Emergency,Home or Self Care,2018,RSP005,ACUTE BRONCHITIS,,,145,ACUTE BRONCHITIS AND RELATED SYMPTOMS,04,DISEASES AND DISORDERS OF THE RESPIRATORY SYSTEM,2,Moderate,Moderate,Medical,Medicare,Federal/State/Local/VA,Self-Pay,,,true,11948.92,4231.98
Western NY,Erie,1401014,000207,Buffalo General Medical Center,30 to 49,142,F,Black/African American,Not Span/Hispanic,3,Emergency,Home w/ Home Health Services,2018,SYM013,RESPIRATORY SIGNS AND SYMPTOMS,,,145,ACUTE BRONCHITIS AND RELATED SYMPTOMS,04,DISEASES AND DISORDERS OF THE RESPIRATORY SYSTEM,2,Moderate,Minor,Medical,Medicaid,Self-Pay,,,,true,14509.95,5118.89
Capital/Adirond,Albany,0101000,000001,Albany Medical Center Hospital,50 to 69,120,M,White,Not Span/Hispanic,7,Emergency,Home w/ Home Health Services,2018,RSP006,OTHER SPECIFIED UPPER RESPIRATORY INFECTIONS,ENT001,LARYNGOSCOPY (DIAGNOSTIC),145,ACUTE BRONCHITIS AND RELATED SYMPTOMS,04,DISEASES AND DISORDERS OF THE RESPIRATORY SYSTEM,4,Extreme,Moderate,Medical,Blue Cross/Blue Shield,Medicare,,,,true,71712.94,24223.9
Long Island,Nassau,2908000,000511,NYU Langone Hospital-Long Island,70 or Older,117,F,White,Not Span/Hispanic,4,Emergency,Home or Self Care,2018,RSP005,ACUTE BRONCHITIS,,,145,ACUTE BRONCHITIS AND RELATED SYMPTOMS,04,DISEASES AND DISORDERS OF THE RESPIRATORY SYSTEM,3,Major,Major,Medical,Medicare,Medicare,Private Health Insurance,,,true,60513.35,10312.06
New York City,Kings,7001016,001301,Kings County Hospital Center,50 to 69,112,M,Black/African American,Not Span/Hispanic,3,Emergency,Home or Self Care,2018,RSP005,ACUTE BRONCHITIS,,,145,ACUTE BRONCHITIS AND RELATED SYMPTOMS,04,DISEASES AND DISORDERS OF THE RESPIRATORY SYSTEM,3,Major,Moderate,Medical,Medicaid,,,,,true,19395.98,13778.15
Long Island,Nassau,2951001,000541,North Shore University Hospital,50 to 69,114,F,White,Not Span/Hispanic,12,Emergency,Home w/ Home Health Services,2018,RSP005,ACUTE BRONCHITIS,ESA004,NON-INVASIVE VENTILATION,145,ACUTE BRONCHITIS AND RELATED SYMPTOMS,04,DISEASES AND DISORDERS OF THE RESPIRATORY SYSTEM,3,Major,Major,Medical,Medicaid,Medicaid,,,,true,193080.48,34422.93
New York City,Bronx,7000006,003058,Montefiore Med Center - Jack D Weiler Hosp of A Einstein College Div,50 to 69,104,F,Other Race,Spanish/Hispanic,4,Emergency,Home or Self Care,2018,RSP005,ACUTE BRONCHITIS,ADM021,"ADMINISTRATION OF THERAPEUTIC SUBSTANCES, NEC",145,ACUTE BRONCHITIS AND RELATED SYMPTOMS,04,DISEASES AND DISORDERS OF THE RESPIRATORY SYSTEM,2,Moderate,Minor,Medical,Medicaid,,,,,true,42906.34,8090.74
Long Island,Suffolk,5154000,000924,South Shore University Hospital,50 to 69,117,M,Black/African American,Not Span/Hispanic,5,Emergency,Home or Self Care,2018,SYM013,RESPIRATORY SIGNS AND SYMPTOMS,,,145,ACUTE BRONCHITIS AND RELATED SYMPTOMS,04,DISEASES AND DISORDERS OF THE RESPIRATORY SYSTEM,1,Minor,Minor,Medical,Medicaid,Medicaid,,,,true,50406.12,9934.42
New York City,Richmond,7004010,001738,Richmond University Medical Center,50 to 69,103,M,Black/African American,Not Span/Hispanic,1,Emergency,Home or Self Care,2018,RSP005,ACUTE BRONCHITIS,,,145,ACUTE BRONCHITIS AND RELATED SYMPTOMS,04,DISEASES AND DISORDERS OF THE RESPIRATORY SYSTEM,3,Major,Minor,Medical,Medicare,Medicaid,Medicare,,,true,11545.18,2470.66
Long Island,Suffolk,5157003,000943,St Catherine of Siena Hospital,70 or Older,117,M,White,Not Span/Hispanic,8,Emergency,Skilled Nursing Home,2018,RSP005,ACUTE BRONCHITIS,,,145,ACUTE BRONCHITIS AND RELATED SYMPTOMS,04,DISEASES AND DISORDERS OF THE RESPIRATORY SYSTEM,3,Major,Major,Medical,Medicare,,,,,true,63163,12741.27
New York City,Kings,7001016,001301,Kings County Hospital Center,18 to 29,112,F,Black/African American,Not Span/Hispanic,3,Emergency,Home or Self Care,2018,SYM013,RESPIRATORY SIGNS AND SYMPTOMS,IMG008,ULTRASONOGRAPHY,145,ACUTE BRONCHITIS AND RELATED SYMPTOMS,04,DISEASES AND DISORDERS OF THE RESPIRATORY SYSTEM,2,Moderate,Moderate,Medical,Medicaid,Medicaid,,,,true,24168.97,17168.69
New York City,Richmond,7004003,001740,Staten Island University Hosp-North,50 to 69,103,M,White,Not Span/Hispanic,1,Emergency,Left Against Medical Advice,2018,SYM013,RESPIRATORY SIGNS AND SYMPTOMS,,,145,ACUTE BRONCHITIS AND RELATED SYMPTOMS,04,DISEASES AND DISORDERS OF THE RESPIRATORY SYSTEM,1,Minor,Minor,Medical,Medicaid,,,,,true,12600.23,3015.54
New York City,Queens,7001024,001635,St Johns Episcopal Hospital So Shore,70 or Older,116,F,Other Race,Unknown,3,Emergency,Home w/ Home Health Services,2018,RSP005,ACUTE BRONCHITIS,,,145,ACUTE BRONCHITIS AND RELATED SYMPTOMS,04,DISEASES AND DISORDERS OF THE RESPIRATORY SYSTEM,2,Moderate,Minor,Medical,Medicare,Medicare,Medicaid,,,true,26715.8,6217.96
New York City,Bronx,7000024,001186,North Central Bronx Hospital,50 to 69,104,M,Other Race,Spanish/Hispanic,6,Emergency,Skilled Nursing Home,2018,RSP005,ACUTE BRONCHITIS,,,145,ACUTE BRONCHITIS AND RELATED SYMPTOMS,04,DISEASES AND DISORDERS OF THE RESPIRATORY SYSTEM,3,Major,Moderate,Medical,Medicaid,Medicaid,,,,true,35605.52,21374.31
New York City,Kings,7002002,001324,Mount Sinai Brooklyn,70 or Older,112,F,Black/African American,Unknown,5,Emergency,Home w/ Home Health Services,2018,RSP005,ACUTE BRONCHITIS,,,145,ACUTE BRONCHITIS AND RELATED SYMPTOMS,04,DISEASES AND DISORDERS OF THE RESPIRATORY SYSTEM,2,Moderate,Moderate,Medical,Medicare,Medicaid,Self-Pay,,,true,49999.46,9177.85
New York City,Kings,7002002,001324,Mount Sinai Brooklyn,50 to 69,112,M,Black/African American,Not Span/Hispanic,3,Emergency,Home or Self Care,2018,RSP005,ACUTE BRONCHITIS,IMG008,ULTRASONOGRAPHY,145,ACUTE BRONCHITIS AND RELATED SYMPTOMS,04,DISEASES AND DISORDERS OF THE RESPIRATORY SYSTEM,3,Major,Major,Medical,Medicare,Medicaid,Self-Pay,,,true,37708.29,6411.3
New York City,Kings,7001021,001306,New York - Presbyterian Brooklyn Methodist Hospital,70 or Older,112,M,Other Race,Not Span/Hispanic,2,Emergency,Home w/ Home Health Services,2018,RSP005,ACUTE BRONCHITIS,,,145,ACUTE BRONCHITIS AND RELATED SYMPTOMS,04,DISEASES AND DISORDERS OF THE RESPIRATORY SYSTEM,2,Moderate,Moderate,Medical,Medicare,Medicare,Medicaid,,,true,14470.9,3515.35
Long Island,Suffolk,5149000,000895,John T Mather Memorial Hospital of Port Jefferson New York Inc,70 or Older,119,M,White,Not Span/Hispanic,4,Emergency,Home w/ Home Health Services,2018,RSP005,ACUTE BRONCHITIS,,,145,ACUTE BRONCHITIS AND RELATED SYMPTOMS,04,DISEASES AND DISORDERS OF THE RESPIRATORY SYSTEM,4,Extreme,Major,Medical,Medicare,Medicare,Private Health Insurance,,,true,40386.76,9352.26
Long Island,Nassau,2953000,000563,St. Francis Hospital & Heart Center,70 or Older,110,F,White,Not Span/Hispanic,2,Emergency,Home w/ Home Health Services,2018,SYM013,RESPIRATORY SIGNS AND SYMPTOMS,,,145,ACUTE BRONCHITIS AND RELATED SYMPTOMS,04,DISEASES AND DISORDERS OF THE RESPIRATORY SYSTEM,2,Moderate,Moderate,Medical,Medicare,Medicare,Medicaid,,,true,23964,3571.91
Long Island,Nassau,2953000,000563,St. Francis Hospital & Heart Center,70 or Older,115,M,White,Not Span/Hispanic,4,Emergency,Home or Self Care,2018,SYM013,RESPIRATORY SIGNS AND SYMPTOMS,RES001,BRONCHOSCOPY (DIAGNOSTIC),145,ACUTE BRONCHITIS AND RELATED SYMPTOMS,04,DISEASES AND DISORDERS OF THE RESPIRATORY SYSTEM,2,Moderate,Moderate,Medical,Medicare,Private Health Insurance,,,,true,49743.95,9527.42
Capital/Adirond,Schenectady,4601001,000829,Ellis Hospital,70 or Older,123,F,White,Not Span/Hispanic,7,Emergency,Home or Self Care,2018,RSP005,ACUTE BRONCHITIS,URN006,BLADDER CATHETERIZATION AND DRAINAGE,145,ACUTE BRONCHITIS AND RELATED SYMPTOMS,04,DISEASES AND DISORDERS OF THE RESPIRATORY SYSTEM,2,Moderate,Moderate,Medical,Medicare,Medicare,Medicaid,,,true,30388.13,9207.58
New York City,Kings,7001021,001306,New York - Presbyterian Brooklyn Methodist Hospital,50 to 69,112,F,Other Race,Spanish/Hispanic,2,Emergency,Home or Self Care,2018,RSP005,ACUTE BRONCHITIS,,,145,ACUTE BRONCHITIS AND RELATED SYMPTOMS,04,DISEASES AND DISORDERS OF THE RESPIRATORY SYSTEM,2,Moderate,Minor,Medical,Blue Cross/Blue Shield,Self-Pay,,,,true,13533.85,3418.34
New York City,Queens,7003004,001638,Long Island Jewish Forest Hills,70 or Older,113,F,White,Not Span/Hispanic,5,Emergency,Facility w/ Custodial/Supportive Care,2018,RSP005,ACUTE BRONCHITIS,,,145,ACUTE BRONCHITIS AND RELATED SYMPTOMS,04,DISEASES AND DISORDERS OF THE RESPIRATORY SYSTEM,3,Major,Major,Medical,Medicare,Medicare,Medicaid,,,true,52821.05,9419.85
Long Island,Suffolk,5155000,000938,Peconic Bay Medical Center,70 or Older,119,F,White,Spanish/Hispanic,6,Emergency,Home or Self Care,2018,RSP005,ACUTE BRONCHITIS,,,145,ACUTE BRONCHITIS AND RELATED SYMPTOMS,04,DISEASES AND DISORDERS OF THE RESPIRATORY SYSTEM,2,Moderate,Moderate,Medical,Medicare,Private Health Insurance,,,,true,57013.04,12408.16
Hudson Valley,Westchester,5922000,001122,New York - Presbyterian Hospital,70 or Older,104,F,Other Race,Not Span/Hispanic,7,Emergency,Home or Self Care,2018,RSP005,ACUTE BRONCHITIS,,,145,ACUTE BRONCHITIS AND RELATED SYMPTOMS,04,DISEASES AND DISORDERS OF THE RESPIRATORY SYSTEM,3,Major,Major,Medical,Medicare,Private Health Insurance,,,,true,38974.75,14500.56
Capital/Adirond,Albany,0101004,000005,St. Peter's Hospital,70 or Older,122,M,White,Not Span/Hispanic,2,Emergency,Home or Self Care,2018,SYM013,RESPIRATORY SIGNS AND SYMPTOMS,,,145,ACUTE BRONCHITIS AND RELATED SYMPTOMS,04,DISEASES AND DISORDERS OF THE RESPIRATORY SYSTEM,2,Moderate,Moderate,Medical,Medicare,Private Health Insurance,,,,false,26389.65,7187.18
Long Island,Suffolk,5154001,000925,Good Samaritan Hospital Medical Center,70 or Older,117,F,White,Not Span/Hispanic,3,Emergency,Home or Self Care,2018,SYM013,RESPIRATORY SIGNS AND SYMPTOMS,,,145,ACUTE BRONCHITIS AND RELATED SYMPTOMS,04,DISEASES AND DISORDERS OF THE RESPIRATORY SYSTEM,3,Major,Major,Medical,Medicare,Private Health Insurance,,,,true,51443,8148.72
Long Island,Suffolk,5154001,000925,Good Samaritan Hospital Medical Center,50 to 69,117,M,White,Not Span/Hispanic,2,Emergency,Home or Self Care,2018,RSP005,ACUTE BRONCHITIS,,,145,ACUTE BRONCHITIS AND RELATED SYMPTOMS,04,DISEASES AND DISORDERS OF THE RESPIRATORY SYSTEM,2,Moderate,Minor,Medical,Medicaid,Medicaid,,,,true,35496,4841.83
Long Island,Nassau,2952005,000552,Plainview Hospital,70 or Older,118,F,White,Not Span/Hispanic,4,Emergency,Home or Self Care,2018,RSP005,ACUTE BRONCHITIS,,,145,ACUTE BRONCHITIS AND RELATED SYMPTOMS,04,DISEASES AND DISORDERS OF THE RESPIRATORY SYSTEM,2,Moderate,Moderate,Medical,Medicare,Blue Cross/Blue Shield,,,,true,34377.02,10739.24
New York City,Manhattan,7002032,001469,Mount Sinai Morningside,30 to 49,100,M,Black/African American,Not Span/Hispanic,1,Urgent,Home or Self Care,2018,RSP005,ACUTE BRONCHITIS,CNS002,LUMBAR PUNCTURE,145,ACUTE BRONCHITIS AND RELATED SYMPTOMS,04,DISEASES AND DISORDERS OF THE RESPIRATORY SYSTEM,2,Moderate,Minor,Medical,Medicaid,Medicaid,Self-Pay,,,false,16425.32,4232.61
Long Island,Nassau,2951001,000541,North Shore University Hospital,30 to 49,114,M,Black/African American,Not Span/Hispanic,1,Emergency,Home or Self Care,2018,SYM013,RESPIRATORY SIGNS AND SYMPTOMS,,,145,ACUTE BRONCHITIS AND RELATED SYMPTOMS,04,DISEASES AND DISORDERS OF THE RESPIRATORY SYSTEM,2,Moderate,Moderate,Medical,Blue Cross/Blue Shield,,,,,true,19265.42,2981.57
Capital/Adirond,Albany,0101000,000001,Albany Medical Center Hospital,70 or Older,122,M,Black/African American,Not Span/Hispanic,1,Emergency,Home or Self Care,2018,RSP005,ACUTE BRONCHITIS,,,145,ACUTE BRONCHITIS AND RELATED SYMPTOMS,04,DISEASES AND DISORDERS OF THE RESPIRATORY SYSTEM,1,Minor,Moderate,Medical,Medicare,Medicaid,,,,true,7649.79,2003.73
New York City,Queens,7003010,001637,New York - Presbyterian/Queens,70 or Older,113,M,Other Race,Not Span/Hispanic,1,Emergency,Home or Self Care,2018,SYM013,RESPIRATORY SIGNS AND SYMPTOMS,ADM017,ADMINISTRATION OF NUTRITIONAL AND ELECTROLYTIC SUBSTANCES,145,ACUTE BRONCHITIS AND RELATED SYMPTOMS,04,DISEASES AND DISORDERS OF THE RESPIRATORY SYSTEM,1,Minor,Minor,Medical,"Managed Care, Unspecified",Medicaid,Self-Pay,,,true,8406.2,2344.42
New York City,Richmond,7004003,001740,Staten Island University Hosp-North,50 to 69,103,F,White,Spanish/Hispanic,1,Emergency,Home or Self Care,2018,RSP005,ACUTE BRONCHITIS,ADM015,ADMINISTRATION OF ANTIBIOTICS,145,ACUTE BRONCHITIS AND RELATED SYMPTOMS,04,DISEASES AND DISORDERS OF THE RESPIRATORY SYSTEM,1,Minor,Minor,Medical,Medicaid,Medicaid,,,,true,7952.16,2039.16
New York City,Manhattan,7002017,001450,Lenox Hill Hospital,30 to 49,113,F,Other Race,Spanish/Hispanic,2,Emergency,Home or Self Care,2018,SYM013,RESPIRATORY SIGNS AND SYMPTOMS,,,145,ACUTE BRONCHITIS AND RELATED SYMPTOMS,04,DISEASES AND DISORDERS OF THE RESPIRATORY SYSTEM,2,Moderate,Minor,Medical,Medicare,Medicaid,,,,true,32988.61,4436
New York City,Bronx,7000002,001165,Jacobi Medical Center,50 to 69,104,F,Black/African American,Unknown,1,Emergency,Home or Self Care,2018,SYM013,RESPIRATORY SIGNS AND SYMPTOMS,ADM021,"ADMINISTRATION OF THERAPEUTIC SUBSTANCES, NEC",145,ACUTE BRONCHITIS AND RELATED SYMPTOMS,04,DISEASES AND DISORDERS OF THE RESPIRATORY SYSTEM,2,Moderate,Minor,Medical,Medicaid,Medicaid,,,,true,8701.62,5148.31