Hospital Service Area,Hospital County,Operating Certificate Number,Permanent Facility Id,Facility Name,Age Group,Zip Code - 3 digits,Gender,Race,Ethnicity,Length of Stay,Type of Admission,Patient Disposition,Discharge Year,CCS Diagnosis Code,CCS Diagnosis Description,CCS Procedure Code,CCS Procedure Description,APR DRG Code,APR DRG Description,APR MDC Code,APR MDC Description,APR Severity of Illness Code,APR Severity of Illness Description,APR Risk of Mortality,APR Medical Surgical Description,Payment Typology 1,Payment Typology 2,Payment Typology 3,Birth Weight,Abortion Edit Indicator,Emergency Department Indicator,Total Charges,Total Costs
New York City,Manhattan,7002053,001463,NYU Langone Hospitals,50 to 69,113,M,White,Not Span/Hispanic,1,Emergency,Home or Self Care,2019,SYM013,RESPIRATORY SIGNS AND SYMPTOMS,,,145,ACUTE BRONCHITIS AND RELATED SYMPTOMS,04,DISEASES AND DISORDERS OF THE RESPIRATORY SYSTEM,2,Moderate,Minor,Medical,Medicaid,,,,,true,13709.24,4407.64
New York City,Manhattan,7002053,001463,NYU Langone Hospitals,50 to 69,112,F,White,Unknown,2,Emergency,Home or Self Care,2019,SYM013,RESPIRATORY SIGNS AND SYMPTOMS,,,145,ACUTE BRONCHITIS AND RELATED SYMPTOMS,04,DISEASES AND DISORDERS OF THE RESPIRATORY SYSTEM,1,Minor,Minor,Medical,Medicaid,,,,,true,45250.87,10021.83
New York City,Manhattan,7002053,001463,NYU Langone Hospitals,50 to 69,100,M,White,Not Span/Hispanic,1,Emergency,Home or Self Care,2019,RSP005,ACUTE BRONCHITIS,,,145,ACUTE BRONCHITIS AND RELATED SYMPTOMS,04,DISEASES AND DISORDERS OF THE RESPIRATORY SYSTEM,2,Moderate,Minor,Medical,Medicare,,,,,true,28808.26,6704.08
New York City,Manhattan,7002053,001463,NYU Langone Hospitals,30 to 49,100,M,Other Race,Unknown,5,Emergency,Left Against Medical Advice,2019,SYM013,RESPIRATORY SIGNS AND SYMPTOMS,GIS004,GI SYSTEM ENDOSCOPY WITHOUT BIOPSY (DIAGNOSTIC),145,ACUTE BRONCHITIS AND RELATED SYMPTOMS,04,DISEASES AND DISORDERS OF THE RESPIRATORY SYSTEM,2,Moderate,Minor,Medical,Self-Pay,,,,,true,119243.45,31715.41
New York City,Manhattan,7002053,001463,NYU Langone Hospitals,70 or Older,OOS,F,Multi-racial,Not Span/Hispanic,2,Emergency,Home or Self Care,2019,SYM013,RESPIRATORY SIGNS AND SYMPTOMS,,,145,ACUTE BRONCHITIS AND RELATED SYMPTOMS,04,DISEASES AND DISORDERS OF THE RESPIRATORY SYSTEM,3,Major,Major,Medical,Medicare,,,,,true,32140.74,9185.72
New York City,Manhattan,7002053,001463,NYU Langone Hospitals,50 to 69,100,M,Other Race,Not Span/Hispanic,1,Emergency,Home or Self Care,2019,SYM013,RESPIRATORY SIGNS AND SYMPTOMS,,,145,ACUTE BRONCHITIS AND RELATED SYMPTOMS,04,DISEASES AND DISORDERS OF THE RESPIRATORY SYSTEM,1,Minor,Minor,Medical,Blue Cross/Blue Shield,,,,,true,20052.75,5252.17
New York City,Manhattan,7002053,001463,NYU Langone Hospitals,70 or Older,100,F,White,Not Span/Hispanic,4,Emergency,Home w/ Home Health Services,2019,RSP006,OTHER SPECIFIED UPPER RESPIRATORY INFECTIONS,,,145,ACUTE BRONCHITIS AND RELATED SYMPTOMS,04,DISEASES AND DISORDERS OF THE RESPIRATORY SYSTEM,3,Major,Major,Medical,Medicare,Medicare,,,,true,68885.61,22434.16
New York City,Manhattan,7002053,001463,NYU Langone Hospitals,50 to 69,114,F,Other Race,Not Span/Hispanic,1,Emergency,Home or Self Care,2019,SYM013,RESPIRATORY SIGNS AND SYMPTOMS,,,145,ACUTE BRONCHITIS AND RELATED SYMPTOMS,04,DISEASES AND DISORDERS OF THE RESPIRATORY SYSTEM,1,Minor,Minor,Medical,Medicaid,,,,,true,47828.05,16243.12
New York City,Manhattan,7002053,001463,NYU Langone Hospitals,70 or Older,100,M,White,Not Span/Hispanic,2,Emergency,Home or Self Care,2019,RSP005,ACUTE BRONCHITIS,,,145,ACUTE BRONCHITIS AND RELATED SYMPTOMS,04,DISEASES AND DISORDERS OF THE RESPIRATORY SYSTEM,3,Major,Moderate,Medical,Medicare,Blue Cross/Blue Shield,,,,true,48961.57,16066.23
New York City,Manhattan,7002053,001463,NYU Langone Hospitals,0 to 17,112,M,Other Race,Unknown,1,Emergency,Home or Self Care,2019,RSP006,OTHER SPECIFIED UPPER RESPIRATORY INFECTIONS,OTR004,ISOLATION PROCEDURES,145,ACUTE BRONCHITIS AND RELATED SYMPTOMS,04,DISEASES AND DISORDERS OF THE RESPIRATORY SYSTEM,2,Moderate,Minor,Medical,Medicaid,,,,,false,11575.13,4960.01
New York City,Manhattan,7002053,001463,NYU Langone Hospitals,50 to 69,100,F,Other Race,Not Span/Hispanic,1,Emergency,Home or Self Care,2019,SYM013,RESPIRATORY SIGNS AND SYMPTOMS,,,145,ACUTE BRONCHITIS AND RELATED SYMPTOMS,04,DISEASES AND DISORDERS OF THE RESPIRATORY SYSTEM,2,Moderate,Minor,Medical,Medicare,,,,,true,33809.76,7387.87
New York City,Manhattan,7002053,001463,NYU Langone Hospitals,70 or Older,100,F,White,Not Span/Hispanic,2,Emergency,Home or Self Care,2019,SYM013,RESPIRATORY SIGNS AND SYMPTOMS,,,145,ACUTE BRONCHITIS AND RELATED SYMPTOMS,04,DISEASES AND DISORDERS OF THE RESPIRATORY SYSTEM,3,Major,Major,Medical,Medicare,Medicare,,,,true,53138,12195.87
New York City,Manhattan,7002053,001463,NYU Langone Hospitals,70 or Older,113,F,White,Not Span/Hispanic,2,Emergency,Home or Self Care,2019,RSP005,ACUTE BRONCHITIS,,,145,ACUTE BRONCHITIS AND RELATED SYMPTOMS,04,DISEASES AND DISORDERS OF THE RESPIRATORY SYSTEM,3,Major,Major,Medical,Medicare,Medicare,,,,true,42178.42,13443.85
New York City,Manhattan,7002053,001463,NYU Langone Hospitals,50 to 69,112,M,Other Race,Not Span/Hispanic,2,Emergency,Home w/ Home Health Services,2019,RSP005,ACUTE BRONCHITIS,,,145,ACUTE BRONCHITIS AND RELATED SYMPTOMS,04,DISEASES AND DISORDERS OF THE RESPIRATORY SYSTEM,3,Major,Major,Medical,Medicare,Private Health Insurance,,,,true,33851.26,9111.5
New York City,Manhattan,7002053,001463,NYU Langone Hospitals,30 to 49,112,F,Black/African American,Not Span/Hispanic,1,Emergency,Home or Self Care,2019,SYM013,RESPIRATORY SIGNS AND SYMPTOMS,,,145,ACUTE BRONCHITIS AND RELATED SYMPTOMS,04,DISEASES AND DISORDERS OF THE RESPIRATORY SYSTEM,1,Minor,Minor,Medical,Private Health Insurance,,,,,true,41532.07,10634.09
New York City,Manhattan,7002053,001463,NYU Langone Hospitals,70 or Older,100,M,White,Not Span/Hispanic,2,Emergency,Home or Self Care,2019,RSP005,ACUTE BRONCHITIS,,,145,ACUTE BRONCHITIS AND RELATED SYMPTOMS,04,DISEASES AND DISORDERS OF THE RESPIRATORY SYSTEM,3,Major,Major,Medical,Medicare,Blue Cross/Blue Shield,,,,true,51027.12,19048.65
New York City,Manhattan,7002053,001463,NYU Langone Hospitals,50 to 69,112,F,Other Race,Not Span/Hispanic,1,Emergency,Skilled Nursing Home,2019,SYM013,RESPIRATORY SIGNS AND SYMPTOMS,,,145,ACUTE BRONCHITIS AND RELATED SYMPTOMS,04,DISEASES AND DISORDERS OF THE RESPIRATORY SYSTEM,2,Moderate,Minor,Medical,Medicaid,,,,,true,30520.45,7233.02
New York City,Manhattan,7002053,001463,NYU Langone Hospitals,70 or Older,100,F,White,Not Span/Hispanic,1,Emergency,Home w/ Home Health Services,2019,RSP005,ACUTE BRONCHITIS,,,145,ACUTE BRONCHITIS AND RELATED SYMPTOMS,04,DISEASES AND DISORDERS OF THE RESPIRATORY SYSTEM,3,Major,Major,Medical,Medicare,Medicare,Medicaid,,,true,50664.02,16760.13
New York City,Manhattan,7002053,001463,NYU Langone Hospitals,0 to 17,112,F,White,Not Span/Hispanic,1,Elective,Home or Self Care,2019,RSP005,ACUTE BRONCHITIS,RES001,BRONCHOSCOPY (DIAGNOSTIC),145,ACUTE BRONCHITIS AND RELATED SYMPTOMS,04,DISEASES AND DISORDERS OF THE RESPIRATORY SYSTEM,3,Major,Minor,Medical,Medicaid,,,,,false,47982.51,8478.28
New York City,Manhattan,7002053,001463,NYU Langone Hospitals,50 to 69,114,M,Black/African American,Not Span/Hispanic,1,Emergency,Home or Self Care,2019,SYM013,RESPIRATORY SIGNS AND SYMPTOMS,,,145,ACUTE BRONCHITIS AND RELATED SYMPTOMS,04,DISEASES AND DISORDERS OF THE RESPIRATORY SYSTEM,2,Moderate,Minor,Medical,Private Health Insurance,,,,,true,33500.28,10594.49
New York City,Manhattan,7002053,001463,NYU Langone Hospitals,50 to 69,100,F,White,Not Span/Hispanic,1,Emergency,Home or Self Care,2019,SYM013,RESPIRATORY SIGNS AND SYMPTOMS,,,145,ACUTE BRONCHITIS AND RELATED SYMPTOMS,04,DISEASES AND DISORDERS OF THE RESPIRATORY SYSTEM,2,Moderate,Minor,Medical,Medicaid,,,,,true,16645.53,4826.85
New York City,Manhattan,7002053,001463,NYU Langone Hospitals,50 to 69,100,F,Other Race,Not Span/Hispanic,1,Emergency,Home or Self Care,2019,SYM013,RESPIRATORY SIGNS AND SYMPTOMS,,,145,ACUTE BRONCHITIS AND RELATED SYMPTOMS,04,DISEASES AND DISORDERS OF THE RESPIRATORY SYSTEM,1,Minor,Minor,Medical,Blue Cross/Blue Shield,,,,,true,28471.11,6942.68
New York City,Manhattan,7002053,001463,NYU Langone Hospitals,70 or Older,100,M,Black/African American,Not Span/Hispanic,1,Emergency,Home or Self Care,2019,RSP005,ACUTE BRONCHITIS,,,145,ACUTE BRONCHITIS AND RELATED SYMPTOMS,04,DISEASES AND DISORDERS OF THE RESPIRATORY SYSTEM,2,Moderate,Moderate,Medical,Private Health Insurance,Medicare,,,,true,43184.56,11231.82
New York City,Manhattan,7002053,001463,NYU Langone Hospitals,30 to 49,112,M,White,Not Span/Hispanic,1,Emergency,Home or Self Care,2019,RSP005,ACUTE BRONCHITIS,ADM021,"ADMINISTRATION OF THERAPEUTIC SUBSTANCES, NEC",145,ACUTE BRONCHITIS AND RELATED SYMPTOMS,04,DISEASES AND DISORDERS OF THE RESPIRATORY SYSTEM,3,Major,Major,Medical,Blue Cross/Blue Shield,,,,,true,21545.79,7987.43
New York City,Manhattan,7002053,001463,NYU Langone Hospitals,70 or Older,100,F,White,Not Span/Hispanic,3,Emergency,Home w/ Home Health Services,2019,RSP005,ACUTE BRONCHITIS,,,145,ACUTE BRONCHITIS AND RELATED SYMPTOMS,04,DISEASES AND DISORDERS OF THE RESPIRATORY SYSTEM,3,Major,Major,Medical,Medicare,Medicaid,,,,false,31300.27,10460.57
New York City,Manhattan,7002053,001463,NYU Langone Hospitals,50 to 69,100,F,Black/African American,Unknown,1,Emergency,Left Against Medical Advice,2019,SYM013,RESPIRATORY SIGNS AND SYMPTOMS,,,145,ACUTE BRONCHITIS AND RELATED SYMPTOMS,04,DISEASES AND DISORDERS OF THE RESPIRATORY SYSTEM,2,Moderate,Moderate,Medical,Medicaid,,,,,true,14683.33,4531.88
New York City,Manhattan,7002053,001463,NYU Langone Hospitals,70 or Older,100,M,White,Not Span/Hispanic,1,Emergency,Left Against Medical Advice,2019,SYM013,RESPIRATORY SIGNS AND SYMPTOMS,,,145,ACUTE BRONCHITIS AND RELATED SYMPTOMS,04,DISEASES AND DISORDERS OF THE RESPIRATORY SYSTEM,2,Moderate,Major,Medical,Medicare,,,,,true,19554.13,5634.39
New York City,Manhattan,7002053,001463,NYU Langone Hospitals,70 or Older,113,F,Other Race,Spanish/Hispanic,5,Emergency,Home w/ Home Health Services,2019,RSP005,ACUTE BRONCHITIS,URN006,BLADDER CATHETERIZATION AND DRAINAGE,145,ACUTE BRONCHITIS AND RELATED SYMPTOMS,04,DISEASES AND DISORDERS OF THE RESPIRATORY SYSTEM,2,Moderate,Moderate,Medical,Medicare,Medicaid,,,,true,78676.52,26278.59
New York City,Manhattan,7002053,001463,NYU Langone Hospitals,50 to 69,104,F,Other Race,Unknown,3,Emergency,Home or Self Care,2019,RSP005,ACUTE BRONCHITIS,,,145,ACUTE BRONCHITIS AND RELATED SYMPTOMS,04,DISEASES AND DISORDERS OF THE RESPIRATORY SYSTEM,3,Major,Minor,Medical,Medicare,,,,,true,33648.51,11491.68
New York City,Manhattan,7002053,001463,NYU Langone Hospitals,18 to 29,OOS,M,Other Race,Not Span/Hispanic,3,Emergency,Home or Self Care,2019,RSP011,"PLEURISY, PLEURAL EFFUSION AND PULMONARY COLLAPSE",,,145,ACUTE BRONCHITIS AND RELATED SYMPTOMS,04,DISEASES AND DISORDERS OF THE RESPIRATORY SYSTEM,2,Moderate,Minor,Medical,Medicare,,,,,true,49866.47,13386.83
New York City,Manhattan,7002053,001463,NYU Langone Hospitals,50 to 69,113,M,White,Not Span/Hispanic,2,Emergency,Home or Self Care,2019,RSP005,ACUTE BRONCHITIS,,,145,ACUTE BRONCHITIS AND RELATED SYMPTOMS,04,DISEASES AND DISORDERS OF THE RESPIRATORY SYSTEM,1,Minor,Minor,Medical,Blue Cross/Blue Shield,,,,,true,53052.23,15729.71
New York City,Manhattan,7002053,001463,NYU Langone Hospitals,50 to 69,107,M,Black/African American,Not Span/Hispanic,4,Emergency,Home w/ Home Health Services,2019,SYM013,RESPIRATORY SIGNS AND SYMPTOMS,,,145,ACUTE BRONCHITIS AND RELATED SYMPTOMS,04,DISEASES AND DISORDERS OF THE RESPIRATORY SYSTEM,2,Moderate,Minor,Medical,Medicaid,,,,,true,69802.54,18651.98
New York City,Manhattan,7002053,001463,NYU Langone Hospitals,70 or Older,116,M,White,Not Span/Hispanic,2,Emergency,Home or Self Care,2019,RSP005,ACUTE BRONCHITIS,,,145,ACUTE BRONCHITIS AND RELATED SYMPTOMS,04,DISEASES AND DISORDERS OF THE RESPIRATORY SYSTEM,2,Moderate,Minor,Medical,Medicare,,,,,true,33270.57,8996.65
New York City,Manhattan,7002053,001463,NYU Langone Hospitals,0 to 17,112,M,Other Race,Not Span/Hispanic,2,Emergency,Home or Self Care,2019,RSP005,ACUTE BRONCHITIS,,,145,ACUTE BRONCHITIS AND RELATED SYMPTOMS,04,DISEASES AND DISORDERS OF THE RESPIRATORY SYSTEM,2,Moderate,Minor,Medical,Medicaid,,,,,true,35069.65,12139.03
New York City,Manhattan,7002053,001463,NYU Langone Hospitals,0 to 17,112,M,Other Race,Spanish/Hispanic,11,Emergency,Home or Self Care,2019,RSP006,OTHER SPECIFIED UPPER RESPIRATORY INFECTIONS,ADM017,ADMINISTRATION OF NUTRITIONAL AND ELECTROLYTIC SUBSTANCES,145,ACUTE BRONCHITIS AND RELATED SYMPTOMS,04,DISEASES AND DISORDERS OF THE RESPIRATORY SYSTEM,4,Extreme,Major,Medical,Medicaid,,,,,true,193376.09,73129.56
New York City,Manhattan,7002053,001463,NYU Langone Hospitals,70 or Older,112,F,Black/African American,Not Span/Hispanic,5,Emergency,Home w/ Home Health Services,2019,SYM013,RESPIRATORY SIGNS AND SYMPTOMS,IMG008,ULTRASONOGRAPHY,145,ACUTE BRONCHITIS AND RELATED SYMPTOMS,04,DISEASES AND DISORDERS OF THE RESPIRATORY SYSTEM,3,Major,Moderate,Medical,Medicare,,,,,true,93161.77,20149.33
New York City,Manhattan,7002053,001463,NYU Langone Hospitals,70 or Older,112,F,White,Not Span/Hispanic,3,Emergency,Home or Self Care,2019,RSP005,ACUTE BRONCHITIS,,,145,ACUTE BRONCHITIS AND RELATED SYMPTOMS,04,DISEASES AND DISORDERS OF THE RESPIRATORY SYSTEM,3,Major,Major,Medical,Medicare,,,,,true,53147.27,17088.85
New York City,Manhattan,7002053,001463,NYU Langone Hospitals,70 or Older,105,M,White,Not Span/Hispanic,3,Emergency,Home w/ Home Health Services,2019,RSP006,OTHER SPECIFIED UPPER RESPIRATORY INFECTIONS,,,145,ACUTE BRONCHITIS AND RELATED SYMPTOMS,04,DISEASES AND DISORDERS OF THE RESPIRATORY SYSTEM,3,Major,Moderate,Medical,Medicare,,,,,true,36224.12,11431.41
New York City,Manhattan,7002053,001463,NYU Langone Hospitals,50 to 69,112,F,Other Race,Not Span/Hispanic,1,Emergency,Home w/ Home Health Services,2019,SYM013,RESPIRATORY SIGNS AND SYMPTOMS,,,145,ACUTE BRONCHITIS AND RELATED SYMPTOMS,04,DISEASES AND DISORDERS OF THE RESPIRATORY SYSTEM,4,Extreme,Major,Medical,Medicare,,,,,true,43923.78,13659.2
New York City,Manhattan,7002053,001463,NYU Langone Hospitals,0 to 17,112,F,Other Race,Spanish/Hispanic,13,Emergency,Home w/ Home Health Services,2019,RSP005,ACUTE BRONCHITIS,CAR024,VENOUS AND ARTERIAL CATHETER PLACEMENT,145,ACUTE BRONCHITIS AND RELATED SYMPTOMS,04,DISEASES AND DISORDERS OF THE RESPIRATORY SYSTEM,3,Major,Moderate,Medical,Medicaid,,,,,true,164577.6,62667.97
New York City,Manhattan,7002053,001463,NYU Langone Hospitals,30 to 49,113,F,Other Race,Not Span/Hispanic,1,Emergency,Home or Self Care,2019,SYM013,RESPIRATORY SIGNS AND SYMPTOMS,OTR004,ISOLATION PROCEDURES,145,ACUTE BRONCHITIS AND RELATED SYMPTOMS,04,DISEASES AND DISORDERS OF THE RESPIRATORY SYSTEM,1,Minor,Minor,Medical,Medicaid,,,,,true,26652.35,6560.02
New York City,Manhattan,7002053,001463,NYU Langone Hospitals,0 to 17,112,F,White,Not Span/Hispanic,4,Emergency,Home w/ Home Health Services,2019,RSP006,OTHER SPECIFIED UPPER RESPIRATORY INFECTIONS,,,145,ACUTE BRONCHITIS AND RELATED SYMPTOMS,04,DISEASES AND DISORDERS OF THE RESPIRATORY SYSTEM,2,Moderate,Minor,Medical,Medicaid,,,,,true,65548.26,20173.01
New York City,Manhattan,7002053,001463,NYU Langone Hospitals,50 to 69,107,F,Other Race,Spanish/Hispanic,1,Emergency,Home or Self Care,2019,SYM013,RESPIRATORY SIGNS AND SYMPTOMS,,,145,ACUTE BRONCHITIS AND RELATED SYMPTOMS,04,DISEASES AND DISORDERS OF THE RESPIRATORY SYSTEM,3,Major,Moderate,Medical,Medicaid,,,,,true,54757.58,11185.46
New York City,Manhattan,7002053,001463,NYU Langone Hospitals,18 to 29,115,F,Black/African American,Not Span/Hispanic,4,Emergency,Home or Self Care,2019,RSP011,"PLEURISY, PLEURAL EFFUSION AND PULMONARY COLLAPSE",,,145,ACUTE BRONCHITIS AND RELATED SYMPTOMS,04,DISEASES AND DISORDERS OF THE RESPIRATORY SYSTEM,3,Major,Major,Medical,Medicaid,,,,,true,62646.1,20299.96
New York City,Manhattan,7002053,001463,NYU Langone Hospitals,30 to 49,113,M,White,Not Span/Hispanic,1,Emergency,Left Against Medical Advice,2019,SYM013,RESPIRATORY SIGNS AND SYMPTOMS,,,145,ACUTE BRONCHITIS AND RELATED SYMPTOMS,04,DISEASES AND DISORDERS OF THE RESPIRATORY SYSTEM,3,Major,Moderate,Medical,Medicaid,,,,,true,13795.41,4423.52
New York City,Manhattan,7002053,001463,NYU Langone Hospitals,0 to 17,104,F,Other Race,Spanish/Hispanic,8,Emergency,Home w/ Home Health Services,2019,RSP006,OTHER SPECIFIED UPPER RESPIRATORY INFECTIONS,CAR024,VENOUS AND ARTERIAL CATHETER PLACEMENT,145,ACUTE BRONCHITIS AND RELATED SYMPTOMS,04,DISEASES AND DISORDERS OF THE RESPIRATORY SYSTEM,4,Extreme,Major,Medical,Medicaid,,,,,false,160068.68,58756.03
New York City,Manhattan,7002053,001463,NYU Langone Hospitals,50 to 69,117,M,White,Unknown,2,Emergency,Home or Self Care,2019,RSP005,ACUTE BRONCHITIS,OTR004,ISOLATION PROCEDURES,145,ACUTE BRONCHITIS AND RELATED SYMPTOMS,04,DISEASES AND DISORDERS OF THE RESPIRATORY SYSTEM,2,Moderate,Minor,Medical,Private Health Insurance,,,,,true,48714.22,12148.62
