Hospital Service Area,Hospital County,Operating Certificate Number,Permanent Facility Id,Facility Name,Age Group,Zip Code - 3 digits,Gender,Race,Ethnicity,Length of Stay,Type of Admission,Patient Disposition,Discharge Year,CCS Diagnosis Code,CCS Diagnosis Description,CCS Procedure Code,CCS Procedure Description,APR DRG Code,APR DRG Description,APR MDC Code,APR MDC Description,APR Severity of Illness Code,APR Severity of Illness Description,APR Risk of Mortality,APR Medical Surgical Description,Payment Typology 1,Payment Typology 2,Payment Typology 3,Birth Weight,Abortion Edit Indicator,Emergency Department Indicator,Total Charges,Total Costs
Long Island,Suffolk,5123000,000885,Long Island Community Hospital,30 to 49,117,M,White,Not Span/Hispanic,4,Emergency,Home or Self Care,2020,RSP005,ACUTE BRONCHITIS,,,145,ACUTE BRONCHITIS & RELATED SYMPTOMS,04,DISEASES AND DISORDERS OF THE RESPIRATORY SYSTEM,4,Extreme,Extreme,Medical,Medicare,Medicare,Medicaid,,,Y,31016.85,6216.95
Long Island,Suffolk,5123000,000885,Long Island Community Hospital,70 or Older,117,F,Other Race,Not Span/Hispanic,1,Emergency,Home or Self Care,2020,RSP005,ACUTE BRONCHITIS,,,145,ACUTE BRONCHITIS & RELATED SYMPTOMS,04,DISEASES AND DISORDERS OF THE RESPIRATORY SYSTEM,1,Minor,Minor,Medical,Medicare,,,,,Y,11638.4,2039.45
Long Island,Suffolk,5123000,000885,Long Island Community Hospital,70 or Older,117,F,White,Not Span/Hispanic,3,Emergency,Home or Self Care,2020,RSP005,ACUTE BRONCHITIS,,,145,ACUTE BRONCHITIS & RELATED SYMPTOMS,04,DISEASES AND DISORDERS OF THE RESPIRATORY SYSTEM,2,Moderate,Minor,Medical,Medicare,Medicare,Private Health Insurance,,,Y,25326.57,5142.14
Long Island,Suffolk,5123000,000885,Long Island Community Hospital,50 to 69,119,F,White,Not Span/Hispanic,2,Emergency,Home or Self Care,2020,RSP005,ACUTE BRONCHITIS,,,145,ACUTE BRONCHITIS & RELATED SYMPTOMS,04,DISEASES AND DISORDERS OF THE RESPIRATORY SYSTEM,2,Moderate,Minor,Medical,Blue Cross/Blue Shield,,,,,Y,20980.62,3369.54
Long Island,Suffolk,5123000,000885,Long Island Community Hospital,70 or Older,119,F,White,Not Span/Hispanic,3,Emergency,Home or Self Care,2020,RSP005,ACUTE BRONCHITIS,,,145,ACUTE BRONCHITIS & RELATED SYMPTOMS,04,DISEASES AND DISORDERS OF THE RESPIRATORY SYSTEM,1,Minor,Minor,Medical,Medicare,Medicare,Private Health Insurance,,,Y,52076.64,5938.72
Long Island,Suffolk,5123000,000885,Long Island Community Hospital,70 or Older,117,M,Other Race,Not Span/Hispanic,6,Emergency,Home w/ Home Health Services,2020,RSP005,ACUTE BRONCHITIS,,,145,ACUTE BRONCHITIS & RELATED SYMPTOMS,04,DISEASES AND DISORDERS OF THE RESPIRATORY SYSTEM,2,Moderate,Moderate,Medical,Medicare,Medicare,,,,Y,49789.62,9419.22
Long Island,Suffolk,5123000,000885,Long Island Community Hospital,70 or Older,117,F,White,Not Span/Hispanic,9,Emergency,Skilled Nursing Home,2020,RSP005,ACUTE BRONCHITIS,,,145,ACUTE BRONCHITIS & RELATED SYMPTOMS,04,DISEASES AND DISORDERS OF THE RESPIRATORY SYSTEM,3,Major,Minor,Medical,Medicare,Medicare,Private Health Insurance,,,Y,68164.11,12310.43
Long Island,Suffolk,5123000,000885,Long Island Community Hospital,30 to 49,117,F,White,Not Span/Hispanic,3,Emergency,Home or Self Care,2020,RSP005,ACUTE BRONCHITIS,,,145,ACUTE BRONCHITIS & RELATED SYMPTOMS,04,DISEASES AND DISORDERS OF THE RESPIRATORY SYSTEM,2,Moderate,Minor,Medical,Private Health Insurance,,,,,Y,27715.28,5431.64
Long Island,Suffolk,5123000,000885,Long Island Community Hospital,50 to 69,117,F,Other Race,Not Span/Hispanic,1,Emergency,Left Against Medical Advice,2020,SYM013,RESPIRATORY SIGNS AND SYMPTOMS,,,145,ACUTE BRONCHITIS & RELATED SYMPTOMS,04,DISEASES AND DISORDERS OF THE RESPIRATORY SYSTEM,1,Minor,Moderate,Medical,Private Health Insurance,Medicaid,,,,Y,15278.54,2705.11
Long Island,Suffolk,5123000,000885,Long Island Community Hospital,50 to 69,119,M,White,Not Span/Hispanic,7,Emergency,Home or Self Care,2020,RSP005,ACUTE BRONCHITIS,ESA004,NON-INVASIVE VENTILATION,145,ACUTE BRONCHITIS & RELATED SYMPTOMS,04,DISEASES AND DISORDERS OF THE RESPIRATORY SYSTEM,3,Major,Major,Medical,Private Health Insurance,Medicaid,,,,Y,62752.26,16065.98
Long Island,Suffolk,5123000,000885,Long Island Community Hospital,30 to 49,117,F,White,Not Span/Hispanic,1,Emergency,Left Against Medical Advice,2020,RSP005,ACUTE BRONCHITIS,,,145,ACUTE BRONCHITIS & RELATED SYMPTOMS,04,DISEASES AND DISORDERS OF THE RESPIRATORY SYSTEM,2,Moderate,Moderate,Medical,Medicare,,,,,Y,20457.05,4393.39
Long Island,Suffolk,5123000,000885,Long Island Community Hospital,30 to 49,117,F,White,Not Span/Hispanic,1,Emergency,Home or Self Care,2020,SYM013,RESPIRATORY SIGNS AND SYMPTOMS,,,145,ACUTE BRONCHITIS & RELATED SYMPTOMS,04,DISEASES AND DISORDERS OF THE RESPIRATORY SYSTEM,2,Moderate,Minor,Medical,Medicare,Medicare,Medicaid,,,Y,16037.71,2623.39
