Hospital Service Area,Hospital County,Operating Certificate Number,Permanent Facility Id,Facility Name,Age Group,Zip Code - 3 digits,Gender,Race,Ethnicity,Length of Stay,Type of Admission,Patient Disposition,Discharge Year,CCS Diagnosis Code,CCS Diagnosis Description,CCS Procedure Code,CCS Procedure Description,APR DRG Code,APR DRG Description,APR MDC Code,APR MDC Description,APR Severity of Illness Code,APR Severity of Illness Description,APR Risk of Mortality,APR Medical Surgical Description,Payment Typology 1,Payment Typology 2,Payment Typology 3,Birth Weight,Abortion Edit Indicator,Emergency Department Indicator,Total Charges,Total Costs
New York City,Manhattan,7002024,001456,Mount Sinai Hospital,0 to 17,100,M,Black/African American,Not Span/Hispanic,10,Elective,Home w/ Home Health Services,2017,213,Cardiac and circulatory congenital anomalies,049,OTHER OR HEART PRCS,160,Major cardiothoracic repair of heart anomaly,05,Diseases and Disorders of the Circulatory System,4,Extreme,Major,Surgical,Medicaid,Medicaid,Self-Pay,,N,N,213964.71,54311.09
New York City,Manhattan,7002054,001464,New York Presbyterian Hospital - Columbia Presbyterian Center,0 to 17,112,M,Multi-racial,Not Span/Hispanic,52,Elective,Home or Self Care,2017,213,Cardiac and circulatory congenital anomalies,049,OTHER OR HEART PRCS,160,Major cardiothoracic repair of heart anomaly,05,Diseases and Disorders of the Circulatory System,4,Extreme,Major,Surgical,Private Health Insurance,Self-Pay,,,N,N,673744.41,215153.07
New York City,Manhattan,7002054,001464,New York Presbyterian Hospital - Columbia Presbyterian Center,0 to 17,105,M,Other Race,Not Span/Hispanic,3,Elective,Home or Self Care,2017,237,Complication of device; implant or graft,049,OTHER OR HEART PRCS,160,Major cardiothoracic repair of heart anomaly,05,Diseases and Disorders of the Circulatory System,3,Major,Minor,Surgical,Medicaid,Medicaid,Self-Pay,,N,N,106156.34,38796.04
New York City,Manhattan,7002054,001464,New York Presbyterian Hospital - Columbia Presbyterian Center,0 to 17,117,F,White,Not Span/Hispanic,5,Elective,Home or Self Care,2017,213,Cardiac and circulatory congenital anomalies,056,OT VASCULAR BYP/SHUNT,160,Major cardiothoracic repair of heart anomaly,05,Diseases and Disorders of the Circulatory System,3,Major,Major,Surgical,Blue Cross/Blue Shield,Self-Pay,,,N,N,126808.23,49203.31
New York City,Manhattan,7002054,001464,New York Presbyterian Hospital - Columbia Presbyterian Center,0 to 17,100,M,Other Race,Not Span/Hispanic,13,Elective,Home or Self Care,2017,213,Cardiac and circulatory congenital anomalies,049,OTHER OR HEART PRCS,160,Major cardiothoracic repair of heart anomaly,05,Diseases and Disorders of the Circulatory System,3,Major,Moderate,Surgical,Self-Pay,Self-Pay,,,N,N,205957.05,69992.24
New York City,Manhattan,7002054,001464,New York Presbyterian Hospital - Columbia Presbyterian Center,0 to 17,125,F,Multi-racial,Not Span/Hispanic,49,Emergency,Home w/ Home Health Services,2017,103,Pulmonary heart disease,216,RESP INTUB/MECH VENTIL,160,Major cardiothoracic repair of heart anomaly,05,Diseases and Disorders of the Circulatory System,4,Extreme,Major,Surgical,Private Health Insurance,Self-Pay,,,N,Y,985309.82,399864.87
New York City,Bronx,7000006,001169,Montefiore Medical Center - Henry & Lucy Moses Div,0 to 17,104,F,Other Race,Not Span/Hispanic,4,Elective,Home or Self Care,2017,237,Complication of device; implant or graft,049,OTHER OR HEART PRCS,160,Major cardiothoracic repair of heart anomaly,05,Diseases and Disorders of the Circulatory System,4,Extreme,Major,Surgical,Medicaid,,,,N,N,160970.46,41063.17
New York City,Bronx,7000006,001169,Montefiore Medical Center - Henry & Lucy Moses Div,0 to 17,104,M,Other Race,Spanish/Hispanic,10,Emergency,Home or Self Care,2017,213,Cardiac and circulatory congenital anomalies,049,OTHER OR HEART PRCS,160,Major cardiothoracic repair of heart anomaly,05,Diseases and Disorders of the Circulatory System,4,Extreme,Extreme,Surgical,Medicaid,,,,N,N,389481.90,105708.23
New York City,Manhattan,7002024,001456,Mount Sinai Hospital,50 to 69,OOS,M,White,Not Span/Hispanic,26,Elective,Inpatient Rehabilitation Facility,2017,213,Cardiac and circulatory congenital anomalies,049,OTHER OR HEART PRCS,160,Major cardiothoracic repair of heart anomaly,05,Diseases and Disorders of the Circulatory System,4,Extreme,Extreme,Surgical,Private Health Insurance,Self-Pay,,,N,N,341682.01,114090.47
New York City,Manhattan,7002054,001458,New York Presbyterian Hospital - New York Weill Cornell Center,0 to 17,111,F,White,Spanish/Hispanic,5,Elective,Home or Self Care,2017,213,Cardiac and circulatory congenital anomalies,056,OT VASCULAR BYP/SHUNT,160,Major cardiothoracic repair of heart anomaly,05,Diseases and Disorders of the Circulatory System,3,Major,Moderate,Surgical,Blue Cross/Blue Shield,Self-Pay,,,N,N,161233.84,76801.08
New York City,Manhattan,7002054,001458,New York Presbyterian Hospital - New York Weill Cornell Center,0 to 17,100,F,Other Race,Not Span/Hispanic,5,Elective,Home or Self Care,2017,213,Cardiac and circulatory congenital anomalies,049,OTHER OR HEART PRCS,160,Major cardiothoracic repair of heart anomaly,05,Diseases and Disorders of the Circulatory System,3,Major,Major,Surgical,Miscellaneous/Other,Self-Pay,,,N,N,214705.89,104965.52
New York City,Manhattan,7002053,001463,NYU Langone Hospitals,0 to 17,112,F,Other Race,Not Span/Hispanic,3,Elective,Home or Self Care,2017,213,Cardiac and circulatory congenital anomalies,049,OTHER OR HEART PRCS,160,Major cardiothoracic repair of heart anomaly,05,Diseases and Disorders of the Circulatory System,4,Extreme,Major,Surgical,Private Health Insurance,,,,N,N,324124.82,67535.53
New York City,Manhattan,7002054,001464,New York Presbyterian Hospital - Columbia Presbyterian Center,30 to 49,OOS,M,Other Race,Not Span/Hispanic,31,Urgent,Home or Self Care,2017,237,Complication of device; implant or graft,049,OTHER OR HEART PRCS,160,Major cardiothoracic repair of heart anomaly,05,Diseases and Disorders of the Circulatory System,4,Extreme,Extreme,Surgical,Private Health Insurance,Self-Pay,,,N,N,797450.36,411669.72
New York City,Manhattan,7002054,001464,New York Presbyterian Hospital - Columbia Presbyterian Center,0 to 17,112,M,White,Not Span/Hispanic,41,Emergency,Home w/ Home Health Services,2017,213,Cardiac and circulatory congenital anomalies,049,OTHER OR HEART PRCS,160,Major cardiothoracic repair of heart anomaly,05,Diseases and Disorders of the Circulatory System,4,Extreme,Major,Surgical,Medicaid,Medicaid,Self-Pay,04400,N,N,963441.01,314148.23
New York City,Manhattan,7002054,001464,New York Presbyterian Hospital - Columbia Presbyterian Center,0 to 17,104,M,Multi-racial,Not Span/Hispanic,16,Urgent,Short-term Hospital,2017,237,Complication of device; implant or graft,049,OTHER OR HEART PRCS,160,Major cardiothoracic repair of heart anomaly,05,Diseases and Disorders of the Circulatory System,4,Extreme,Extreme,Surgical,Medicaid,Self-Pay,,,N,N,353509.15,168480.69
New York City,Manhattan,7002054,001464,New York Presbyterian Hospital - Columbia Presbyterian Center,0 to 17,OOS,F,Multi-racial,Not Span/Hispanic,4,Elective,Home or Self Care,2017,213,Cardiac and circulatory congenital anomalies,056,OT VASCULAR BYP/SHUNT,160,Major cardiothoracic repair of heart anomaly,05,Diseases and Disorders of the Circulatory System,2,Moderate,Minor,Surgical,Blue Cross/Blue Shield,Self-Pay,,,N,N,114770.68,45647.72
New York City,Manhattan,7002054,001464,New York Presbyterian Hospital - Columbia Presbyterian Center,0 to 17,,M,White,Spanish/Hispanic,8,Elective,Home or Self Care,2017,213,Cardiac and circulatory congenital anomalies,056,OT VASCULAR BYP/SHUNT,160,Major cardiothoracic repair of heart anomaly,05,Diseases and Disorders of the Circulatory System,3,Major,Major,Surgical,Medicaid,Medicaid,Self-Pay,,N,N,218018.93,95500.57
New York City,Manhattan,7002054,001464,New York Presbyterian Hospital - Columbia Presbyterian Center,18 to 29,OOS,M,White,Not Span/Hispanic,4,Elective,Home or Self Care,2017,213,Cardiac and circulatory congenital anomalies,056,OT VASCULAR BYP/SHUNT,160,Major cardiothoracic repair of heart anomaly,05,Diseases and Disorders of the Circulatory System,2,Moderate,Minor,Surgical,Blue Cross/Blue Shield,Self-Pay,,,N,N,118637.84,60322.01
New York City,Manhattan,7002054,001464,New York Presbyterian Hospital - Columbia Presbyterian Center,18 to 29,105,F,White,Not Span/Hispanic,6,Elective,Home or Self Care,2017,213,Cardiac and circulatory congenital anomalies,049,OTHER OR HEART PRCS,160,Major cardiothoracic repair of heart anomaly,05,Diseases and Disorders of the Circulatory System,2,Moderate,Minor,Surgical,Private Health Insurance,Self-Pay,,,N,N,152584.51,68547.23
New York City,Manhattan,7002054,001464,New York Presbyterian Hospital - Columbia Presbyterian Center,30 to 49,OOS,M,White,Not Span/Hispanic,4,Elective,Home or Self Care,2017,237,Complication of device; implant or graft,049,OTHER OR HEART PRCS,160,Major cardiothoracic repair of heart anomaly,05,Diseases and Disorders of the Circulatory System,3,Major,Minor,Surgical,Blue Cross/Blue Shield,Self-Pay,,,N,N,164953.13,79004.09
Western NY,Erie,1401008,000213,Mercy Hospital of Buffalo,50 to 69,140,F,White,Not Span/Hispanic,8,Emergency,Home w/ Home Health Services,2017,047,Other and unspecified benign neoplasm,049,OTHER OR HEART PRCS,160,Major cardiothoracic repair of heart anomaly,05,Diseases and Disorders of the Circulatory System,3,Major,Major,Surgical,Medicaid,Medicaid,,,N,Y,88468.88,37338.69
Long Island,Suffolk,5151001,000245,University Hospital,30 to 49,117,M,White,Not Span/Hispanic,4,Emergency,Home w/ Home Health Services,2017,047,Other and unspecified benign neoplasm,049,OTHER OR HEART PRCS,160,Major cardiothoracic repair of heart anomaly,05,Diseases and Disorders of the Circulatory System,2,Moderate,Moderate,Surgical,Blue Cross/Blue Shield,,,,N,Y,95730.75,31371.32
Finger Lakes,Monroe,2701005,000413,Strong Memorial Hospital,0 to 17,131,F,White,Not Span/Hispanic,11,Elective,Home or Self Care,2017,237,Complication of device; implant or graft,050,EXTRA CIRC AUX OPEN HRT,160,Major cardiothoracic repair of heart anomaly,05,Diseases and Disorders of the Circulatory System,3,Major,Major,Surgical,Blue Cross/Blue Shield,Self-Pay,Self-Pay,,N,N,65087.27,32177.61
Hudson Valley,Westchester,5957001,001139,Westchester Medical Center,0 to 17,125,F,White,Not Span/Hispanic,11,Elective,Home w/ Home Health Services,2017,213,Cardiac and circulatory congenital anomalies,049,OTHER OR HEART PRCS,160,Major cardiothoracic repair of heart anomaly,05,Diseases and Disorders of the Circulatory System,3,Major,Moderate,Surgical,Medicaid,Medicaid,,,N,N,543615.73,120310.83
New York City,Manhattan,7002024,001456,Mount Sinai Hospital,30 to 49,114,M,Black/African American,Not Span/Hispanic,10,Urgent,Home w/ Home Health Services,2017,237,Complication of device; implant or graft,043,HEART VALVE PRCS,160,Major cardiothoracic repair of heart anomaly,05,Diseases and Disorders of the Circulatory System,3,Major,Major,Surgical,Private Health Insurance,Medicaid,Self-Pay,,N,N,180189.61,64163.70
New York City,Manhattan,7002024,001456,Mount Sinai Hospital,0 to 17,104,M,Black/African American,Not Span/Hispanic,56,Emergency,Home w/ Home Health Services,2017,213,Cardiac and circulatory congenital anomalies,049,OTHER OR HEART PRCS,160,Major cardiothoracic repair of heart anomaly,05,Diseases and Disorders of the Circulatory System,4,Extreme,Extreme,Surgical,Medicaid,Medicaid,Self-Pay,,N,Y,737721.09,285433.14
New York City,Manhattan,7002024,001456,Mount Sinai Hospital,0 to 17,100,F,Other Race,Not Span/Hispanic,12,Emergency,Home or Self Care,2017,213,Cardiac and circulatory congenital anomalies,049,OTHER OR HEART PRCS,160,Major cardiothoracic repair of heart anomaly,05,Diseases and Disorders of the Circulatory System,3,Major,Major,Surgical,Medicaid,Self-Pay,,,N,Y,253253.57,83679.17
New York City,Queens,7003004,003376,Cohen Children's Medical Center,0 to 17,115,M,Other Race,Spanish/Hispanic,12,Elective,Home or Self Care,2017,213,Cardiac and circulatory congenital anomalies,056,OT VASCULAR BYP/SHUNT,160,Major cardiothoracic repair of heart anomaly,05,Diseases and Disorders of the Circulatory System,2,Moderate,Minor,Surgical,Medicaid,Medicaid,Self-Pay,,N,N,264687.06,77741.39
New York City,Queens,7003004,003376,Cohen Children's Medical Center,0 to 17,113,F,White,Not Span/Hispanic,9,Elective,Home or Self Care,2017,213,Cardiac and circulatory congenital anomalies,056,OT VASCULAR BYP/SHUNT,160,Major cardiothoracic repair of heart anomaly,05,Diseases and Disorders of the Circulatory System,4,Extreme,Major,Surgical,Medicaid,Medicaid,Self-Pay,,N,N,288651.06,87278.42
New York City,Queens,7003004,003376,Cohen Children's Medical Center,0 to 17,117,M,Other Race,Spanish/Hispanic,10,Elective,Home or Self Care,2017,213,Cardiac and circulatory congenital anomalies,056,OT VASCULAR BYP/SHUNT,160,Major cardiothoracic repair of heart anomaly,05,Diseases and Disorders of the Circulatory System,3,Major,Major,Surgical,Medicaid,Medicaid,Self-Pay,,N,N,214478.49,62819.68
New York City,Manhattan,7002024,001456,Mount Sinai Hospital,70 or Older,119,M,White,Not Span/Hispanic,17,Urgent,Home or Self Care,2017,237,Complication of device; implant or graft,047,DX CARDIAC CATHETERIZTN,160,Major cardiothoracic repair of heart anomaly,05,Diseases and Disorders of the Circulatory System,3,Major,Major,Surgical,Medicare,Private Health Insurance,Self-Pay,,N,N,264338.88,71747.79
New York City,Manhattan,7002053,001463,NYU Langone Hospitals,0 to 17,100,F,Multi-racial,Not Span/Hispanic,4,Elective,Home or Self Care,2017,213,Cardiac and circulatory congenital anomalies,056,OT VASCULAR BYP/SHUNT,160,Major cardiothoracic repair of heart anomaly,05,Diseases and Disorders of the Circulatory System,4,Extreme,Moderate,Surgical,Private Health Insurance,,,,N,N,348372.78,80507.19
New York City,Manhattan,7002054,001464,New York Presbyterian Hospital - Columbia Presbyterian Center,0 to 17,112,M,Multi-racial,Multi-ethnic,6,Elective,Home w/ Home Health Services,2017,237,Complication of device; implant or graft,049,OTHER OR HEART PRCS,160,Major cardiothoracic repair of heart anomaly,05,Diseases and Disorders of the Circulatory System,3,Major,Minor,Surgical,Medicaid,Medicaid,Self-Pay,,N,N,182004.98,77474.66
New York City,Manhattan,7002054,001464,New York Presbyterian Hospital - Columbia Presbyterian Center,0 to 17,OOS,F,Multi-racial,Multi-ethnic,4,Elective,Home or Self Care,2017,237,Complication of device; implant or graft,049,OTHER OR HEART PRCS,160,Major cardiothoracic repair of heart anomaly,05,Diseases and Disorders of the Circulatory System,3,Major,Moderate,Surgical,Blue Cross/Blue Shield,Self-Pay,,,N,N,137358.32,56720.53
New York City,Manhattan,7002053,001463,NYU Langone Hospitals,0 to 17,103,M,Other Race,Not Span/Hispanic,4,Elective,Home or Self Care,2017,213,Cardiac and circulatory congenital anomalies,049,OTHER OR HEART PRCS,160,Major cardiothoracic repair of heart anomaly,05,Diseases and Disorders of the Circulatory System,2,Moderate,Minor,Surgical,Private Health Insurance,,,,N,N,430467.04,81884.39
New York City,Manhattan,7002053,001463,NYU Langone Hospitals,0 to 17,100,M,White,Not Span/Hispanic,3,Elective,Home or Self Care,2017,213,Cardiac and circulatory congenital anomalies,049,OTHER OR HEART PRCS,160,Major cardiothoracic repair of heart anomaly,05,Diseases and Disorders of the Circulatory System,3,Major,Moderate,Surgical,Blue Cross/Blue Shield,,,,N,N,248752.79,61053.77
Finger Lakes,Monroe,2701005,000413,Strong Memorial Hospital,0 to 17,146,M,Other Race,Spanish/Hispanic,120 +,Elective,Home w/ Home Health Services,2017,237,Complication of device; implant or graft,049,OTHER OR HEART PRCS,160,Major cardiothoracic repair of heart anomaly,05,Diseases and Disorders of the Circulatory System,4,Extreme,Major,Surgical,Blue Cross/Blue Shield,Medicaid,Self-Pay,,N,N,810411.69,373852.57
Finger Lakes,Monroe,2701005,000413,Strong Memorial Hospital,0 to 17,,M,White,Not Span/Hispanic,23,Urgent,Home w/ Home Health Services,2017,213,Cardiac and circulatory congenital anomalies,049,OTHER OR HEART PRCS,160,Major cardiothoracic repair of heart anomaly,05,Diseases and Disorders of the Circulatory System,4,Extreme,Major,Surgical,Blue Cross/Blue Shield,Self-Pay,,03000,N,N,208241.39,90934.30
Finger Lakes,Monroe,2701005,000413,Strong Memorial Hospital,18 to 29,142,F,White,Not Span/Hispanic,9,Elective,Home or Self Care,2017,213,Cardiac and circulatory congenital anomalies,049,OTHER OR HEART PRCS,160,Major cardiothoracic repair of heart anomaly,05,Diseases and Disorders of the Circulatory System,3,Major,Major,Surgical,Blue Cross/Blue Shield,Self-Pay,,,N,N,80283.50,42893.52
Finger Lakes,Monroe,2701005,000413,Strong Memorial Hospital,0 to 17,136,F,White,Not Span/Hispanic,7,Elective,Home or Self Care,2017,237,Complication of device; implant or graft,049,OTHER OR HEART PRCS,160,Major cardiothoracic repair of heart anomaly,05,Diseases and Disorders of the Circulatory System,3,Major,Major,Surgical,Blue Cross/Blue Shield,Self-Pay,,,N,N,82631.40,39791.31
Finger Lakes,Monroe,2701005,000413,Strong Memorial Hospital,0 to 17,148,M,White,Not Span/Hispanic,6,Elective,Home or Self Care,2017,237,Complication of device; implant or graft,049,OTHER OR HEART PRCS,160,Major cardiothoracic repair of heart anomaly,05,Diseases and Disorders of the Circulatory System,3,Major,Major,Surgical,Blue Cross/Blue Shield,Blue Cross/Blue Shield,Self-Pay,,N,N,81992.37,37555.51
Finger Lakes,Monroe,2701005,000413,Strong Memorial Hospital,30 to 49,132,M,White,Not Span/Hispanic,5,Elective,Home w/ Home Health Services,2017,096,Heart valve disorders,049,OTHER OR HEART PRCS,160,Major cardiothoracic repair of heart anomaly,05,Diseases and Disorders of the Circulatory System,3,Major,Minor,Surgical,Blue Cross/Blue Shield,Self-Pay,,,N,N,62020.50,30512.46
Hudson Valley,Westchester,5957001,001139,Westchester Medical Center,0 to 17,107,M,White,Not Span/Hispanic,18,Elective,Cancer Center or Children's Hospital,2017,213,Cardiac and circulatory congenital anomalies,049,OTHER OR HEART PRCS,160,Major cardiothoracic repair of heart anomaly,05,Diseases and Disorders of the Circulatory System,4,Extreme,Extreme,Surgical,Medicaid,Medicaid,,,N,N,734841.62,160075.03
Hudson Valley,Westchester,5957001,001139,Westchester Medical Center,50 to 69,107,F,Black/African American,Not Span/Hispanic,32,Emergency,Inpatient Rehabilitation Facility,2017,041,Cancer; other and unspecified primary,062,OT DX CARDIOVASC PRCS,160,Major cardiothoracic repair of heart anomaly,05,Diseases and Disorders of the Circulatory System,4,Extreme,Extreme,Surgical,Medicaid,Medicaid,,,N,N,857095.00,233519.77
New York City,Queens,7003004,003376,Cohen Children's Medical Center,0 to 17,115,M,Other Race,Spanish/Hispanic,4,Elective,Home or Self Care,2017,213,Cardiac and circulatory congenital anomalies,049,OTHER OR HEART PRCS,160,Major cardiothoracic repair of heart anomaly,05,Diseases and Disorders of the Circulatory System,3,Major,Minor,Surgical,Medicaid,Medicaid,Self-Pay,,N,N,103276.01,29344.96
New York City,Queens,7003004,003376,Cohen Children's Medical Center,0 to 17,117,M,White,Not Span/Hispanic,2,Elective,Home or Self Care,2017,213,Cardiac and circulatory congenital anomalies,049,OTHER OR HEART PRCS,160,Major cardiothoracic repair of heart anomaly,05,Diseases and Disorders of the Circulatory System,2,Moderate,Minor,Surgical,Blue Cross/Blue Shield,Self-Pay,,,N,N,69770.60,20063.30
New York City,Manhattan,7002024,001456,Mount Sinai Hospital,50 to 69,112,F,White,Not Span/Hispanic,13,Urgent,Home w/ Home Health Services,2017,237,Complication of device; implant or graft,043,HEART VALVE PRCS,160,Major cardiothoracic repair of heart anomaly,05,Diseases and Disorders of the Circulatory System,3,Major,Moderate,Surgical,Medicare,Medicaid,Self-Pay,,N,N,187673.75,66560.56
New York City,Manhattan,7002054,001464,New York Presbyterian Hospital - Columbia Presbyterian Center,0 to 17,114,F,White,Not Span/Hispanic,6,Elective,Home or Self Care,2017,213,Cardiac and circulatory congenital anomalies,056,OT VASCULAR BYP/SHUNT,160,Major cardiothoracic repair of heart anomaly,05,Diseases and Disorders of the Circulatory System,3,Major,Moderate,Surgical,Medicaid,Medicaid,Self-Pay,,N,N,158154.60,55500.48
New York City,Manhattan,7002054,001464,New York Presbyterian Hospital - Columbia Presbyterian Center,0 to 17,100,M,Other Race,Not Span/Hispanic,37,Elective,Home or Self Care,2017,213,Cardiac and circulatory congenital anomalies,056,OT VASCULAR BYP/SHUNT,160,Major cardiothoracic repair of heart anomaly,05,Diseases and Disorders of the Circulatory System,4,Extreme,Extreme,Surgical,Private Health Insurance,Self-Pay,,,N,N,621762.76,242208.97
New York City,Manhattan,7002054,001464,New York Presbyterian Hospital - Columbia Presbyterian Center,0 to 17,100,M,Other Race,Not Span/Hispanic,8,Elective,Home or Self Care,2017,103,Pulmonary heart disease,056,OT VASCULAR BYP/SHUNT,160,Major cardiothoracic repair of heart anomaly,05,Diseases and Disorders of the Circulatory System,4,Extreme,Moderate,Surgical,Self-Pay,Self-Pay,,,N,N,179474.55,63182.87
New York City,Manhattan,7002054,001464,New York Presbyterian Hospital - Columbia Presbyterian Center,70 or Older,107,F,Other Race,Not Span/Hispanic,9,Elective,Home w/ Home Health Services,2017,096,Heart valve disorders,043,HEART VALVE PRCS,160,Major cardiothoracic repair of heart anomaly,05,Diseases and Disorders of the Circulatory System,2,Moderate,Major,Surgical,Medicare,Private Health Insurance,Self-Pay,,N,N,279800.31,141173.82
New York City,Manhattan,7002054,001464,New York Presbyterian Hospital - Columbia Presbyterian Center,0 to 17,107,F,Black/African American,Not Span/Hispanic,5,Elective,Home or Self Care,2017,213,Cardiac and circulatory congenital anomalies,056,OT VASCULAR BYP/SHUNT,160,Major cardiothoracic repair of heart anomaly,05,Diseases and Disorders of the Circulatory System,3,Major,Major,Surgical,Private Health Insurance,Self-Pay,,,N,N,131349.46,50280.59
New York City,Manhattan,7002054,001464,New York Presbyterian Hospital - Columbia Presbyterian Center,0 to 17,OOS,M,Black/African American,Not Span/Hispanic,44,Emergency,Cancer Center or Children's Hospital,2017,213,Cardiac and circulatory congenital anomalies,056,OT VASCULAR BYP/SHUNT,160,Major cardiothoracic repair of heart anomaly,05,Diseases and Disorders of the Circulatory System,4,Extreme,Major,Surgical,Private Health Insurance,Self-Pay,,,N,N,1188654.17,596827.03
New York City,Manhattan,7002054,001464,New York Presbyterian Hospital - Columbia Presbyterian Center,0 to 17,113,M,Multi-racial,Multi-ethnic,27,Emergency,Home w/ Home Health Services,2017,237,Complication of device; implant or graft,049,OTHER OR HEART PRCS,160,Major cardiothoracic repair of heart anomaly,05,Diseases and Disorders of the Circulatory System,4,Extreme,Major,Surgical,Medicaid,Medicaid,Self-Pay,,N,Y,790133.85,360051.51
New York City,Manhattan,7002054,001464,New York Presbyterian Hospital - Columbia Presbyterian Center,0 to 17,OOS,M,White,Not Span/Hispanic,20,Emergency,Home or Self Care,2017,213,Cardiac and circulatory congenital anomalies,049,OTHER OR HEART PRCS,160,Major cardiothoracic repair of heart anomaly,05,Diseases and Disorders of the Circulatory System,4,Extreme,Major,Surgical,Medicaid,Medicaid,Self-Pay,,N,Y,430711.40,202086.58
New York City,Manhattan,7002001,001438,Bellevue Hospital Center,30 to 49,112,F,Other Race,Spanish/Hispanic,6,Elective,Home or Self Care,2017,213,Cardiac and circulatory congenital anomalies,043,HEART VALVE PRCS,160,Major cardiothoracic repair of heart anomaly,05,Diseases and Disorders of the Circulatory System,2,Moderate,Minor,Surgical,Self-Pay,,,,N,N,43871.26,28285.91