Hospital Service Area,Hospital County,Operating Certificate Number,Permanent Facility Id,Facility Name,Age Group,Zip Code - 3 digits,Gender,Race,Ethnicity,Length of Stay,Type of Admission,Patient Disposition,Discharge Year,CCS Diagnosis Code,CCS Diagnosis Description,CCS Procedure Code,CCS Procedure Description,APR DRG Code,APR DRG Description,APR MDC Code,APR MDC Description,APR Severity of Illness Code,APR Severity of Illness Description,APR Risk of Mortality,APR Medical Surgical Description,Payment Typology 1,Payment Typology 2,Payment Typology 3,Birth Weight,Abortion Edit Indicator,Emergency Department Indicator,Total Charges,Total Costs
New York City,Manhattan,7002053,001463,NYU Langone Hospitals,0 to 17,,F,Other Race,Unknown,8,Elective,Home or Self Care,2020,MAL001,CARDIAC AND CIRCULATORY CONGENITAL ANOMALIES,CAR012,VESSEL REPAIR AND REPLACEMENT,160,MAJOR CARDIOTHORACIC REPAIR OF HEART ANOMALY,05,DISEASES AND DISORDERS OF THE CIRCULATORY SYSTEM,4,Extreme,Major,Surgical,Medicaid,,,,,N,430194,98409.19
New York City,Manhattan,7002053,001463,NYU Langone Hospitals,0 to 17,112,M,White,Not Span/Hispanic,5,Elective,Home w/ Home Health Services,2020,MAL001,CARDIAC AND CIRCULATORY CONGENITAL ANOMALIES,CAR013,HEART AND GREAT VESSEL BYPASS PROCEDURES,160,MAJOR CARDIOTHORACIC REPAIR OF HEART ANOMALY,05,DISEASES AND DISORDERS OF THE CIRCULATORY SYSTEM,3,Major,Moderate,Surgical,Medicaid,,,,,N,231412.86,54463.72
New York City,Manhattan,7002053,001463,NYU Langone Hospitals,0 to 17,115,M,Other Race,Spanish/Hispanic,17,Elective,Home or Self Care,2020,MAL001,CARDIAC AND CIRCULATORY CONGENITAL ANOMALIES,CAR019,SEPTAL REPAIR AND OTHER THERAPEUTIC HEART PROCEDURES,160,MAJOR CARDIOTHORACIC REPAIR OF HEART ANOMALY,05,DISEASES AND DISORDERS OF THE CIRCULATORY SYSTEM,4,Extreme,Moderate,Surgical,Medicaid,,,02100,,N,500835.98,131325.65
New York City,Manhattan,7002053,001463,NYU Langone Hospitals,0 to 17,100,F,Other Race,Not Span/Hispanic,6,Elective,Home or Self Care,2020,MAL001,CARDIAC AND CIRCULATORY CONGENITAL ANOMALIES,CAR010,LIGATION AND EMBOLIZATION OF VESSELS,160,MAJOR CARDIOTHORACIC REPAIR OF HEART ANOMALY,05,DISEASES AND DISORDERS OF THE CIRCULATORY SYSTEM,2,Moderate,Minor,Surgical,Blue Cross/Blue Shield,,,,,N,209669.79,57992
New York City,Manhattan,7002053,001463,NYU Langone Hospitals,0 to 17,104,F,Other Race,Unknown,5,Elective,Home or Self Care,2020,MAL001,CARDIAC AND CIRCULATORY CONGENITAL ANOMALIES,CAR013,HEART AND GREAT VESSEL BYPASS PROCEDURES,160,MAJOR CARDIOTHORACIC REPAIR OF HEART ANOMALY,05,DISEASES AND DISORDERS OF THE CIRCULATORY SYSTEM,3,Major,Major,Surgical,Medicaid,,,,,N,315905.49,54559.24
New York City,Manhattan,7002053,001463,NYU Langone Hospitals,0 to 17,112,M,Other Race,Spanish/Hispanic,4,Elective,Home or Self Care,2020,MAL001,CARDIAC AND CIRCULATORY CONGENITAL ANOMALIES,CAR013,HEART AND GREAT VESSEL BYPASS PROCEDURES,160,MAJOR CARDIOTHORACIC REPAIR OF HEART ANOMALY,05,DISEASES AND DISORDERS OF THE CIRCULATORY SYSTEM,3,Major,Moderate,Surgical,Medicaid,,,,,N,202302.86,46286.64
New York City,Manhattan,7002053,001463,NYU Langone Hospitals,30 to 49,100,M,White,Not Span/Hispanic,9,Elective,Home or Self Care,2020,MAL001,CARDIAC AND CIRCULATORY CONGENITAL ANOMALIES,CAR010,LIGATION AND EMBOLIZATION OF VESSELS,160,MAJOR CARDIOTHORACIC REPAIR OF HEART ANOMALY,05,DISEASES AND DISORDERS OF THE CIRCULATORY SYSTEM,4,Extreme,Moderate,Surgical,Medicaid,,,,,N,508628.71,95573.91
New York City,Manhattan,7002053,001463,NYU Langone Hospitals,0 to 17,117,M,White,Not Span/Hispanic,4,Elective,Home or Self Care,2020,MAL001,CARDIAC AND CIRCULATORY CONGENITAL ANOMALIES,CAR019,SEPTAL REPAIR AND OTHER THERAPEUTIC HEART PROCEDURES,160,MAJOR CARDIOTHORACIC REPAIR OF HEART ANOMALY,05,DISEASES AND DISORDERS OF THE CIRCULATORY SYSTEM,2,Moderate,Moderate,Surgical,Blue Cross/Blue Shield,,,,,N,186760.76,44556.55
New York City,Manhattan,7002053,001463,NYU Langone Hospitals,0 to 17,112,M,Other Race,Spanish/Hispanic,6,Elective,Home or Self Care,2020,MAL001,CARDIAC AND CIRCULATORY CONGENITAL ANOMALIES,CAR013,HEART AND GREAT VESSEL BYPASS PROCEDURES,160,MAJOR CARDIOTHORACIC REPAIR OF HEART ANOMALY,05,DISEASES AND DISORDERS OF THE CIRCULATORY SYSTEM,3,Major,Moderate,Surgical,Medicaid,,,,,N,479375.89,94819.71
New York City,Manhattan,7002053,001463,NYU Langone Hospitals,0 to 17,104,M,Other Race,Not Span/Hispanic,6,Emergency,Home or Self Care,2020,MAL001,CARDIAC AND CIRCULATORY CONGENITAL ANOMALIES,CAR019,SEPTAL REPAIR AND OTHER THERAPEUTIC HEART PROCEDURES,160,MAJOR CARDIOTHORACIC REPAIR OF HEART ANOMALY,05,DISEASES AND DISORDERS OF THE CIRCULATORY SYSTEM,3,Major,Moderate,Surgical,Medicaid,,,,,N,180509.08,36737.18
New York City,Manhattan,7002053,001463,NYU Langone Hospitals,0 to 17,104,M,Other Race,Spanish/Hispanic,16,Emergency,Home or Self Care,2020,MAL001,CARDIAC AND CIRCULATORY CONGENITAL ANOMALIES,CAR019,SEPTAL REPAIR AND OTHER THERAPEUTIC HEART PROCEDURES,160,MAJOR CARDIOTHORACIC REPAIR OF HEART ANOMALY,05,DISEASES AND DISORDERS OF THE CIRCULATORY SYSTEM,3,Major,Major,Surgical,Medicaid,,,,,Y,497730.54,123788.39
New York City,Manhattan,7002053,001463,NYU Langone Hospitals,0 to 17,115,F,Other Race,Spanish/Hispanic,4,Elective,Home or Self Care,2020,MAL001,CARDIAC AND CIRCULATORY CONGENITAL ANOMALIES,CAR007,"EMBOLECTOMY, ENDARTERECTOMY, AND RELATED VESSEL PROCEDURES (NON-ENDOVASCULAR; EXCLUDING CAROTID)",160,MAJOR CARDIOTHORACIC REPAIR OF HEART ANOMALY,05,DISEASES AND DISORDERS OF THE CIRCULATORY SYSTEM,3,Major,Moderate,Surgical,Medicaid,,,,,N,202915.77,36286.53
New York City,Manhattan,7002053,001463,NYU Langone Hospitals,0 to 17,104,M,Other Race,Not Span/Hispanic,72,Urgent,Expired,2020,MAL001,CARDIAC AND CIRCULATORY CONGENITAL ANOMALIES,ESA002,EXTRACORPOREAL MEMBRANE OXYGENATION,160,MAJOR CARDIOTHORACIC REPAIR OF HEART ANOMALY,05,DISEASES AND DISORDERS OF THE CIRCULATORY SYSTEM,4,Extreme,Extreme,Surgical,Medicaid,,,,,N,2456333.65,468591.71
New York City,Manhattan,7002053,001463,NYU Langone Hospitals,0 to 17,112,F,White,Unknown,5,Emergency,Home or Self Care,2020,MAL001,CARDIAC AND CIRCULATORY CONGENITAL ANOMALIES,CAR022,HEART VALVE REPLACEMENT AND OTHER VALVE PROCEDURES (NON-ENDOVASCULAR),160,MAJOR CARDIOTHORACIC REPAIR OF HEART ANOMALY,05,DISEASES AND DISORDERS OF THE CIRCULATORY SYSTEM,2,Moderate,Minor,Surgical,Blue Cross/Blue Shield,,,,,Y,216727.41,51267.15
New York City,Manhattan,7002053,001463,NYU Langone Hospitals,0 to 17,,F,Other Race,Unknown,7,Urgent,Inpatient Rehabilitation Facility,2020,MAL001,CARDIAC AND CIRCULATORY CONGENITAL ANOMALIES,CAR024,VENOUS AND ARTERIAL CATHETER PLACEMENT,160,MAJOR CARDIOTHORACIC REPAIR OF HEART ANOMALY,05,DISEASES AND DISORDERS OF THE CIRCULATORY SYSTEM,3,Major,Major,Surgical,Medicaid,,,,,N,335559.28,79014.72
New York City,Manhattan,7002053,001463,NYU Langone Hospitals,0 to 17,100,M,White,Unknown,9,Elective,Home or Self Care,2020,MAL001,CARDIAC AND CIRCULATORY CONGENITAL ANOMALIES,CAR013,HEART AND GREAT VESSEL BYPASS PROCEDURES,160,MAJOR CARDIOTHORACIC REPAIR OF HEART ANOMALY,05,DISEASES AND DISORDERS OF THE CIRCULATORY SYSTEM,4,Extreme,Major,Surgical,Blue Cross/Blue Shield,Medicaid,,,,N,367357.16,94091.46
New York City,Manhattan,7002053,001463,NYU Langone Hospitals,0 to 17,104,M,Other Race,Unknown,19,Emergency,Home w/ Home Health Services,2020,MAL001,CARDIAC AND CIRCULATORY CONGENITAL ANOMALIES,CAR019,SEPTAL REPAIR AND OTHER THERAPEUTIC HEART PROCEDURES,160,MAJOR CARDIOTHORACIC REPAIR OF HEART ANOMALY,05,DISEASES AND DISORDERS OF THE CIRCULATORY SYSTEM,4,Extreme,Major,Surgical,Medicaid,,,,,N,428761.71,135236.3
New York City,Manhattan,7002053,001463,NYU Langone Hospitals,0 to 17,104,F,Other Race,Spanish/Hispanic,9,Emergency,Home or Self Care,2020,MAL001,CARDIAC AND CIRCULATORY CONGENITAL ANOMALIES,CAR012,VESSEL REPAIR AND REPLACEMENT,160,MAJOR CARDIOTHORACIC REPAIR OF HEART ANOMALY,05,DISEASES AND DISORDERS OF THE CIRCULATORY SYSTEM,3,Major,Major,Surgical,Medicaid,,,,,N,466175.76,82697.56
New York City,Manhattan,7002053,001463,NYU Langone Hospitals,0 to 17,105,M,Other Race,Unknown,6,Elective,Home or Self Care,2020,MAL001,CARDIAC AND CIRCULATORY CONGENITAL ANOMALIES,CAR019,SEPTAL REPAIR AND OTHER THERAPEUTIC HEART PROCEDURES,160,MAJOR CARDIOTHORACIC REPAIR OF HEART ANOMALY,05,DISEASES AND DISORDERS OF THE CIRCULATORY SYSTEM,3,Major,Major,Surgical,Private Health Insurance,,,,,N,214167.04,43260
New York City,Manhattan,7002053,001463,NYU Langone Hospitals,0 to 17,104,M,Other Race,Not Span/Hispanic,19,Emergency,Home w/ Home Health Services,2020,MAL001,CARDIAC AND CIRCULATORY CONGENITAL ANOMALIES,CAR019,SEPTAL REPAIR AND OTHER THERAPEUTIC HEART PROCEDURES,160,MAJOR CARDIOTHORACIC REPAIR OF HEART ANOMALY,05,DISEASES AND DISORDERS OF THE CIRCULATORY SYSTEM,3,Major,Moderate,Surgical,Medicaid,,,,,N,526942.11,115156.56
New York City,Manhattan,7002053,001463,NYU Langone Hospitals,0 to 17,112,F,Other Race,Not Span/Hispanic,10,Elective,Home or Self Care,2020,MAL001,CARDIAC AND CIRCULATORY CONGENITAL ANOMALIES,CAR012,VESSEL REPAIR AND REPLACEMENT,160,MAJOR CARDIOTHORACIC REPAIR OF HEART ANOMALY,05,DISEASES AND DISORDERS OF THE CIRCULATORY SYSTEM,2,Moderate,Moderate,Surgical,Medicaid,,,,,N,332198.94,97642.27
New York City,Manhattan,7002053,001463,NYU Langone Hospitals,0 to 17,104,M,Black/African American,Not Span/Hispanic,11,Elective,Home or Self Care,2020,MAL001,CARDIAC AND CIRCULATORY CONGENITAL ANOMALIES,CAR013,HEART AND GREAT VESSEL BYPASS PROCEDURES,160,MAJOR CARDIOTHORACIC REPAIR OF HEART ANOMALY,05,DISEASES AND DISORDERS OF THE CIRCULATORY SYSTEM,4,Extreme,Major,Surgical,Medicaid,,,,,N,493254.69,97554.74
New York City,Manhattan,7002053,001463,NYU Langone Hospitals,0 to 17,112,M,Black/African American,Not Span/Hispanic,12,Elective,Home or Self Care,2020,MAL001,CARDIAC AND CIRCULATORY CONGENITAL ANOMALIES,CAR019,SEPTAL REPAIR AND OTHER THERAPEUTIC HEART PROCEDURES,160,MAJOR CARDIOTHORACIC REPAIR OF HEART ANOMALY,05,DISEASES AND DISORDERS OF THE CIRCULATORY SYSTEM,3,Major,Major,Surgical,Medicaid,,,,,N,373415.32,114864.31
New York City,Manhattan,7002053,001463,NYU Langone Hospitals,0 to 17,112,F,Other Race,Unknown,12,Emergency,Home or Self Care,2020,MAL001,CARDIAC AND CIRCULATORY CONGENITAL ANOMALIES,CAR013,HEART AND GREAT VESSEL BYPASS PROCEDURES,160,MAJOR CARDIOTHORACIC REPAIR OF HEART ANOMALY,05,DISEASES AND DISORDERS OF THE CIRCULATORY SYSTEM,3,Major,Major,Surgical,Medicaid,,,,,N,358492.43,77924.76
New York City,Manhattan,7002053,001463,NYU Langone Hospitals,0 to 17,113,M,Other Race,Spanish/Hispanic,3,Elective,Home or Self Care,2020,MAL001,CARDIAC AND CIRCULATORY CONGENITAL ANOMALIES,CAR013,HEART AND GREAT VESSEL BYPASS PROCEDURES,160,MAJOR CARDIOTHORACIC REPAIR OF HEART ANOMALY,05,DISEASES AND DISORDERS OF THE CIRCULATORY SYSTEM,2,Moderate,Moderate,Surgical,Medicaid,,,,,N,183103.8,31600.15
New York City,Manhattan,7002053,001463,NYU Langone Hospitals,0 to 17,113,M,Other Race,Not Span/Hispanic,9,Elective,Home or Self Care,2020,MAL001,CARDIAC AND CIRCULATORY CONGENITAL ANOMALIES,CAR019,SEPTAL REPAIR AND OTHER THERAPEUTIC HEART PROCEDURES,160,MAJOR CARDIOTHORACIC REPAIR OF HEART ANOMALY,05,DISEASES AND DISORDERS OF THE CIRCULATORY SYSTEM,3,Major,Major,Surgical,Medicaid,,,,,N,321695.32,87182.81
New York City,Manhattan,7002053,001463,NYU Langone Hospitals,0 to 17,112,M,Other Race,Spanish/Hispanic,8,Elective,Home or Self Care,2020,MAL001,CARDIAC AND CIRCULATORY CONGENITAL ANOMALIES,CAR013,HEART AND GREAT VESSEL BYPASS PROCEDURES,160,MAJOR CARDIOTHORACIC REPAIR OF HEART ANOMALY,05,DISEASES AND DISORDERS OF THE CIRCULATORY SYSTEM,3,Major,Moderate,Surgical,Medicaid,,,,,N,400373.59,96721.81
New York City,Manhattan,7002053,001463,NYU Langone Hospitals,0 to 17,112,F,Other Race,Unknown,5,Emergency,Home or Self Care,2020,MAL001,CARDIAC AND CIRCULATORY CONGENITAL ANOMALIES,CAR022,HEART VALVE REPLACEMENT AND OTHER VALVE PROCEDURES (NON-ENDOVASCULAR),160,MAJOR CARDIOTHORACIC REPAIR OF HEART ANOMALY,05,DISEASES AND DISORDERS OF THE CIRCULATORY SYSTEM,3,Major,Moderate,Surgical,Medicaid,,,,,Y,212030.17,40929.02
New York City,Manhattan,7002053,001463,NYU Langone Hospitals,0 to 17,104,F,Other Race,Spanish/Hispanic,22,Emergency,Short-term Hospital,2020,MAL001,CARDIAC AND CIRCULATORY CONGENITAL ANOMALIES,ESA002,EXTRACORPOREAL MEMBRANE OXYGENATION,160,MAJOR CARDIOTHORACIC REPAIR OF HEART ANOMALY,05,DISEASES AND DISORDERS OF THE CIRCULATORY SYSTEM,4,Extreme,Major,Surgical,Medicaid,,,,,N,868291.23,161210.83
New York City,Manhattan,7002053,001463,NYU Langone Hospitals,0 to 17,114,M,Other Race,Not Span/Hispanic,18,Elective,Home w/ Home Health Services,2020,MAL001,CARDIAC AND CIRCULATORY CONGENITAL ANOMALIES,CAR013,HEART AND GREAT VESSEL BYPASS PROCEDURES,160,MAJOR CARDIOTHORACIC REPAIR OF HEART ANOMALY,05,DISEASES AND DISORDERS OF THE CIRCULATORY SYSTEM,3,Major,Moderate,Surgical,Medicaid,,,,,N,585754.06,169323.5
New York City,Manhattan,7002053,001463,NYU Langone Hospitals,0 to 17,114,F,White,Not Span/Hispanic,14,Elective,Home or Self Care,2020,MAL001,CARDIAC AND CIRCULATORY CONGENITAL ANOMALIES,CAR013,HEART AND GREAT VESSEL BYPASS PROCEDURES,160,MAJOR CARDIOTHORACIC REPAIR OF HEART ANOMALY,05,DISEASES AND DISORDERS OF THE CIRCULATORY SYSTEM,3,Major,Major,Surgical,Medicaid,,,,,N,447836.22,129740.95
New York City,Manhattan,7002053,001463,NYU Langone Hospitals,0 to 17,112,M,Black/African American,Not Span/Hispanic,30,Elective,Home w/ Home Health Services,2020,MAL001,CARDIAC AND CIRCULATORY CONGENITAL ANOMALIES,CAR013,HEART AND GREAT VESSEL BYPASS PROCEDURES,160,MAJOR CARDIOTHORACIC REPAIR OF HEART ANOMALY,05,DISEASES AND DISORDERS OF THE CIRCULATORY SYSTEM,3,Major,Major,Surgical,Medicaid,,,,,N,1156207.18,245743.81
New York City,Manhattan,7002053,001463,NYU Langone Hospitals,0 to 17,104,M,Other Race,Spanish/Hispanic,3,Elective,Home or Self Care,2020,MAL001,CARDIAC AND CIRCULATORY CONGENITAL ANOMALIES,CAR019,SEPTAL REPAIR AND OTHER THERAPEUTIC HEART PROCEDURES,160,MAJOR CARDIOTHORACIC REPAIR OF HEART ANOMALY,05,DISEASES AND DISORDERS OF THE CIRCULATORY SYSTEM,3,Major,Moderate,Surgical,Medicaid,,,,,N,164276.28,38268.41
New York City,Manhattan,7002053,001463,NYU Langone Hospitals,0 to 17,113,F,Other Race,Not Span/Hispanic,4,Elective,Home or Self Care,2020,MAL001,CARDIAC AND CIRCULATORY CONGENITAL ANOMALIES,CAR019,SEPTAL REPAIR AND OTHER THERAPEUTIC HEART PROCEDURES,160,MAJOR CARDIOTHORACIC REPAIR OF HEART ANOMALY,05,DISEASES AND DISORDERS OF THE CIRCULATORY SYSTEM,2,Moderate,Minor,Surgical,Blue Cross/Blue Shield,,,,,N,198306.02,37291.11
New York City,Manhattan,7002053,001463,NYU Langone Hospitals,0 to 17,OOS,M,White,Not Span/Hispanic,16,Elective,Home or Self Care,2020,MAL001,CARDIAC AND CIRCULATORY CONGENITAL ANOMALIES,CAR022,HEART VALVE REPLACEMENT AND OTHER VALVE PROCEDURES (NON-ENDOVASCULAR),160,MAJOR CARDIOTHORACIC REPAIR OF HEART ANOMALY,05,DISEASES AND DISORDERS OF THE CIRCULATORY SYSTEM,3,Major,Major,Surgical,Blue Cross/Blue Shield,,,,,N,422188,102633.21
New York City,Manhattan,7002053,001463,NYU Langone Hospitals,0 to 17,112,M,White,Not Span/Hispanic,5,Elective,Home or Self Care,2020,MAL001,CARDIAC AND CIRCULATORY CONGENITAL ANOMALIES,CAR013,HEART AND GREAT VESSEL BYPASS PROCEDURES,160,MAJOR CARDIOTHORACIC REPAIR OF HEART ANOMALY,05,DISEASES AND DISORDERS OF THE CIRCULATORY SYSTEM,3,Major,Major,Surgical,Medicaid,,,,,N,338452.67,71930.86
New York City,Manhattan,7002053,001463,NYU Langone Hospitals,0 to 17,112,M,White,Not Span/Hispanic,5,Elective,Home or Self Care,2020,MAL001,CARDIAC AND CIRCULATORY CONGENITAL ANOMALIES,CAR010,LIGATION AND EMBOLIZATION OF VESSELS,160,MAJOR CARDIOTHORACIC REPAIR OF HEART ANOMALY,05,DISEASES AND DISORDERS OF THE CIRCULATORY SYSTEM,3,Major,Moderate,Surgical,Medicaid,,,,,N,218692.39,49158.25
New York City,Manhattan,7002053,001463,NYU Langone Hospitals,0 to 17,112,M,Black/African American,Not Span/Hispanic,30,Elective,Home or Self Care,2020,MAL001,CARDIAC AND CIRCULATORY CONGENITAL ANOMALIES,CAR013,HEART AND GREAT VESSEL BYPASS PROCEDURES,160,MAJOR CARDIOTHORACIC REPAIR OF HEART ANOMALY,05,DISEASES AND DISORDERS OF THE CIRCULATORY SYSTEM,4,Extreme,Major,Surgical,Medicaid,,,,,N,977615.2,282282.07
New York City,Manhattan,7002053,001463,NYU Langone Hospitals,0 to 17,112,M,Other Race,Spanish/Hispanic,17,Elective,Home w/ Home Health Services,2020,MAL001,CARDIAC AND CIRCULATORY CONGENITAL ANOMALIES,CAR013,HEART AND GREAT VESSEL BYPASS PROCEDURES,160,MAJOR CARDIOTHORACIC REPAIR OF HEART ANOMALY,05,DISEASES AND DISORDERS OF THE CIRCULATORY SYSTEM,4,Extreme,Major,Surgical,Medicaid,,,,,N,822069.39,187664.28
New York City,Manhattan,7002053,001463,NYU Langone Hospitals,0 to 17,104,M,Other Race,Spanish/Hispanic,9,Elective,Home or Self Care,2020,MAL001,CARDIAC AND CIRCULATORY CONGENITAL ANOMALIES,CAR013,HEART AND GREAT VESSEL BYPASS PROCEDURES,160,MAJOR CARDIOTHORACIC REPAIR OF HEART ANOMALY,05,DISEASES AND DISORDERS OF THE CIRCULATORY SYSTEM,3,Major,Moderate,Surgical,Medicaid,,,,,N,293523.85,61089.93
New York City,Manhattan,7002053,001463,NYU Langone Hospitals,0 to 17,112,F,Other Race,Not Span/Hispanic,5,Elective,Home or Self Care,2020,MAL001,CARDIAC AND CIRCULATORY CONGENITAL ANOMALIES,CAR019,SEPTAL REPAIR AND OTHER THERAPEUTIC HEART PROCEDURES,160,MAJOR CARDIOTHORACIC REPAIR OF HEART ANOMALY,05,DISEASES AND DISORDERS OF THE CIRCULATORY SYSTEM,3,Major,Moderate,Surgical,Medicaid,,,,,N,240635.1,59063.47
New York City,Manhattan,7002053,001463,NYU Langone Hospitals,30 to 49,113,M,Other Race,Not Span/Hispanic,18,Emergency,Home or Self Care,2020,INJ033,"COMPLICATION OF CARDIOVASCULAR DEVICE, IMPLANT OR GRAFT, INITIAL ENCOUNTER",CAR013,HEART AND GREAT VESSEL BYPASS PROCEDURES,160,MAJOR CARDIOTHORACIC REPAIR OF HEART ANOMALY,05,DISEASES AND DISORDERS OF THE CIRCULATORY SYSTEM,3,Major,Moderate,Surgical,Medicaid,,,,,N,1023008.26,192778.39
New York City,Manhattan,7002053,001463,NYU Langone Hospitals,0 to 17,112,M,Other Race,Not Span/Hispanic,6,Elective,Home or Self Care,2020,MAL001,CARDIAC AND CIRCULATORY CONGENITAL ANOMALIES,CAR013,HEART AND GREAT VESSEL BYPASS PROCEDURES,160,MAJOR CARDIOTHORACIC REPAIR OF HEART ANOMALY,05,DISEASES AND DISORDERS OF THE CIRCULATORY SYSTEM,3,Major,Moderate,Surgical,Medicaid,,,,,N,403499.5,62479.44
New York City,Manhattan,7002053,001463,NYU Langone Hospitals,0 to 17,112,F,Other Race,Not Span/Hispanic,6,Elective,Home or Self Care,2020,MAL001,CARDIAC AND CIRCULATORY CONGENITAL ANOMALIES,CAR013,HEART AND GREAT VESSEL BYPASS PROCEDURES,160,MAJOR CARDIOTHORACIC REPAIR OF HEART ANOMALY,05,DISEASES AND DISORDERS OF THE CIRCULATORY SYSTEM,3,Major,Moderate,Surgical,Medicaid,,,,,N,237818.1,63998.33
New York City,Manhattan,7002053,001463,NYU Langone Hospitals,0 to 17,104,M,Other Race,Not Span/Hispanic,8,Elective,Home or Self Care,2020,MAL001,CARDIAC AND CIRCULATORY CONGENITAL ANOMALIES,CAR019,SEPTAL REPAIR AND OTHER THERAPEUTIC HEART PROCEDURES,160,MAJOR CARDIOTHORACIC REPAIR OF HEART ANOMALY,05,DISEASES AND DISORDERS OF THE CIRCULATORY SYSTEM,3,Major,Major,Surgical,Medicaid,,,,,N,300610.28,80391.45
New York City,Manhattan,7002053,001463,NYU Langone Hospitals,0 to 17,114,M,Other Race,Spanish/Hispanic,112,Emergency,Inpatient Rehabilitation Facility,2020,MAL001,CARDIAC AND CIRCULATORY CONGENITAL ANOMALIES,CAR013,HEART AND GREAT VESSEL BYPASS PROCEDURES,160,MAJOR CARDIOTHORACIC REPAIR OF HEART ANOMALY,05,DISEASES AND DISORDERS OF THE CIRCULATORY SYSTEM,4,Extreme,Major,Surgical,Medicaid,,,,,Y,3693518.88,1059636.2
New York City,Manhattan,7002053,001463,NYU Langone Hospitals,0 to 17,104,M,Other Race,Spanish/Hispanic,4,Elective,Home or Self Care,2020,MAL001,CARDIAC AND CIRCULATORY CONGENITAL ANOMALIES,CAR019,SEPTAL REPAIR AND OTHER THERAPEUTIC HEART PROCEDURES,160,MAJOR CARDIOTHORACIC REPAIR OF HEART ANOMALY,05,DISEASES AND DISORDERS OF THE CIRCULATORY SYSTEM,2,Moderate,Moderate,Surgical,Medicaid,,,,,N,224078.44,40476.08
New York City,Manhattan,7002053,001463,NYU Langone Hospitals,0 to 17,112,F,Multi-racial,Spanish/Hispanic,8,Elective,Home or Self Care,2020,MAL001,CARDIAC AND CIRCULATORY CONGENITAL ANOMALIES,CAR019,SEPTAL REPAIR AND OTHER THERAPEUTIC HEART PROCEDURES,160,MAJOR CARDIOTHORACIC REPAIR OF HEART ANOMALY,05,DISEASES AND DISORDERS OF THE CIRCULATORY SYSTEM,3,Major,Major,Surgical,Medicaid,,,,,N,377413.32,65583.04
New York City,Manhattan,7002053,001463,NYU Langone Hospitals,0 to 17,112,F,Other Race,Spanish/Hispanic,7,Elective,Home or Self Care,2020,MAL001,CARDIAC AND CIRCULATORY CONGENITAL ANOMALIES,CAR022,HEART VALVE REPLACEMENT AND OTHER VALVE PROCEDURES (NON-ENDOVASCULAR),160,MAJOR CARDIOTHORACIC REPAIR OF HEART ANOMALY,05,DISEASES AND DISORDERS OF THE CIRCULATORY SYSTEM,3,Major,Moderate,Surgical,Medicaid,,,,,N,323907.66,81862.38
New York City,Manhattan,7002053,001463,NYU Langone Hospitals,0 to 17,112,F,White,Spanish/Hispanic,6,Elective,Home or Self Care,2020,MAL001,CARDIAC AND CIRCULATORY CONGENITAL ANOMALIES,CAR013,HEART AND GREAT VESSEL BYPASS PROCEDURES,160,MAJOR CARDIOTHORACIC REPAIR OF HEART ANOMALY,05,DISEASES AND DISORDERS OF THE CIRCULATORY SYSTEM,2,Moderate,Moderate,Surgical,Medicaid,,,,,N,249121.16,62056.97
New York City,Manhattan,7002053,001463,NYU Langone Hospitals,0 to 17,112,M,Other Race,Spanish/Hispanic,3,Elective,Home or Self Care,2020,MAL001,CARDIAC AND CIRCULATORY CONGENITAL ANOMALIES,CAR013,HEART AND GREAT VESSEL BYPASS PROCEDURES,160,MAJOR CARDIOTHORACIC REPAIR OF HEART ANOMALY,05,DISEASES AND DISORDERS OF THE CIRCULATORY SYSTEM,3,Major,Moderate,Surgical,Medicaid,,,,,N,366550.58,66293.4
New York City,Manhattan,7002053,001463,NYU Langone Hospitals,0 to 17,104,F,Black/African American,Not Span/Hispanic,4,Elective,Home or Self Care,2020,MAL001,CARDIAC AND CIRCULATORY CONGENITAL ANOMALIES,CAR022,HEART VALVE REPLACEMENT AND OTHER VALVE PROCEDURES (NON-ENDOVASCULAR),160,MAJOR CARDIOTHORACIC REPAIR OF HEART ANOMALY,05,DISEASES AND DISORDERS OF THE CIRCULATORY SYSTEM,2,Moderate,Moderate,Surgical,Medicaid,,,,,N,204913.41,36700.48
New York City,Manhattan,7002053,001463,NYU Langone Hospitals,0 to 17,117,M,Other Race,Not Span/Hispanic,5,Elective,Home or Self Care,2020,MAL001,CARDIAC AND CIRCULATORY CONGENITAL ANOMALIES,CAR019,SEPTAL REPAIR AND OTHER THERAPEUTIC HEART PROCEDURES,160,MAJOR CARDIOTHORACIC REPAIR OF HEART ANOMALY,05,DISEASES AND DISORDERS OF THE CIRCULATORY SYSTEM,3,Major,Major,Surgical,Private Health Insurance,,,,,N,214587.69,40171.76
New York City,Manhattan,7002053,001463,NYU Langone Hospitals,0 to 17,112,M,Multi-racial,Spanish/Hispanic,8,Elective,Home or Self Care,2020,MAL001,CARDIAC AND CIRCULATORY CONGENITAL ANOMALIES,CAR019,SEPTAL REPAIR AND OTHER THERAPEUTIC HEART PROCEDURES,160,MAJOR CARDIOTHORACIC REPAIR OF HEART ANOMALY,05,DISEASES AND DISORDERS OF THE CIRCULATORY SYSTEM,3,Major,Major,Surgical,Private Health Insurance,Medicaid,,,,N,387065.94,95640.02
