Hospital Service Area,Hospital County,Operating Certificate Number,Permanent Facility Id,Facility Name,Age Group,Zip Code - 3 digits,Gender,Race,Ethnicity,Length of Stay,Type of Admission,Patient Disposition,Discharge Year,CCS Diagnosis Code,CCS Diagnosis Description,CCS Procedure Code,CCS Procedure Description,APR DRG Code,APR DRG Description,APR MDC Code,APR MDC Description,APR Severity of Illness Code,APR Severity of Illness Description,APR Risk of Mortality,APR Medical Surgical Description,Payment Typology 1,Payment Typology 2,Payment Typology 3,Birth Weight,Abortion Edit Indicator,Emergency Department Indicator,Total Charges,Total Costs
New York City,Manhattan,7002024,001456,Mount Sinai Hospital,50 to 69,100,M,Other Race,Spanish/Hispanic,34,Emergency,Skilled Nursing Home,2020,CIR005,MYOCARDITIS AND CARDIOMYOPATHY,CAR027,HEART ASSIST DEVICE PROCEDURES,161,IMPLANTABLE HEART ASSIST SYSTEMS,05,DISEASES AND DISORDERS OF THE CIRCULATORY SYSTEM,4,Extreme,Extreme,Surgical,Medicare,Medicare,Self-Pay,,,Y,835982.18,226553.34
New York City,Manhattan,7002054,001464,New York-Presbyterian Hospital - Columbia Presbyterian Center,0 to 17,OOS,M,Other Race,Not Span/Hispanic,48,Emergency,Home or Self Care,2020,CIR019,HEART FAILURE,CAR027,HEART ASSIST DEVICE PROCEDURES,161,IMPLANTABLE HEART ASSIST SYSTEMS,05,DISEASES AND DISORDERS OF THE CIRCULATORY SYSTEM,3,Major,Major,Surgical,Medicaid,Self-Pay,,,,Y,1805881.54,769647.79
New York City,Manhattan,7002054,001464,New York-Presbyterian Hospital - Columbia Presbyterian Center,18 to 29,113,M,Other Race,Not Span/Hispanic,95,Urgent,Skilled Nursing Home,2020,CIR019,HEART FAILURE,CAR027,HEART ASSIST DEVICE PROCEDURES,161,IMPLANTABLE HEART ASSIST SYSTEMS,05,DISEASES AND DISORDERS OF THE CIRCULATORY SYSTEM,3,Major,Extreme,Surgical,Medicaid,Medicaid,Self-Pay,,,N,3107512.07,1132564.87
New York City,Manhattan,7002054,001458,New York-Presbyterian Hospital - New York Weill Cornell Center,70 or Older,100,F,Other Race,Not Span/Hispanic,43,Emergency,Home w/ Home Health Services,2020,CIR019,HEART FAILURE,ESA009,CARDIAC ASSISTANCE WITH BALLOON PUMP,161,IMPLANTABLE HEART ASSIST SYSTEMS,05,DISEASES AND DISORDERS OF THE CIRCULATORY SYSTEM,4,Extreme,Extreme,Surgical,Medicare,Private Health Insurance,Self-Pay,,,N,1816603.79,721153.73
New York City,Manhattan,7002024,001456,Mount Sinai Hospital,50 to 69,104,F,Other Race,Spanish/Hispanic,24,Urgent,Home w/ Home Health Services,2020,INJ033,"COMPLICATION OF CARDIOVASCULAR DEVICE, IMPLANT OR GRAFT, INITIAL ENCOUNTER",CAR027,HEART ASSIST DEVICE PROCEDURES,161,IMPLANTABLE HEART ASSIST SYSTEMS,05,DISEASES AND DISORDERS OF THE CIRCULATORY SYSTEM,3,Major,Major,Surgical,Medicaid,Medicaid,Self-Pay,,,N,655073.06,212287.87
Finger Lakes,Monroe,2701005,000413,Strong Memorial Hospital,18 to 29,146,M,Other Race,Not Span/Hispanic,73,Emergency,Home w/ Home Health Services,2020,CIR019,HEART FAILURE,ESA002,EXTRACORPOREAL MEMBRANE OXYGENATION,161,IMPLANTABLE HEART ASSIST SYSTEMS,05,DISEASES AND DISORDERS OF THE CIRCULATORY SYSTEM,4,Extreme,Extreme,Surgical,Medicaid,,,,,Y,1103317.84,488884.18
Finger Lakes,Monroe,2701005,000413,Strong Memorial Hospital,50 to 69,132,M,Black/African American,Not Span/Hispanic,60,Emergency,Home w/ Home Health Services,2020,CIR017,CARDIAC DYSRHYTHMIAS,CAR027,HEART ASSIST DEVICE PROCEDURES,161,IMPLANTABLE HEART ASSIST SYSTEMS,05,DISEASES AND DISORDERS OF THE CIRCULATORY SYSTEM,4,Extreme,Major,Surgical,Medicare,Medicaid,,,,Y,684120.98,344248
Finger Lakes,Monroe,2701005,000413,Strong Memorial Hospital,50 to 69,120,M,White,Not Span/Hispanic,17,Urgent,Expired,2020,CIR019,HEART FAILURE,CAR027,HEART ASSIST DEVICE PROCEDURES,161,IMPLANTABLE HEART ASSIST SYSTEMS,05,DISEASES AND DISORDERS OF THE CIRCULATORY SYSTEM,4,Extreme,Extreme,Surgical,Medicaid,,,,,N,691089.16,287321.05
Finger Lakes,Monroe,2701005,000413,Strong Memorial Hospital,30 to 49,,M,White,Spanish/Hispanic,63,Urgent,Home w/ Home Health Services,2020,CIR009,ACUTE MYOCARDIAL INFARCTION,CAR027,HEART ASSIST DEVICE PROCEDURES,161,IMPLANTABLE HEART ASSIST SYSTEMS,05,DISEASES AND DISORDERS OF THE CIRCULATORY SYSTEM,4,Extreme,Extreme,Surgical,Private Health Insurance,Medicaid,,,,N,1131249.65,520052.82
Finger Lakes,Monroe,2701005,000413,Strong Memorial Hospital,50 to 69,133,M,White,Not Span/Hispanic,35,Urgent,Home w/ Home Health Services,2020,CIR019,HEART FAILURE,CAR027,HEART ASSIST DEVICE PROCEDURES,161,IMPLANTABLE HEART ASSIST SYSTEMS,05,DISEASES AND DISORDERS OF THE CIRCULATORY SYSTEM,3,Major,Extreme,Surgical,Medicare,Medicaid,,,,N,502974.76,241287.12
Finger Lakes,Monroe,2701003,000411,Rochester General Hospital,50 to 69,146,M,Black/African American,Not Span/Hispanic,15,Elective,Inpatient Rehabilitation Facility,2020,CIR019,HEART FAILURE,CAR027,HEART ASSIST DEVICE PROCEDURES,161,IMPLANTABLE HEART ASSIST SYSTEMS,05,DISEASES AND DISORDERS OF THE CIRCULATORY SYSTEM,3,Major,Major,Surgical,Medicare,,,,,N,465359.93,148474.04
New York City,Manhattan,7002054,001464,New York-Presbyterian Hospital - Columbia Presbyterian Center,50 to 69,104,M,White,Spanish/Hispanic,25,Urgent,Home or Self Care,2020,CIR019,HEART FAILURE,CAR027,HEART ASSIST DEVICE PROCEDURES,161,IMPLANTABLE HEART ASSIST SYSTEMS,05,DISEASES AND DISORDERS OF THE CIRCULATORY SYSTEM,4,Extreme,Extreme,Surgical,Medicare,Medicare,Self-Pay,,,N,1243418.84,494448.71
New York City,Manhattan,7002054,001458,New York-Presbyterian Hospital - New York Weill Cornell Center,50 to 69,OOS,M,Black/African American,Not Span/Hispanic,24,Elective,Home or Self Care,2020,CIR019,HEART FAILURE,CAR027,HEART ASSIST DEVICE PROCEDURES,161,IMPLANTABLE HEART ASSIST SYSTEMS,05,DISEASES AND DISORDERS OF THE CIRCULATORY SYSTEM,4,Extreme,Extreme,Surgical,Private Health Insurance,,,,,N,1195786.84,490279.9
New York City,Manhattan,7002053,001463,NYU Langone Hospitals,50 to 69,OOS,F,White,Not Span/Hispanic,92,Emergency,Inpatient Rehabilitation Facility,2020,GEN003,CHRONIC KIDNEY DISEASE,CAR027,HEART ASSIST DEVICE PROCEDURES,161,IMPLANTABLE HEART ASSIST SYSTEMS,05,DISEASES AND DISORDERS OF THE CIRCULATORY SYSTEM,4,Extreme,Extreme,Surgical,Medicaid,,,,,N,4074347.26,808706.39
New York City,Manhattan,7002054,001458,New York-Presbyterian Hospital - New York Weill Cornell Center,50 to 69,112,M,Other Race,Not Span/Hispanic,15,Emergency,Home or Self Care,2020,INJ033,"COMPLICATION OF CARDIOVASCULAR DEVICE, IMPLANT OR GRAFT, INITIAL ENCOUNTER",CAR027,HEART ASSIST DEVICE PROCEDURES,161,IMPLANTABLE HEART ASSIST SYSTEMS,05,DISEASES AND DISORDERS OF THE CIRCULATORY SYSTEM,4,Extreme,Extreme,Surgical,Medicare,Medicaid,Self-Pay,,,Y,894050.03,370550.16
Finger Lakes,Monroe,2701003,000411,Rochester General Hospital,70 or Older,145,M,White,Not Span/Hispanic,35,Elective,Home w/ Home Health Services,2020,CIR019,HEART FAILURE,CAR027,HEART ASSIST DEVICE PROCEDURES,161,IMPLANTABLE HEART ASSIST SYSTEMS,05,DISEASES AND DISORDERS OF THE CIRCULATORY SYSTEM,4,Extreme,Extreme,Surgical,Medicare,,,,,N,641204.34,215845.74
Finger Lakes,Monroe,2701003,000411,Rochester General Hospital,50 to 69,146,M,Black/African American,Not Span/Hispanic,34,Emergency,Inpatient Rehabilitation Facility,2020,CIR017,CARDIAC DYSRHYTHMIAS,CAR027,HEART ASSIST DEVICE PROCEDURES,161,IMPLANTABLE HEART ASSIST SYSTEMS,05,DISEASES AND DISORDERS OF THE CIRCULATORY SYSTEM,4,Extreme,Extreme,Surgical,Medicaid,,,,,Y,631702.09,205271.36
Long Island,Nassau,2953000,000563,St. Francis Hospital & Heart Center,50 to 69,117,F,White,Not Span/Hispanic,39,Urgent,Home w/ Home Health Services,2020,CIR005,MYOCARDITIS AND CARDIOMYOPATHY,CAR027,HEART ASSIST DEVICE PROCEDURES,161,IMPLANTABLE HEART ASSIST SYSTEMS,05,DISEASES AND DISORDERS OF THE CIRCULATORY SYSTEM,4,Extreme,Extreme,Surgical,Private Health Insurance,,,,,N,1387790.56,246168.54
Long Island,Nassau,2951001,000541,North Shore University Hospital,30 to 49,116,M,Black/African American,Not Span/Hispanic,69,Urgent,Inpatient Rehabilitation Facility,2020,CIR019,HEART FAILURE,CAR027,HEART ASSIST DEVICE PROCEDURES,161,IMPLANTABLE HEART ASSIST SYSTEMS,05,DISEASES AND DISORDERS OF THE CIRCULATORY SYSTEM,4,Extreme,Extreme,Surgical,Medicare,Medicaid,,,,N,3124373.65,668316.91
Long Island,Nassau,2951001,000541,North Shore University Hospital,50 to 69,112,F,White,Not Span/Hispanic,67,Emergency,Expired,2020,CIR019,HEART FAILURE,ESA002,EXTRACORPOREAL MEMBRANE OXYGENATION,161,IMPLANTABLE HEART ASSIST SYSTEMS,05,DISEASES AND DISORDERS OF THE CIRCULATORY SYSTEM,4,Extreme,Extreme,Surgical,Medicare,Medicare,Medicaid,,,Y,2988313.81,633691.05
Finger Lakes,Monroe,2701005,000413,Strong Memorial Hospital,50 to 69,133,M,White,Not Span/Hispanic,34,Urgent,Home w/ Home Health Services,2020,CIR019,HEART FAILURE,CAR027,HEART ASSIST DEVICE PROCEDURES,161,IMPLANTABLE HEART ASSIST SYSTEMS,05,DISEASES AND DISORDERS OF THE CIRCULATORY SYSTEM,3,Major,Major,Surgical,Medicare,,,,,N,550705.14,267672.86
Finger Lakes,Monroe,2701005,000413,Strong Memorial Hospital,50 to 69,133,F,White,Not Span/Hispanic,51,Urgent,Home w/ Home Health Services,2020,CIR019,HEART FAILURE,CAR027,HEART ASSIST DEVICE PROCEDURES,161,IMPLANTABLE HEART ASSIST SYSTEMS,05,DISEASES AND DISORDERS OF THE CIRCULATORY SYSTEM,4,Extreme,Extreme,Surgical,Medicare,,,,,N,658459.66,311472.15
Finger Lakes,Monroe,2701005,000413,Strong Memorial Hospital,30 to 49,142,M,Black/African American,Not Span/Hispanic,36,Urgent,Home w/ Home Health Services,2020,CIR019,HEART FAILURE,CAR027,HEART ASSIST DEVICE PROCEDURES,161,IMPLANTABLE HEART ASSIST SYSTEMS,05,DISEASES AND DISORDERS OF THE CIRCULATORY SYSTEM,4,Extreme,Extreme,Surgical,Blue Cross/Blue Shield,,,,,N,579560.77,281649.54
Finger Lakes,Monroe,2701005,000413,Strong Memorial Hospital,50 to 69,148,F,White,Not Span/Hispanic,32,Elective,Home w/ Home Health Services,2020,CIR019,HEART FAILURE,CAR027,HEART ASSIST DEVICE PROCEDURES,161,IMPLANTABLE HEART ASSIST SYSTEMS,05,DISEASES AND DISORDERS OF THE CIRCULATORY SYSTEM,4,Extreme,Extreme,Surgical,Blue Cross/Blue Shield,,,,,N,643625.71,300059.32
Finger Lakes,Monroe,2701005,000413,Strong Memorial Hospital,50 to 69,141,F,White,Not Span/Hispanic,14,Elective,Home w/ Home Health Services,2020,CIR019,HEART FAILURE,CAR027,HEART ASSIST DEVICE PROCEDURES,161,IMPLANTABLE HEART ASSIST SYSTEMS,05,DISEASES AND DISORDERS OF THE CIRCULATORY SYSTEM,4,Extreme,Extreme,Surgical,Private Health Insurance,,,,,N,405080.43,196036.28
Finger Lakes,Monroe,2701005,000413,Strong Memorial Hospital,50 to 69,144,M,White,Not Span/Hispanic,36,Elective,Home w/ Home Health Services,2020,CIR019,HEART FAILURE,CAR027,HEART ASSIST DEVICE PROCEDURES,161,IMPLANTABLE HEART ASSIST SYSTEMS,05,DISEASES AND DISORDERS OF THE CIRCULATORY SYSTEM,3,Major,Major,Surgical,Private Health Insurance,,,,,N,592712.24,290371.77
Finger Lakes,Monroe,2701005,000413,Strong Memorial Hospital,50 to 69,140,M,Other Race,Unknown,28,Urgent,Home w/ Home Health Services,2020,CIR019,HEART FAILURE,CAR027,HEART ASSIST DEVICE PROCEDURES,161,IMPLANTABLE HEART ASSIST SYSTEMS,05,DISEASES AND DISORDERS OF THE CIRCULATORY SYSTEM,3,Major,Moderate,Surgical,Medicare,,,,,N,499214.45,247621.2
Finger Lakes,Monroe,2701005,000413,Strong Memorial Hospital,50 to 69,145,M,White,Not Span/Hispanic,30,Elective,Home w/ Home Health Services,2020,CIR019,HEART FAILURE,CAR027,HEART ASSIST DEVICE PROCEDURES,161,IMPLANTABLE HEART ASSIST SYSTEMS,05,DISEASES AND DISORDERS OF THE CIRCULATORY SYSTEM,3,Major,Major,Surgical,Medicare,,,,,N,470499.22,232168
Finger Lakes,Monroe,2701005,000413,Strong Memorial Hospital,50 to 69,OOS,F,White,Not Span/Hispanic,45,Urgent,Home w/ Home Health Services,2020,CIR009,ACUTE MYOCARDIAL INFARCTION,ESA002,EXTRACORPOREAL MEMBRANE OXYGENATION,161,IMPLANTABLE HEART ASSIST SYSTEMS,05,DISEASES AND DISORDERS OF THE CIRCULATORY SYSTEM,3,Major,Extreme,Surgical,Blue Cross/Blue Shield,,,,,N,955941.05,441534.99
Finger Lakes,Monroe,2701005,000413,Strong Memorial Hospital,70 or Older,145,F,White,Not Span/Hispanic,20,Urgent,Home w/ Home Health Services,2020,INJ033,"COMPLICATION OF CARDIOVASCULAR DEVICE, IMPLANT OR GRAFT, INITIAL ENCOUNTER",CAR027,HEART ASSIST DEVICE PROCEDURES,161,IMPLANTABLE HEART ASSIST SYSTEMS,05,DISEASES AND DISORDERS OF THE CIRCULATORY SYSTEM,3,Major,Major,Surgical,Medicare,,,,,N,368787.43,182454.77
Finger Lakes,Monroe,2701005,000413,Strong Memorial Hospital,70 or Older,142,M,White,Not Span/Hispanic,31,Urgent,Home or Self Care,2020,CIR019,HEART FAILURE,CAR027,HEART ASSIST DEVICE PROCEDURES,161,IMPLANTABLE HEART ASSIST SYSTEMS,05,DISEASES AND DISORDERS OF THE CIRCULATORY SYSTEM,3,Major,Major,Surgical,Medicare,,,,,N,441723.98,222690.36
Long Island,Suffolk,5151001,000245,Stony Brook University Hospital,50 to 69,117,M,White,Not Span/Hispanic,16,Emergency,Home w/ Home Health Services,2020,CIR005,MYOCARDITIS AND CARDIOMYOPATHY,CAR027,HEART ASSIST DEVICE PROCEDURES,161,IMPLANTABLE HEART ASSIST SYSTEMS,05,DISEASES AND DISORDERS OF THE CIRCULATORY SYSTEM,3,Major,Major,Surgical,Medicare,,,,,N,584473.87,245354.76
Hudson Valley,Westchester,5957001,001139,Westchester Medical Center,30 to 49,121,M,Other Race,Spanish/Hispanic,51,Urgent,Left Against Medical Advice,2020,CIR019,HEART FAILURE,CAR027,HEART ASSIST DEVICE PROCEDURES,161,IMPLANTABLE HEART ASSIST SYSTEMS,05,DISEASES AND DISORDERS OF THE CIRCULATORY SYSTEM,4,Extreme,Extreme,Surgical,Medicare,Medicaid,,,,N,2678627.47,439014.32
New York City,Manhattan,7002053,001463,NYU Langone Hospitals,70 or Older,115,M,White,Not Span/Hispanic,13,Elective,Inpatient Rehabilitation Facility,2020,CIR019,HEART FAILURE,CAR027,HEART ASSIST DEVICE PROCEDURES,161,IMPLANTABLE HEART ASSIST SYSTEMS,05,DISEASES AND DISORDERS OF THE CIRCULATORY SYSTEM,3,Major,Moderate,Surgical,Medicare,Private Health Insurance,,,,N,1533062.22,245212.4
New York City,Manhattan,7002054,001458,New York-Presbyterian Hospital - New York Weill Cornell Center,70 or Older,113,M,Other Race,Not Span/Hispanic,57,Emergency,Home w/ Home Health Services,2020,CIR019,HEART FAILURE,CAR027,HEART ASSIST DEVICE PROCEDURES,161,IMPLANTABLE HEART ASSIST SYSTEMS,05,DISEASES AND DISORDERS OF THE CIRCULATORY SYSTEM,3,Major,Extreme,Surgical,Medicare,Medicare,Medicaid,,,N,1897244.7,816529.15
Finger Lakes,Monroe,2701003,000411,Rochester General Hospital,30 to 49,136,M,White,Not Span/Hispanic,24,Elective,Home w/ Home Health Services,2020,CIR019,HEART FAILURE,CAR027,HEART ASSIST DEVICE PROCEDURES,161,IMPLANTABLE HEART ASSIST SYSTEMS,05,DISEASES AND DISORDERS OF THE CIRCULATORY SYSTEM,4,Extreme,Extreme,Surgical,Medicaid,,,,,N,602017.42,197364.28
Finger Lakes,Monroe,2701003,000411,Rochester General Hospital,18 to 29,142,M,White,Not Span/Hispanic,35,Elective,Inpatient Rehabilitation Facility,2020,CIR019,HEART FAILURE,CAR027,HEART ASSIST DEVICE PROCEDURES,161,IMPLANTABLE HEART ASSIST SYSTEMS,05,DISEASES AND DISORDERS OF THE CIRCULATORY SYSTEM,4,Extreme,Extreme,Surgical,Medicaid,,,,,N,668054.47,223501.93
Finger Lakes,Monroe,2701003,000411,Rochester General Hospital,30 to 49,146,M,Black/African American,Not Span/Hispanic,23,Emergency,Home w/ Home Health Services,2020,CIR017,CARDIAC DYSRHYTHMIAS,CAR027,HEART ASSIST DEVICE PROCEDURES,161,IMPLANTABLE HEART ASSIST SYSTEMS,05,DISEASES AND DISORDERS OF THE CIRCULATORY SYSTEM,3,Major,Major,Surgical,Federal/State/Local/VA,,,,,Y,212696.99,77632.47
Finger Lakes,Monroe,2701005,000413,Strong Memorial Hospital,30 to 49,140,F,White,Not Span/Hispanic,14,Elective,Home w/ Home Health Services,2020,CIR019,HEART FAILURE,CAR027,HEART ASSIST DEVICE PROCEDURES,161,IMPLANTABLE HEART ASSIST SYSTEMS,05,DISEASES AND DISORDERS OF THE CIRCULATORY SYSTEM,3,Major,Extreme,Surgical,Private Health Insurance,,,,,N,402804.71,199220.68
Finger Lakes,Monroe,2701005,000413,Strong Memorial Hospital,70 or Older,145,M,White,Not Span/Hispanic,120 +,Elective,Expired,2020,CIR019,HEART FAILURE,CAR027,HEART ASSIST DEVICE PROCEDURES,161,IMPLANTABLE HEART ASSIST SYSTEMS,05,DISEASES AND DISORDERS OF THE CIRCULATORY SYSTEM,4,Extreme,Extreme,Surgical,Medicare,,,,,N,1585799.41,686138.51
Finger Lakes,Monroe,2701005,000413,Strong Memorial Hospital,50 to 69,130,M,White,Not Span/Hispanic,76,Urgent,Home w/ Home Health Services,2020,INJ033,"COMPLICATION OF CARDIOVASCULAR DEVICE, IMPLANT OR GRAFT, INITIAL ENCOUNTER",CAR027,HEART ASSIST DEVICE PROCEDURES,161,IMPLANTABLE HEART ASSIST SYSTEMS,05,DISEASES AND DISORDERS OF THE CIRCULATORY SYSTEM,4,Extreme,Extreme,Surgical,Medicare,Blue Cross/Blue Shield,,,,N,655470.07,352362.86
Finger Lakes,Monroe,2701005,000413,Strong Memorial Hospital,50 to 69,121,M,White,Not Span/Hispanic,6,Urgent,Expired,2020,CIR009,ACUTE MYOCARDIAL INFARCTION,ESA002,EXTRACORPOREAL MEMBRANE OXYGENATION,161,IMPLANTABLE HEART ASSIST SYSTEMS,05,DISEASES AND DISORDERS OF THE CIRCULATORY SYSTEM,4,Extreme,Extreme,Surgical,Private Health Insurance,,,,,N,629546.99,286801.42
Finger Lakes,Monroe,2701005,000413,Strong Memorial Hospital,30 to 49,144,M,White,Not Span/Hispanic,53,Emergency,Home w/ Home Health Services,2020,CIR019,HEART FAILURE,CAR027,HEART ASSIST DEVICE PROCEDURES,161,IMPLANTABLE HEART ASSIST SYSTEMS,05,DISEASES AND DISORDERS OF THE CIRCULATORY SYSTEM,4,Extreme,Extreme,Surgical,Medicare,,,,,Y,697503.76,342501.03
Long Island,Nassau,2951001,000541,North Shore University Hospital,50 to 69,114,M,Other Race,Not Span/Hispanic,84,Urgent,Expired,2020,CIR019,HEART FAILURE,ESA002,EXTRACORPOREAL MEMBRANE OXYGENATION,161,IMPLANTABLE HEART ASSIST SYSTEMS,05,DISEASES AND DISORDERS OF THE CIRCULATORY SYSTEM,4,Extreme,Extreme,Surgical,Medicaid,Medicaid,,,,N,2891980.66,605080.21
New York City,Manhattan,7002024,001456,Mount Sinai Hospital,50 to 69,104,F,Other Race,Spanish/Hispanic,31,Urgent,Home or Self Care,2020,CIR019,HEART FAILURE,CAR027,HEART ASSIST DEVICE PROCEDURES,161,IMPLANTABLE HEART ASSIST SYSTEMS,05,DISEASES AND DISORDERS OF THE CIRCULATORY SYSTEM,4,Extreme,Extreme,Surgical,Medicaid,Self-Pay,,,,N,741985.01,230526.53
Long Island,Suffolk,5151001,000245,Stony Brook University Hospital,50 to 69,117,M,White,Not Span/Hispanic,17,Urgent,Home w/ Home Health Services,2020,CIR005,MYOCARDITIS AND CARDIOMYOPATHY,CAR027,HEART ASSIST DEVICE PROCEDURES,161,IMPLANTABLE HEART ASSIST SYSTEMS,05,DISEASES AND DISORDERS OF THE CIRCULATORY SYSTEM,3,Major,Major,Surgical,Medicare,Medicare,,,,N,631903.09,280620.81
Hudson Valley,Westchester,5957001,001139,Westchester Medical Center,70 or Older,109,M,Black/African American,Not Span/Hispanic,33,Urgent,Home w/ Home Health Services,2020,SYM003,SHOCK,CAR027,HEART ASSIST DEVICE PROCEDURES,161,IMPLANTABLE HEART ASSIST SYSTEMS,05,DISEASES AND DISORDERS OF THE CIRCULATORY SYSTEM,4,Extreme,Extreme,Surgical,Private Health Insurance,Medicare,,,,N,1395376.59,546601.69
Hudson Valley,Westchester,5957001,001139,Westchester Medical Center,30 to 49,104,F,Other Race,Spanish/Hispanic,120 +,Urgent,Medicare Cert Long Term Care Hospital,2020,CIR019,HEART FAILURE,ESA002,EXTRACORPOREAL MEMBRANE OXYGENATION,161,IMPLANTABLE HEART ASSIST SYSTEMS,05,DISEASES AND DISORDERS OF THE CIRCULATORY SYSTEM,4,Extreme,Extreme,Surgical,Medicaid,Medicaid,,,,N,4224428.55,657154.26
Hudson Valley,Westchester,5957001,001139,Westchester Medical Center,30 to 49,105,M,Other Race,Spanish/Hispanic,43,Emergency,Home or Self Care,2020,CIR019,HEART FAILURE,ESA002,EXTRACORPOREAL MEMBRANE OXYGENATION,161,IMPLANTABLE HEART ASSIST SYSTEMS,05,DISEASES AND DISORDERS OF THE CIRCULATORY SYSTEM,3,Major,Major,Surgical,Medicaid,,,,,Y,2257298.82,618473.29
Hudson Valley,Dutchess,1302001,000181,Vassar Brothers Medical Center,70 or Older,126,M,White,Unknown,6,Emergency,Expired,2020,CIR017,CARDIAC DYSRHYTHMIAS,CAR027,HEART ASSIST DEVICE PROCEDURES,161,IMPLANTABLE HEART ASSIST SYSTEMS,05,DISEASES AND DISORDERS OF THE CIRCULATORY SYSTEM,4,Extreme,Extreme,Surgical,Medicare,,,,,Y,193762.86,49026.48
New York City,Manhattan,7002054,001458,New York-Presbyterian Hospital - New York Weill Cornell Center,70 or Older,100,M,White,Not Span/Hispanic,25,Emergency,Home w/ Home Health Services,2020,CIR019,HEART FAILURE,CAR027,HEART ASSIST DEVICE PROCEDURES,161,IMPLANTABLE HEART ASSIST SYSTEMS,05,DISEASES AND DISORDERS OF THE CIRCULATORY SYSTEM,4,Extreme,Extreme,Surgical,Medicare,Blue Cross/Blue Shield,Self-Pay,,,Y,1311641.39,511268.51
New York City,Manhattan,7002024,001456,Mount Sinai Hospital,50 to 69,115,M,Other Race,Unknown,19,Elective,Expired,2020,CIR019,HEART FAILURE,CAR027,HEART ASSIST DEVICE PROCEDURES,161,IMPLANTABLE HEART ASSIST SYSTEMS,05,DISEASES AND DISORDERS OF THE CIRCULATORY SYSTEM,4,Extreme,Extreme,Surgical,Private Health Insurance,Self-Pay,,,,N,745612.65,225315.4
Long Island,Nassau,2953000,000563,St. Francis Hospital & Heart Center,50 to 69,117,M,Other Race,Spanish/Hispanic,22,Urgent,Home w/ Home Health Services,2020,CIR019,HEART FAILURE,CAR027,HEART ASSIST DEVICE PROCEDURES,161,IMPLANTABLE HEART ASSIST SYSTEMS,05,DISEASES AND DISORDERS OF THE CIRCULATORY SYSTEM,4,Extreme,Extreme,Surgical,Medicare,Private Health Insurance,,,,N,1491527.59,270711.89
Finger Lakes,Monroe,2701003,000411,Rochester General Hospital,50 to 69,138,M,White,Not Span/Hispanic,11,Elective,Inpatient Rehabilitation Facility,2020,CIR019,HEART FAILURE,CAR027,HEART ASSIST DEVICE PROCEDURES,161,IMPLANTABLE HEART ASSIST SYSTEMS,05,DISEASES AND DISORDERS OF THE CIRCULATORY SYSTEM,4,Extreme,Major,Surgical,Medicare,,,,,N,479774.03,149268.8
Finger Lakes,Monroe,2701003,000411,Rochester General Hospital,50 to 69,147,M,White,Not Span/Hispanic,8,Elective,Inpatient Rehabilitation Facility,2020,CIR019,HEART FAILURE,CAR027,HEART ASSIST DEVICE PROCEDURES,161,IMPLANTABLE HEART ASSIST SYSTEMS,05,DISEASES AND DISORDERS OF THE CIRCULATORY SYSTEM,3,Major,Major,Surgical,Medicaid,,,,,N,451665.64,139448.53
New York City,Manhattan,7002053,001463,NYU Langone Hospitals,50 to 69,OOS,M,Other Race,Not Span/Hispanic,62,Emergency,Home or Self Care,2020,CIR009,ACUTE MYOCARDIAL INFARCTION,CAR027,HEART ASSIST DEVICE PROCEDURES,161,IMPLANTABLE HEART ASSIST SYSTEMS,05,DISEASES AND DISORDERS OF THE CIRCULATORY SYSTEM,4,Extreme,Extreme,Surgical,Blue Cross/Blue Shield,,,,,Y,4874176.03,888011.19
Hudson Valley,Westchester,5957001,001139,Westchester Medical Center,70 or Older,OOS,M,Black/African American,Not Span/Hispanic,63,Elective,Inpatient Rehabilitation Facility,2020,CIR019,HEART FAILURE,CAR027,HEART ASSIST DEVICE PROCEDURES,161,IMPLANTABLE HEART ASSIST SYSTEMS,05,DISEASES AND DISORDERS OF THE CIRCULATORY SYSTEM,4,Extreme,Extreme,Surgical,Medicare,Private Health Insurance,,,,N,2393566.02,477501.7
New York City,Manhattan,7002053,001463,NYU Langone Hospitals,50 to 69,115,M,White,Not Span/Hispanic,36,Emergency,Inpatient Rehabilitation Facility,2020,INJ033,"COMPLICATION OF CARDIOVASCULAR DEVICE, IMPLANT OR GRAFT, INITIAL ENCOUNTER",CAR027,HEART ASSIST DEVICE PROCEDURES,161,IMPLANTABLE HEART ASSIST SYSTEMS,05,DISEASES AND DISORDERS OF THE CIRCULATORY SYSTEM,4,Extreme,Extreme,Surgical,Medicaid,,,,,N,2863585.02,521590.04
Finger Lakes,Monroe,2701003,000411,Rochester General Hospital,50 to 69,144,F,Black/African American,Not Span/Hispanic,79,Urgent,Skilled Nursing Home,2020,CIR019,HEART FAILURE,CAR027,HEART ASSIST DEVICE PROCEDURES,161,IMPLANTABLE HEART ASSIST SYSTEMS,05,DISEASES AND DISORDERS OF THE CIRCULATORY SYSTEM,4,Extreme,Extreme,Surgical,Medicaid,,,,,N,1210453.97,456713.3
Finger Lakes,Monroe,2701003,000411,Rochester General Hospital,70 or Older,145,M,White,Not Span/Hispanic,25,Urgent,Inpatient Rehabilitation Facility,2020,CIR019,HEART FAILURE,CAR027,HEART ASSIST DEVICE PROCEDURES,161,IMPLANTABLE HEART ASSIST SYSTEMS,05,DISEASES AND DISORDERS OF THE CIRCULATORY SYSTEM,3,Major,Major,Surgical,Medicare,,,,,N,605383.75,191419.27
Long Island,Nassau,2953000,000563,St. Francis Hospital & Heart Center,50 to 69,115,M,White,Not Span/Hispanic,26,Emergency,Home w/ Home Health Services,2020,CIR019,HEART FAILURE,CAR027,HEART ASSIST DEVICE PROCEDURES,161,IMPLANTABLE HEART ASSIST SYSTEMS,05,DISEASES AND DISORDERS OF THE CIRCULATORY SYSTEM,4,Extreme,Extreme,Surgical,Medicare,Private Health Insurance,,,,Y,1405745.29,266784.71