Hospital Service Area,Hospital County,Operating Certificate Number,Permanent Facility Id,Facility Name,Age Group,Zip Code - 3 digits,Gender,Race,Ethnicity,Length of Stay,Type of Admission,Patient Disposition,Discharge Year,CCS Diagnosis Code,CCS Diagnosis Description,CCS Procedure Code,CCS Procedure Description,APR DRG Code,APR DRG Description,APR MDC Code,APR MDC Description,APR Severity of Illness Code,APR Severity of Illness Description,APR Risk of Mortality,APR Medical Surgical Description,Payment Typology 1,Payment Typology 2,Payment Typology 3,Birth Weight,Abortion Edit Indicator,Emergency Department Indicator,Total Charges,Total Costs
New York City,Manhattan,7002053,001463,NYU Langone Hospitals,30 to 49,113,M,White,Not Span/Hispanic,7,Urgent,Expired,2017,097,Peri-; endo-; and myocarditis; cardiomyopathy (except that caused by tuberculosis or sexually transmitted disease),047,DX CARDIAC CATHETERIZTN,162,Cardiac valve procedures w AMI or complex PDX,05,Diseases and Disorders of the Circulatory System,4,Extreme,Extreme,Surgical,Private Health Insurance,,,,N,N,531596.08,116537.21
New York City,Manhattan,7002053,001463,NYU Langone Hospitals,70 or Older,117,F,White,Not Span/Hispanic,1,Elective,Home w/ Home Health Services,2017,237,Complication of device; implant or graft,043,HEART VALVE PRCS,162,Cardiac valve procedures w AMI or complex PDX,05,Diseases and Disorders of the Circulatory System,2,Moderate,Moderate,Surgical,Medicare,,,,N,N,271479.01,50992.90
New York City,Manhattan,7002053,001463,NYU Langone Hospitals,50 to 69,104,F,Black/African American,Not Span/Hispanic,10,Elective,Home w/ Home Health Services,2017,097,Peri-; endo-; and myocarditis; cardiomyopathy (except that caused by tuberculosis or sexually transmitted disease),043,HEART VALVE PRCS,162,Cardiac valve procedures w AMI or complex PDX,05,Diseases and Disorders of the Circulatory System,3,Major,Major,Surgical,Medicare,,,,N,N,273312.27,87817.31
New York City,Manhattan,7002053,001463,NYU Langone Hospitals,50 to 69,103,F,White,Not Span/Hispanic,10,Elective,Inpatient Rehabilitation Facility,2017,097,Peri-; endo-; and myocarditis; cardiomyopathy (except that caused by tuberculosis or sexually transmitted disease),049,OTHER OR HEART PRCS,162,Cardiac valve procedures w AMI or complex PDX,05,Diseases and Disorders of the Circulatory System,3,Major,Major,Surgical,Medicare,,,,N,N,246263.81,64710.89
New York City,Manhattan,7002053,001463,NYU Langone Hospitals,70 or Older,OOS,F,White,Not Span/Hispanic,1,Elective,Home w/ Home Health Services,2017,237,Complication of device; implant or graft,043,HEART VALVE PRCS,162,Cardiac valve procedures w AMI or complex PDX,05,Diseases and Disorders of the Circulatory System,3,Major,Major,Surgical,Medicare,,,,N,N,506240.06,95924.00
New York City,Manhattan,7002053,001463,NYU Langone Hospitals,70 or Older,OOS,F,White,Not Span/Hispanic,1,Elective,Home or Self Care,2017,237,Complication of device; implant or graft,043,HEART VALVE PRCS,162,Cardiac valve procedures w AMI or complex PDX,05,Diseases and Disorders of the Circulatory System,3,Major,Moderate,Surgical,Medicare,,,,N,N,288358.68,56484.76
New York City,Manhattan,7002053,001463,NYU Langone Hospitals,18 to 29,,F,White,Not Span/Hispanic,18,Urgent,Home or Self Care,2017,097,Peri-; endo-; and myocarditis; cardiomyopathy (except that caused by tuberculosis or sexually transmitted disease),043,HEART VALVE PRCS,162,Cardiac valve procedures w AMI or complex PDX,05,Diseases and Disorders of the Circulatory System,3,Major,Moderate,Surgical,Medicaid,,,,N,N,552998.35,163350.44
New York City,Manhattan,7002053,001463,NYU Langone Hospitals,30 to 49,100,M,White,Not Span/Hispanic,9,Elective,Home w/ Home Health Services,2017,097,Peri-; endo-; and myocarditis; cardiomyopathy (except that caused by tuberculosis or sexually transmitted disease),049,OTHER OR HEART PRCS,162,Cardiac valve procedures w AMI or complex PDX,05,Diseases and Disorders of the Circulatory System,2,Moderate,Moderate,Surgical,Private Health Insurance,,,,N,N,238744.45,67703.64
New York City,Manhattan,7002053,001463,NYU Langone Hospitals,70 or Older,111,F,White,Not Span/Hispanic,21,Urgent,Skilled Nursing Home,2017,237,Complication of device; implant or graft,043,HEART VALVE PRCS,162,Cardiac valve procedures w AMI or complex PDX,05,Diseases and Disorders of the Circulatory System,3,Major,Major,Surgical,Medicare,,,,N,N,557652.09,164073.00
New York City,Manhattan,7002053,001463,NYU Langone Hospitals,50 to 69,112,F,White,Not Span/Hispanic,15,Emergency,Home or Self Care,2017,099,Hypertension with complications and secondary hypertension,043,HEART VALVE PRCS,162,Cardiac valve procedures w AMI or complex PDX,05,Diseases and Disorders of the Circulatory System,4,Extreme,Extreme,Surgical,Blue Cross/Blue Shield,,,,N,Y,479182.00,140425.87
New York City,Manhattan,7002053,001463,NYU Langone Hospitals,50 to 69,100,M,White,Not Span/Hispanic,10,Emergency,Home or Self Care,2017,097,Peri-; endo-; and myocarditis; cardiomyopathy (except that caused by tuberculosis or sexually transmitted disease),043,HEART VALVE PRCS,162,Cardiac valve procedures w AMI or complex PDX,05,Diseases and Disorders of the Circulatory System,3,Major,Moderate,Surgical,Private Health Insurance,,,,N,Y,416372.54,103875.59
New York City,Manhattan,7002053,001463,NYU Langone Hospitals,30 to 49,105,M,White,Not Span/Hispanic,4,Elective,Home or Self Care,2017,237,Complication of device; implant or graft,043,HEART VALVE PRCS,162,Cardiac valve procedures w AMI or complex PDX,05,Diseases and Disorders of the Circulatory System,2,Moderate,Moderate,Surgical,Private Health Insurance,,,,N,N,275403.37,65363.99
New York City,Manhattan,7002053,001463,NYU Langone Hospitals,50 to 69,115,M,White,Not Span/Hispanic,4,Elective,Home w/ Home Health Services,2017,115,Aortic; peripheral; and visceral artery aneurysms,061,OT OR PRCS VES NOT HEAD,162,Cardiac valve procedures w AMI or complex PDX,05,Diseases and Disorders of the Circulatory System,2,Moderate,Minor,Surgical,Blue Cross/Blue Shield,,,,N,N,247183.42,64503.32
New York City,Manhattan,7002053,001463,NYU Langone Hospitals,50 to 69,117,F,White,Not Span/Hispanic,9,Elective,Home or Self Care,2017,237,Complication of device; implant or graft,043,HEART VALVE PRCS,162,Cardiac valve procedures w AMI or complex PDX,05,Diseases and Disorders of the Circulatory System,3,Major,Major,Surgical,Medicare,,,,N,N,476864.16,139526.26
New York City,Manhattan,7002053,001463,NYU Langone Hospitals,70 or Older,OOS,F,White,Not Span/Hispanic,6,Elective,Home or Self Care,2017,097,Peri-; endo-; and myocarditis; cardiomyopathy (except that caused by tuberculosis or sexually transmitted disease),043,HEART VALVE PRCS,162,Cardiac valve procedures w AMI or complex PDX,05,Diseases and Disorders of the Circulatory System,1,Minor,Moderate,Surgical,Medicaid,,,,N,N,189107.65,48201.92
New York City,Manhattan,7002053,001463,NYU Langone Hospitals,70 or Older,112,F,White,Not Span/Hispanic,10,Emergency,Home w/ Home Health Services,2017,237,Complication of device; implant or graft,043,HEART VALVE PRCS,162,Cardiac valve procedures w AMI or complex PDX,05,Diseases and Disorders of the Circulatory System,4,Extreme,Major,Surgical,Private Health Insurance,,,,N,Y,363042.90,106997.54
New York City,Manhattan,7002053,001463,NYU Langone Hospitals,50 to 69,112,M,White,Not Span/Hispanic,7,Emergency,Home w/ Home Health Services,2017,115,Aortic; peripheral; and visceral artery aneurysms,043,HEART VALVE PRCS,162,Cardiac valve procedures w AMI or complex PDX,05,Diseases and Disorders of the Circulatory System,2,Moderate,Minor,Surgical,Blue Cross/Blue Shield,,,,N,Y,221392.38,60154.13
New York City,Manhattan,7002053,001463,NYU Langone Hospitals,50 to 69,105,M,White,Not Span/Hispanic,4,Elective,Home or Self Care,2017,237,Complication of device; implant or graft,043,HEART VALVE PRCS,162,Cardiac valve procedures w AMI or complex PDX,05,Diseases and Disorders of the Circulatory System,4,Extreme,Major,Surgical,Private Health Insurance,,,,N,N,304088.50,70206.93
New York City,Manhattan,7002053,001463,NYU Langone Hospitals,50 to 69,OOS,F,White,Not Span/Hispanic,6,Elective,Home w/ Home Health Services,2017,097,Peri-; endo-; and myocarditis; cardiomyopathy (except that caused by tuberculosis or sexually transmitted disease),049,OTHER OR HEART PRCS,162,Cardiac valve procedures w AMI or complex PDX,05,Diseases and Disorders of the Circulatory System,3,Major,Major,Surgical,Private Health Insurance,,,,N,N,189245.20,53651.41
New York City,Manhattan,7002053,001463,NYU Langone Hospitals,70 or Older,OOS,M,White,Not Span/Hispanic,7,Urgent,Inpatient Rehabilitation Facility,2017,237,Complication of device; implant or graft,043,HEART VALVE PRCS,162,Cardiac valve procedures w AMI or complex PDX,05,Diseases and Disorders of the Circulatory System,3,Major,Major,Surgical,Medicare,,,,N,N,355184.24,88799.81
New York City,Manhattan,7002053,001463,NYU Langone Hospitals,70 or Older,100,M,White,Not Span/Hispanic,5,Elective,Home or Self Care,2017,237,Complication of device; implant or graft,043,HEART VALVE PRCS,162,Cardiac valve procedures w AMI or complex PDX,05,Diseases and Disorders of the Circulatory System,1,Minor,Minor,Surgical,Medicare,,,,N,N,278324.99,64732.30
New York City,Manhattan,7002053,001463,NYU Langone Hospitals,50 to 69,100,M,White,Not Span/Hispanic,6,Elective,Home or Self Care,2017,097,Peri-; endo-; and myocarditis; cardiomyopathy (except that caused by tuberculosis or sexually transmitted disease),043,HEART VALVE PRCS,162,Cardiac valve procedures w AMI or complex PDX,05,Diseases and Disorders of the Circulatory System,1,Minor,Minor,Surgical,Private Health Insurance,,,,N,N,183973.66,55089.56
New York City,Manhattan,7002053,001463,NYU Langone Hospitals,50 to 69,112,M,White,Not Span/Hispanic,29,Emergency,Home w/ Home Health Services,2017,097,Peri-; endo-; and myocarditis; cardiomyopathy (except that caused by tuberculosis or sexually transmitted disease),043,HEART VALVE PRCS,162,Cardiac valve procedures w AMI or complex PDX,05,Diseases and Disorders of the Circulatory System,4,Extreme,Major,Surgical,Private Health Insurance,,,,N,N,677044.49,207398.04
New York City,Manhattan,7002053,001463,NYU Langone Hospitals,50 to 69,104,F,Other Race,Spanish/Hispanic,10,Elective,Home w/ Home Health Services,2017,097,Peri-; endo-; and myocarditis; cardiomyopathy (except that caused by tuberculosis or sexually transmitted disease),043,HEART VALVE PRCS,162,Cardiac valve procedures w AMI or complex PDX,05,Diseases and Disorders of the Circulatory System,3,Major,Moderate,Surgical,Medicare,,,,N,N,236256.69,82187.75
New York City,Manhattan,7002053,001463,NYU Langone Hospitals,50 to 69,105,M,White,Not Span/Hispanic,6,Elective,Home or Self Care,2017,097,Peri-; endo-; and myocarditis; cardiomyopathy (except that caused by tuberculosis or sexually transmitted disease),049,OTHER OR HEART PRCS,162,Cardiac valve procedures w AMI or complex PDX,05,Diseases and Disorders of the Circulatory System,2,Moderate,Moderate,Surgical,Medicare,,,,N,N,262577.17,65876.96
New York City,Manhattan,7002053,001463,NYU Langone Hospitals,50 to 69,105,M,Multi-racial,Not Span/Hispanic,5,Elective,Home or Self Care,2017,237,Complication of device; implant or graft,061,OT OR PRCS VES NOT HEAD,162,Cardiac valve procedures w AMI or complex PDX,05,Diseases and Disorders of the Circulatory System,3,Major,Major,Surgical,Blue Cross/Blue Shield,,,,N,N,354857.82,92470.22
New York City,Manhattan,7002053,001463,NYU Langone Hospitals,70 or Older,100,F,White,Not Span/Hispanic,7,Elective,Inpatient Rehabilitation Facility,2017,237,Complication of device; implant or graft,043,HEART VALVE PRCS,162,Cardiac valve procedures w AMI or complex PDX,05,Diseases and Disorders of the Circulatory System,3,Major,Moderate,Surgical,Medicare,,,,N,N,343632.97,86813.22
New York City,Manhattan,7002053,001463,NYU Langone Hospitals,30 to 49,104,M,Other Race,Spanish/Hispanic,15,Emergency,Home w/ Home Health Services,2017,237,Complication of device; implant or graft,043,HEART VALVE PRCS,162,Cardiac valve procedures w AMI or complex PDX,05,Diseases and Disorders of the Circulatory System,3,Major,Major,Surgical,Blue Cross/Blue Shield,,,,N,Y,581142.19,159847.56
New York City,Manhattan,7002053,001463,NYU Langone Hospitals,30 to 49,114,M,White,Not Span/Hispanic,6,Elective,Home or Self Care,2017,097,Peri-; endo-; and myocarditis; cardiomyopathy (except that caused by tuberculosis or sexually transmitted disease),049,OTHER OR HEART PRCS,162,Cardiac valve procedures w AMI or complex PDX,05,Diseases and Disorders of the Circulatory System,3,Major,Moderate,Surgical,Medicaid,,,,N,N,189165.29,53047.81
New York City,Manhattan,7002053,001463,NYU Langone Hospitals,50 to 69,100,M,White,Not Span/Hispanic,9,Elective,Home w/ Home Health Services,2017,097,Peri-; endo-; and myocarditis; cardiomyopathy (except that caused by tuberculosis or sexually transmitted disease),043,HEART VALVE PRCS,162,Cardiac valve procedures w AMI or complex PDX,05,Diseases and Disorders of the Circulatory System,3,Major,Major,Surgical,Private Health Insurance,,,,N,N,223727.08,63621.83
New York City,Manhattan,7002053,001463,NYU Langone Hospitals,50 to 69,117,M,White,Not Span/Hispanic,9,Emergency,Home w/ Home Health Services,2017,237,Complication of device; implant or graft,043,HEART VALVE PRCS,162,Cardiac valve procedures w AMI or complex PDX,05,Diseases and Disorders of the Circulatory System,3,Major,Major,Surgical,Blue Cross/Blue Shield,,,,N,Y,349422.66,98613.13
New York City,Manhattan,7002053,001463,NYU Langone Hospitals,70 or Older,110,M,White,Not Span/Hispanic,6,Elective,Home w/ Home Health Services,2017,097,Peri-; endo-; and myocarditis; cardiomyopathy (except that caused by tuberculosis or sexually transmitted disease),049,OTHER OR HEART PRCS,162,Cardiac valve procedures w AMI or complex PDX,05,Diseases and Disorders of the Circulatory System,3,Major,Major,Surgical,Medicare,,,,N,N,226303.92,59715.41
New York City,Manhattan,7002053,001463,NYU Langone Hospitals,30 to 49,112,M,Other Race,Not Span/Hispanic,5,Elective,Home or Self Care,2017,237,Complication of device; implant or graft,043,HEART VALVE PRCS,162,Cardiac valve procedures w AMI or complex PDX,05,Diseases and Disorders of the Circulatory System,3,Major,Major,Surgical,Private Health Insurance,,,,N,N,282088.31,69736.67
New York City,Manhattan,7002053,001463,NYU Langone Hospitals,50 to 69,104,M,White,Not Span/Hispanic,6,Elective,Home w/ Home Health Services,2017,237,Complication of device; implant or graft,043,HEART VALVE PRCS,162,Cardiac valve procedures w AMI or complex PDX,05,Diseases and Disorders of the Circulatory System,3,Major,Moderate,Surgical,Private Health Insurance,,,,N,N,291498.82,84477.52
New York City,Manhattan,7002053,001463,NYU Langone Hospitals,18 to 29,103,M,White,Not Span/Hispanic,22,Emergency,Home or Self Care,2017,237,Complication of device; implant or graft,043,HEART VALVE PRCS,162,Cardiac valve procedures w AMI or complex PDX,05,Diseases and Disorders of the Circulatory System,4,Extreme,Extreme,Surgical,Blue Cross/Blue Shield,,,,N,Y,749875.60,199058.97
New York City,Manhattan,7002053,001463,NYU Langone Hospitals,70 or Older,117,M,White,Not Span/Hispanic,5,Elective,Home or Self Care,2017,115,Aortic; peripheral; and visceral artery aneurysms,043,HEART VALVE PRCS,162,Cardiac valve procedures w AMI or complex PDX,05,Diseases and Disorders of the Circulatory System,3,Major,Major,Surgical,Blue Cross/Blue Shield,,,,N,N,273151.56,74644.07
New York City,Manhattan,7002053,001463,NYU Langone Hospitals,50 to 69,113,M,Other Race,Spanish/Hispanic,19,Urgent,Expired,2017,237,Complication of device; implant or graft,047,DX CARDIAC CATHETERIZTN,162,Cardiac valve procedures w AMI or complex PDX,05,Diseases and Disorders of the Circulatory System,4,Extreme,Extreme,Surgical,Medicare,,,,N,N,1441816.76,314616.52
New York City,Manhattan,7002053,001463,NYU Langone Hospitals,50 to 69,113,M,Other Race,Spanish/Hispanic,5,Elective,Home or Self Care,2017,115,Aortic; peripheral; and visceral artery aneurysms,043,HEART VALVE PRCS,162,Cardiac valve procedures w AMI or complex PDX,05,Diseases and Disorders of the Circulatory System,2,Moderate,Minor,Surgical,Medicare,,,,N,N,201935.27,49868.29
New York City,Manhattan,7002053,001463,NYU Langone Hospitals,50 to 69,OOS,M,White,Not Span/Hispanic,1,Elective,Home or Self Care,2017,237,Complication of device; implant or graft,043,HEART VALVE PRCS,162,Cardiac valve procedures w AMI or complex PDX,05,Diseases and Disorders of the Circulatory System,3,Major,Major,Surgical,Medicare,,,,N,N,335840.20,65324.85
New York City,Manhattan,7002053,001463,NYU Langone Hospitals,50 to 69,OOS,F,White,Not Span/Hispanic,21,Elective,Expired,2017,237,Complication of device; implant or graft,043,HEART VALVE PRCS,162,Cardiac valve procedures w AMI or complex PDX,05,Diseases and Disorders of the Circulatory System,3,Major,Major,Surgical,Medicare,,,,N,N,1740308.95,392313.48
New York City,Manhattan,7002053,001463,NYU Langone Hospitals,50 to 69,117,M,White,Not Span/Hispanic,11,Elective,Home w/ Home Health Services,2017,097,Peri-; endo-; and myocarditis; cardiomyopathy (except that caused by tuberculosis or sexually transmitted disease),043,HEART VALVE PRCS,162,Cardiac valve procedures w AMI or complex PDX,05,Diseases and Disorders of the Circulatory System,2,Moderate,Moderate,Surgical,Private Health Insurance,,,,N,N,414254.64,104645.58
New York City,Manhattan,7002053,001463,NYU Langone Hospitals,50 to 69,104,M,White,Not Span/Hispanic,4,Elective,Home w/ Home Health Services,2017,237,Complication of device; implant or graft,043,HEART VALVE PRCS,162,Cardiac valve procedures w AMI or complex PDX,05,Diseases and Disorders of the Circulatory System,2,Moderate,Moderate,Surgical,Medicare,,,,N,N,202285.56,50525.03
New York City,Manhattan,7002053,001463,NYU Langone Hospitals,50 to 69,112,F,White,Not Span/Hispanic,10,Elective,Home or Self Care,2017,237,Complication of device; implant or graft,043,HEART VALVE PRCS,162,Cardiac valve procedures w AMI or complex PDX,05,Diseases and Disorders of the Circulatory System,3,Major,Major,Surgical,Private Health Insurance,,,,N,N,304052.44,84487.82
New York City,Manhattan,7002053,001463,NYU Langone Hospitals,50 to 69,,M,Other Race,Not Span/Hispanic,12,Elective,Home w/ Home Health Services,2017,237,Complication of device; implant or graft,043,HEART VALVE PRCS,162,Cardiac valve procedures w AMI or complex PDX,05,Diseases and Disorders of the Circulatory System,3,Major,Major,Surgical,Medicaid,,,,N,N,597768.18,160685.83
New York City,Manhattan,7002053,001463,NYU Langone Hospitals,50 to 69,100,M,White,Not Span/Hispanic,8,Emergency,Home w/ Home Health Services,2017,097,Peri-; endo-; and myocarditis; cardiomyopathy (except that caused by tuberculosis or sexually transmitted disease),047,DX CARDIAC CATHETERIZTN,162,Cardiac valve procedures w AMI or complex PDX,05,Diseases and Disorders of the Circulatory System,3,Major,Moderate,Surgical,Medicare,,,,N,Y,309452.54,86213.85
New York City,Manhattan,7002053,001463,NYU Langone Hospitals,70 or Older,117,F,White,Not Span/Hispanic,12,Emergency,Home w/ Home Health Services,2017,100,Acute myocardial infarction,044,COR ARTERY BYP GRF-CABG,162,Cardiac valve procedures w AMI or complex PDX,05,Diseases and Disorders of the Circulatory System,4,Extreme,Extreme,Surgical,Medicare,,,,N,Y,441796.40,136323.98
New York City,Manhattan,7002053,001463,NYU Langone Hospitals,50 to 69,112,F,Other Race,Spanish/Hispanic,1,Elective,Home or Self Care,2017,237,Complication of device; implant or graft,043,HEART VALVE PRCS,162,Cardiac valve procedures w AMI or complex PDX,05,Diseases and Disorders of the Circulatory System,2,Moderate,Moderate,Surgical,Medicare,,,,N,N,344979.05,63683.42
New York City,Manhattan,7002053,001463,NYU Langone Hospitals,70 or Older,119,F,White,Not Span/Hispanic,9,Elective,Home w/ Home Health Services,2017,097,Peri-; endo-; and myocarditis; cardiomyopathy (except that caused by tuberculosis or sexually transmitted disease),049,OTHER OR HEART PRCS,162,Cardiac valve procedures w AMI or complex PDX,05,Diseases and Disorders of the Circulatory System,1,Minor,Major,Surgical,Medicare,,,,N,N,278825.54,92729.78
New York City,Manhattan,7002053,001463,NYU Langone Hospitals,70 or Older,,M,Multi-racial,Not Span/Hispanic,30,Emergency,Inpatient Rehabilitation Facility,2017,097,Peri-; endo-; and myocarditis; cardiomyopathy (except that caused by tuberculosis or sexually transmitted disease),043,HEART VALVE PRCS,162,Cardiac valve procedures w AMI or complex PDX,05,Diseases and Disorders of the Circulatory System,3,Major,Extreme,Surgical,Private Health Insurance,,,,N,Y,1108630.85,330393.54
New York City,Manhattan,7002053,001463,NYU Langone Hospitals,70 or Older,115,F,White,Not Span/Hispanic,6,Elective,Home w/ Home Health Services,2017,097,Peri-; endo-; and myocarditis; cardiomyopathy (except that caused by tuberculosis or sexually transmitted disease),043,HEART VALVE PRCS,162,Cardiac valve procedures w AMI or complex PDX,05,Diseases and Disorders of the Circulatory System,3,Major,Major,Surgical,Medicare,,,,N,N,338666.84,80430.01
New York City,Manhattan,7002053,001463,NYU Langone Hospitals,50 to 69,100,M,Other Race,Spanish/Hispanic,27,Emergency,Inpatient Rehabilitation Facility,2017,115,Aortic; peripheral; and visceral artery aneurysms,061,OT OR PRCS VES NOT HEAD,162,Cardiac valve procedures w AMI or complex PDX,05,Diseases and Disorders of the Circulatory System,3,Major,Major,Surgical,Private Health Insurance,,,,N,Y,677841.63,217606.09
New York City,Manhattan,7002053,001463,NYU Langone Hospitals,70 or Older,OOS,M,White,Not Span/Hispanic,11,Urgent,Expired,2017,237,Complication of device; implant or graft,043,HEART VALVE PRCS,162,Cardiac valve procedures w AMI or complex PDX,05,Diseases and Disorders of the Circulatory System,3,Major,Major,Surgical,Medicare,,,,N,N,761174.76,193794.60
New York City,Manhattan,7002053,001463,NYU Langone Hospitals,18 to 29,112,M,White,Not Span/Hispanic,5,Elective,Home w/ Home Health Services,2017,097,Peri-; endo-; and myocarditis; cardiomyopathy (except that caused by tuberculosis or sexually transmitted disease),049,OTHER OR HEART PRCS,162,Cardiac valve procedures w AMI or complex PDX,05,Diseases and Disorders of the Circulatory System,1,Minor,Moderate,Surgical,Self-Pay,,,,N,N,180784.34,49305.59
New York City,Manhattan,7002053,001463,NYU Langone Hospitals,70 or Older,115,F,White,Not Span/Hispanic,14,Urgent,Home or Self Care,2017,097,Peri-; endo-; and myocarditis; cardiomyopathy (except that caused by tuberculosis or sexually transmitted disease),043,HEART VALVE PRCS,162,Cardiac valve procedures w AMI or complex PDX,05,Diseases and Disorders of the Circulatory System,3,Major,Major,Surgical,Private Health Insurance,,,,N,N,415388.35,125421.25
New York City,Manhattan,7002053,001463,NYU Langone Hospitals,50 to 69,112,M,Other Race,Not Span/Hispanic,13,Emergency,Home or Self Care,2017,115,Aortic; peripheral; and visceral artery aneurysms,043,HEART VALVE PRCS,162,Cardiac valve procedures w AMI or complex PDX,05,Diseases and Disorders of the Circulatory System,3,Major,Extreme,Surgical,Medicaid,,,,N,Y,616779.61,161174.33
New York City,Manhattan,7002053,001463,NYU Langone Hospitals,50 to 69,112,M,Other Race,Not Span/Hispanic,10,Emergency,Home or Self Care,2017,237,Complication of device; implant or graft,043,HEART VALVE PRCS,162,Cardiac valve procedures w AMI or complex PDX,05,Diseases and Disorders of the Circulatory System,3,Major,Moderate,Surgical,Medicaid,,,,N,Y,314875.24,95689.86