Hospital Service Area,Hospital County,Operating Certificate Number,Permanent Facility Id,Facility Name,Age Group,Zip Code - 3 digits,Gender,Race,Ethnicity,Length of Stay,Type of Admission,Patient Disposition,Discharge Year,CCS Diagnosis Code,CCS Diagnosis Description,CCS Procedure Code,CCS Procedure Description,APR DRG Code,APR DRG Description,APR MDC Code,APR MDC Description,APR Severity of Illness Code,APR Severity of Illness Description,APR Risk of Mortality,APR Medical Surgical Description,Payment Typology 1,Payment Typology 2,Payment Typology 3,Birth Weight,Abortion Edit Indicator,Emergency Department Indicator,Total Charges,Total Costs
Long Island,Nassau,2908000,000511,NYU Winthrop Hospital,70 or Older,117,F,White,Not Span/Hispanic,10,Elective,Home w/ Home Health Services,2017,237,Complication of device; implant or graft,043,HEART VALVE PRCS,162,Cardiac valve procedures w AMI or complex PDX,05,Diseases and Disorders of the Circulatory System,3,Major,Major,Surgical,Medicare,Medicare,,,N,N,305885.96,76003.13
Long Island,Nassau,2908000,000511,NYU Winthrop Hospital,50 to 69,118,M,White,Not Span/Hispanic,6,Elective,Home w/ Home Health Services,2017,115,Aortic; peripheral; and visceral artery aneurysms,043,HEART VALVE PRCS,162,Cardiac valve procedures w AMI or complex PDX,05,Diseases and Disorders of the Circulatory System,2,Moderate,Moderate,Surgical,Blue Cross/Blue Shield,Medicare,,,N,N,257806.89,63547.49
Long Island,Nassau,2908000,000511,NYU Winthrop Hospital,70 or Older,119,F,White,Not Span/Hispanic,8,Elective,Home w/ Home Health Services,2017,237,Complication of device; implant or graft,043,HEART VALVE PRCS,162,Cardiac valve procedures w AMI or complex PDX,05,Diseases and Disorders of the Circulatory System,3,Major,Moderate,Surgical,Medicare,Medicare,Blue Cross/Blue Shield,,N,N,224103.20,56736.28
Long Island,Nassau,2908000,000511,NYU Winthrop Hospital,50 to 69,115,F,White,Not Span/Hispanic,27,Emergency,Inpatient Rehabilitation Facility,2017,115,Aortic; peripheral; and visceral artery aneurysms,061,OT OR PRCS VES NOT HEAD,162,Cardiac valve procedures w AMI or complex PDX,05,Diseases and Disorders of the Circulatory System,4,Extreme,Extreme,Surgical,Private Health Insurance,,,,N,Y,626438.90,118145.75
Long Island,Nassau,2908000,000511,NYU Winthrop Hospital,50 to 69,117,F,Other Race,Spanish/Hispanic,20,Emergency,Home w/ Home Health Services,2017,099,Hypertension with complications and secondary hypertension,043,HEART VALVE PRCS,162,Cardiac valve procedures w AMI or complex PDX,05,Diseases and Disorders of the Circulatory System,3,Major,Major,Surgical,Medicare,Medicare,Medicaid,,N,Y,851567.03,188087.60
Long Island,Nassau,2908000,000511,NYU Winthrop Hospital,30 to 49,115,M,White,Not Span/Hispanic,14,Emergency,Home w/ Home Health Services,2017,237,Complication of device; implant or graft,061,OT OR PRCS VES NOT HEAD,162,Cardiac valve procedures w AMI or complex PDX,05,Diseases and Disorders of the Circulatory System,3,Major,Major,Surgical,Private Health Insurance,,,,N,Y,613187.33,137556.63
Long Island,Nassau,2908000,000511,NYU Winthrop Hospital,70 or Older,115,F,White,Not Span/Hispanic,4,Emergency,Home or Self Care,2017,237,Complication of device; implant or graft,043,HEART VALVE PRCS,162,Cardiac valve procedures w AMI or complex PDX,05,Diseases and Disorders of the Circulatory System,3,Major,Major,Surgical,Medicare,Medicare,,,N,Y,332013.32,80594.42
Long Island,Nassau,2908000,000511,NYU Winthrop Hospital,50 to 69,115,F,Black/African American,Spanish/Hispanic,17,Emergency,Home w/ Home Health Services,2017,100,Acute myocardial infarction,044,COR ARTERY BYP GRF-CABG,162,Cardiac valve procedures w AMI or complex PDX,05,Diseases and Disorders of the Circulatory System,3,Major,Major,Surgical,Blue Cross/Blue Shield,,,,N,Y,482353.23,106974.24
Long Island,Nassau,2908000,000511,NYU Winthrop Hospital,50 to 69,117,M,White,Not Span/Hispanic,7,Urgent,Home or Self Care,2017,100,Acute myocardial infarction,043,HEART VALVE PRCS,162,Cardiac valve procedures w AMI or complex PDX,05,Diseases and Disorders of the Circulatory System,3,Major,Major,Surgical,Private Health Insurance,Medicare,,,N,N,354060.09,86683.73
Long Island,Nassau,2908000,000511,NYU Winthrop Hospital,50 to 69,117,M,White,Not Span/Hispanic,13,Emergency,Home w/ Home Health Services,2017,100,Acute myocardial infarction,043,HEART VALVE PRCS,162,Cardiac valve procedures w AMI or complex PDX,05,Diseases and Disorders of the Circulatory System,3,Major,Moderate,Surgical,Medicare,Medicare,,,N,Y,342620.82,84343.06
Long Island,Nassau,2908000,000511,NYU Winthrop Hospital,70 or Older,115,F,White,Not Span/Hispanic,13,Elective,Home w/ Home Health Services,2017,115,Aortic; peripheral; and visceral artery aneurysms,043,HEART VALVE PRCS,162,Cardiac valve procedures w AMI or complex PDX,05,Diseases and Disorders of the Circulatory System,3,Major,Major,Surgical,Medicare,Medicare,Self-Pay,,N,N,600432.81,139562.17
Long Island,Nassau,2908000,000511,NYU Winthrop Hospital,50 to 69,115,F,Black/African American,Not Span/Hispanic,10,Emergency,Home w/ Home Health Services,2017,237,Complication of device; implant or graft,043,HEART VALVE PRCS,162,Cardiac valve procedures w AMI or complex PDX,05,Diseases and Disorders of the Circulatory System,3,Major,Extreme,Surgical,Medicare,Medicare,,,N,Y,447816.26,107527.91
Long Island,Nassau,2908000,000511,NYU Winthrop Hospital,50 to 69,117,F,White,Not Span/Hispanic,14,Urgent,Home w/ Home Health Services,2017,099,Hypertension with complications and secondary hypertension,043,HEART VALVE PRCS,162,Cardiac valve procedures w AMI or complex PDX,05,Diseases and Disorders of the Circulatory System,3,Major,Major,Surgical,Blue Cross/Blue Shield,Medicare,,,N,N,301170.92,75973.37
Long Island,Nassau,2908000,000511,NYU Winthrop Hospital,70 or Older,119,M,White,Not Span/Hispanic,8,Elective,Home w/ Home Health Services,2017,115,Aortic; peripheral; and visceral artery aneurysms,043,HEART VALVE PRCS,162,Cardiac valve procedures w AMI or complex PDX,05,Diseases and Disorders of the Circulatory System,3,Major,Major,Surgical,Medicare,Medicare,Private Health Insurance,,N,N,349408.08,83376.25
Long Island,Nassau,2908000,000511,NYU Winthrop Hospital,70 or Older,115,M,White,Not Span/Hispanic,13,Urgent,Home or Self Care,2017,237,Complication of device; implant or graft,043,HEART VALVE PRCS,162,Cardiac valve procedures w AMI or complex PDX,05,Diseases and Disorders of the Circulatory System,3,Major,Major,Surgical,Medicare,Medicare,Blue Cross/Blue Shield,,N,N,567388.60,142017.53
Long Island,Nassau,2908000,000511,NYU Winthrop Hospital,70 or Older,117,M,White,Not Span/Hispanic,12,Elective,Home w/ Home Health Services,2017,115,Aortic; peripheral; and visceral artery aneurysms,043,HEART VALVE PRCS,162,Cardiac valve procedures w AMI or complex PDX,05,Diseases and Disorders of the Circulatory System,1,Minor,Moderate,Surgical,Medicare,Medicare,Private Health Insurance,,N,N,490695.06,113768.67
Long Island,Nassau,2908000,000511,NYU Winthrop Hospital,70 or Older,117,F,White,Not Span/Hispanic,13,Elective,Skilled Nursing Home,2017,115,Aortic; peripheral; and visceral artery aneurysms,061,OT OR PRCS VES NOT HEAD,162,Cardiac valve procedures w AMI or complex PDX,05,Diseases and Disorders of the Circulatory System,3,Major,Major,Surgical,Medicare,Medicare,Private Health Insurance,,N,N,594148.96,141580.87
Long Island,Nassau,2908000,000511,NYU Winthrop Hospital,70 or Older,110,M,White,Not Span/Hispanic,8,Emergency,Expired,2017,115,Aortic; peripheral; and visceral artery aneurysms,061,OT OR PRCS VES NOT HEAD,162,Cardiac valve procedures w AMI or complex PDX,05,Diseases and Disorders of the Circulatory System,4,Extreme,Extreme,Surgical,Medicare,Medicare,Private Health Insurance,,N,Y,1225700.26,267927.63
Long Island,Nassau,2908000,000511,NYU Winthrop Hospital,70 or Older,117,M,White,Not Span/Hispanic,13,Elective,Home or Self Care,2017,237,Complication of device; implant or graft,043,HEART VALVE PRCS,162,Cardiac valve procedures w AMI or complex PDX,05,Diseases and Disorders of the Circulatory System,3,Major,Major,Surgical,Medicare,Medicare,Blue Cross/Blue Shield,,N,N,633439.10,153239.68
Long Island,Nassau,2908000,000511,NYU Winthrop Hospital,70 or Older,110,F,White,Not Span/Hispanic,2,Elective,Home or Self Care,2017,237,Complication of device; implant or graft,043,HEART VALVE PRCS,162,Cardiac valve procedures w AMI or complex PDX,05,Diseases and Disorders of the Circulatory System,2,Moderate,Moderate,Surgical,Medicare,Medicare,Blue Cross/Blue Shield,,N,N,374861.65,94629.64
Long Island,Nassau,2908000,000511,NYU Winthrop Hospital,50 to 69,115,M,White,Not Span/Hispanic,20,Emergency,Home w/ Home Health Services,2017,237,Complication of device; implant or graft,043,HEART VALVE PRCS,162,Cardiac valve procedures w AMI or complex PDX,05,Diseases and Disorders of the Circulatory System,4,Extreme,Extreme,Surgical,Blue Cross/Blue Shield,,,,N,Y,785235.57,198573.73
Long Island,Nassau,2908000,000511,NYU Winthrop Hospital,50 to 69,115,M,Black/African American,Not Span/Hispanic,9,Urgent,Home w/ Home Health Services,2017,100,Acute myocardial infarction,044,COR ARTERY BYP GRF-CABG,162,Cardiac valve procedures w AMI or complex PDX,05,Diseases and Disorders of the Circulatory System,2,Moderate,Moderate,Surgical,Private Health Insurance,Medicare,,,N,N,297757.56,80701.95
Long Island,Nassau,2908000,000511,NYU Winthrop Hospital,30 to 49,115,M,Black/African American,Not Span/Hispanic,22,Emergency,Skilled Nursing Home,2017,100,Acute myocardial infarction,043,HEART VALVE PRCS,162,Cardiac valve procedures w AMI or complex PDX,05,Diseases and Disorders of the Circulatory System,3,Major,Major,Surgical,Medicare,Medicare,Medicaid,,N,Y,603957.92,152263.80
