Hospital Service Area,Hospital County,Operating Certificate Number,Permanent Facility Id,Facility Name,Age Group,Zip Code - 3 digits,Gender,Race,Ethnicity,Length of Stay,Type of Admission,Patient Disposition,Discharge Year,CCS Diagnosis Code,CCS Diagnosis Description,CCS Procedure Code,CCS Procedure Description,APR DRG Code,APR DRG Description,APR MDC Code,APR MDC Description,APR Severity of Illness Code,APR Severity of Illness Description,APR Risk of Mortality,APR Medical Surgical Description,Payment Typology 1,Payment Typology 2,Payment Typology 3,Birth Weight,Abortion Edit Indicator,Emergency Department Indicator,Total Charges,Total Costs
Long Island,Nassau,2908000,000511,NYU Langone Hospital-Long Island,50 to 69,117,F,White,Not Span/Hispanic,26,Urgent,Home w/ Home Health Services,2019,INJ033,"COMPLICATION OF CARDIOVASCULAR DEVICE, IMPLANT OR GRAFT, INITIAL ENCOUNTER",CAR022,HEART VALVE REPLACEMENT AND OTHER VALVE PROCEDURES (NON-ENDOVASCULAR),162,CARDIAC VALVE PROCEDURES W AMI OR COMPLEX PDX,05,DISEASES AND DISORDERS OF THE CIRCULATORY SYSTEM,3,Major,Major,Surgical,Medicare,Medicare,,,,false,566964.82,94325.54
Long Island,Nassau,2908000,000511,NYU Langone Hospital-Long Island,30 to 49,117,M,White,Not Span/Hispanic,4,Emergency,Home w/ Home Health Services,2019,CIR027,ARTERIAL DISSECTIONS,CAR012,VESSEL REPAIR AND REPLACEMENT,162,CARDIAC VALVE PROCEDURES W AMI OR COMPLEX PDX,05,DISEASES AND DISORDERS OF THE CIRCULATORY SYSTEM,1,Minor,Major,Surgical,Blue Cross/Blue Shield,,,,,true,313708.41,46108.5
Long Island,Nassau,2908000,000511,NYU Langone Hospital-Long Island,50 to 69,117,F,Black/African American,Not Span/Hispanic,25,Urgent,Skilled Nursing Home,2019,INJ033,"COMPLICATION OF CARDIOVASCULAR DEVICE, IMPLANT OR GRAFT, INITIAL ENCOUNTER",CAR022,HEART VALVE REPLACEMENT AND OTHER VALVE PROCEDURES (NON-ENDOVASCULAR),162,CARDIAC VALVE PROCEDURES W AMI OR COMPLEX PDX,05,DISEASES AND DISORDERS OF THE CIRCULATORY SYSTEM,4,Extreme,Extreme,Surgical,Federal/State/Local/VA,,,,,false,711779.98,118016.41
Long Island,Nassau,2908000,000511,NYU Langone Hospital-Long Island,50 to 69,114,M,Black/African American,Not Span/Hispanic,8,Elective,Home w/ Home Health Services,2019,INJ033,"COMPLICATION OF CARDIOVASCULAR DEVICE, IMPLANT OR GRAFT, INITIAL ENCOUNTER",CAR022,HEART VALVE REPLACEMENT AND OTHER VALVE PROCEDURES (NON-ENDOVASCULAR),162,CARDIAC VALVE PROCEDURES W AMI OR COMPLEX PDX,05,DISEASES AND DISORDERS OF THE CIRCULATORY SYSTEM,3,Major,Extreme,Surgical,Medicare,Medicare,,,,false,567394.68,85171.74
Long Island,Nassau,2908000,000511,NYU Langone Hospital-Long Island,50 to 69,117,F,White,Not Span/Hispanic,15,Emergency,Skilled Nursing Home,2019,INJ033,"COMPLICATION OF CARDIOVASCULAR DEVICE, IMPLANT OR GRAFT, INITIAL ENCOUNTER",CAR022,HEART VALVE REPLACEMENT AND OTHER VALVE PROCEDURES (NON-ENDOVASCULAR),162,CARDIAC VALVE PROCEDURES W AMI OR COMPLEX PDX,05,DISEASES AND DISORDERS OF THE CIRCULATORY SYSTEM,4,Extreme,Extreme,Surgical,Medicare,Medicare,Private Health Insurance,,,true,688701.84,105531.44
Long Island,Nassau,2908000,000511,NYU Langone Hospital-Long Island,70 or Older,115,M,White,Not Span/Hispanic,14,Emergency,Skilled Nursing Home,2019,CIR004,ENDOCARDITIS AND ENDOCARDIAL DISEASE,CAR022,HEART VALVE REPLACEMENT AND OTHER VALVE PROCEDURES (NON-ENDOVASCULAR),162,CARDIAC VALVE PROCEDURES W AMI OR COMPLEX PDX,05,DISEASES AND DISORDERS OF THE CIRCULATORY SYSTEM,4,Extreme,Major,Surgical,Medicare,Medicare,,,,true,681540.94,102014.56
Long Island,Nassau,2908000,000511,NYU Langone Hospital-Long Island,50 to 69,115,F,White,Not Span/Hispanic,27,Emergency,Home w/ Home Health Services,2019,CIR009,ACUTE MYOCARDIAL INFARCTION,CAR022,HEART VALVE REPLACEMENT AND OTHER VALVE PROCEDURES (NON-ENDOVASCULAR),162,CARDIAC VALVE PROCEDURES W AMI OR COMPLEX PDX,05,DISEASES AND DISORDERS OF THE CIRCULATORY SYSTEM,4,Extreme,Extreme,Surgical,Medicare,Medicare,,,,true,722738.5,122762.81
Long Island,Nassau,2908000,000511,NYU Langone Hospital-Long Island,30 to 49,119,F,White,Not Span/Hispanic,21,Urgent,Left Against Medical Advice,2019,CIR004,ENDOCARDITIS AND ENDOCARDIAL DISEASE,CAR022,HEART VALVE REPLACEMENT AND OTHER VALVE PROCEDURES (NON-ENDOVASCULAR),162,CARDIAC VALVE PROCEDURES W AMI OR COMPLEX PDX,05,DISEASES AND DISORDERS OF THE CIRCULATORY SYSTEM,4,Extreme,Extreme,Surgical,Medicaid,Medicaid,,,,false,372082.34,68128.13
Long Island,Nassau,2908000,000511,NYU Langone Hospital-Long Island,70 or Older,115,M,White,Not Span/Hispanic,2,Elective,Home or Self Care,2019,INJ033,"COMPLICATION OF CARDIOVASCULAR DEVICE, IMPLANT OR GRAFT, INITIAL ENCOUNTER",CAR023,HEART VALVE REPLACEMENT AND OTHER VALVE PROCEDURES (ENDOVASCULAR),162,CARDIAC VALVE PROCEDURES W AMI OR COMPLEX PDX,05,DISEASES AND DISORDERS OF THE CIRCULATORY SYSTEM,2,Moderate,Major,Surgical,Medicare,Medicare,Blue Cross/Blue Shield,,,false,400311.32,64313.73
Long Island,Nassau,2908000,000511,NYU Langone Hospital-Long Island,70 or Older,115,M,White,Not Span/Hispanic,23,Emergency,Inpatient Rehabilitation Facility,2019,CIR004,ENDOCARDITIS AND ENDOCARDIAL DISEASE,CAR012,VESSEL REPAIR AND REPLACEMENT,162,CARDIAC VALVE PROCEDURES W AMI OR COMPLEX PDX,05,DISEASES AND DISORDERS OF THE CIRCULATORY SYSTEM,4,Extreme,Extreme,Surgical,Medicare,Medicare,Blue Cross/Blue Shield,,,true,871982,132277.95
Long Island,Nassau,2908000,000511,NYU Langone Hospital-Long Island,70 or Older,115,M,Other Race,Spanish/Hispanic,9,Emergency,Home w/ Home Health Services,2019,CIR009,ACUTE MYOCARDIAL INFARCTION,CAR003,CORONARY ARTERY BYPASS GRAFTS (CABG),162,CARDIAC VALVE PROCEDURES W AMI OR COMPLEX PDX,05,DISEASES AND DISORDERS OF THE CIRCULATORY SYSTEM,3,Major,Major,Surgical,Private Health Insurance,Medicare,,,,true,429309.86,67767.96
Long Island,Nassau,2908000,000511,NYU Langone Hospital-Long Island,50 to 69,104,M,Black/African American,Not Span/Hispanic,6,Urgent,Home w/ Home Health Services,2019,CIR027,ARTERIAL DISSECTIONS,CAR022,HEART VALVE REPLACEMENT AND OTHER VALVE PROCEDURES (NON-ENDOVASCULAR),162,CARDIAC VALVE PROCEDURES W AMI OR COMPLEX PDX,05,DISEASES AND DISORDERS OF THE CIRCULATORY SYSTEM,3,Major,Major,Surgical,Medicaid,Medicaid,,,,false,366402.11,55363.43
Long Island,Nassau,2908000,000511,NYU Langone Hospital-Long Island,50 to 69,117,M,White,Not Span/Hispanic,1,Emergency,Expired,2019,CIR027,ARTERIAL DISSECTIONS,CAR022,HEART VALVE REPLACEMENT AND OTHER VALVE PROCEDURES (NON-ENDOVASCULAR),162,CARDIAC VALVE PROCEDURES W AMI OR COMPLEX PDX,05,DISEASES AND DISORDERS OF THE CIRCULATORY SYSTEM,4,Extreme,Extreme,Surgical,Medicaid,Medicaid,,,,true,315832.08,44817.36
Long Island,Nassau,2908000,000511,NYU Langone Hospital-Long Island,50 to 69,118,F,White,Not Span/Hispanic,5,Elective,Home w/ Home Health Services,2019,INJ033,"COMPLICATION OF CARDIOVASCULAR DEVICE, IMPLANT OR GRAFT, INITIAL ENCOUNTER",CAR022,HEART VALVE REPLACEMENT AND OTHER VALVE PROCEDURES (NON-ENDOVASCULAR),162,CARDIAC VALVE PROCEDURES W AMI OR COMPLEX PDX,05,DISEASES AND DISORDERS OF THE CIRCULATORY SYSTEM,3,Major,Major,Surgical,Blue Cross/Blue Shield,,,,,false,266575.29,43411.29
Long Island,Nassau,2908000,000511,NYU Langone Hospital-Long Island,50 to 69,117,M,White,Not Span/Hispanic,7,Elective,Home w/ Home Health Services,2019,INJ033,"COMPLICATION OF CARDIOVASCULAR DEVICE, IMPLANT OR GRAFT, INITIAL ENCOUNTER",CAR022,HEART VALVE REPLACEMENT AND OTHER VALVE PROCEDURES (NON-ENDOVASCULAR),162,CARDIAC VALVE PROCEDURES W AMI OR COMPLEX PDX,05,DISEASES AND DISORDERS OF THE CIRCULATORY SYSTEM,2,Moderate,Moderate,Surgical,Blue Cross/Blue Shield,,,,,false,311239.52,51137.54
Long Island,Nassau,2908000,000511,NYU Langone Hospital-Long Island,70 or Older,110,F,White,Not Span/Hispanic,22,Emergency,Skilled Nursing Home,2019,INJ033,"COMPLICATION OF CARDIOVASCULAR DEVICE, IMPLANT OR GRAFT, INITIAL ENCOUNTER",CAR023,HEART VALVE REPLACEMENT AND OTHER VALVE PROCEDURES (ENDOVASCULAR),162,CARDIAC VALVE PROCEDURES W AMI OR COMPLEX PDX,05,DISEASES AND DISORDERS OF THE CIRCULATORY SYSTEM,3,Major,Major,Surgical,Medicare,Medicare,Private Health Insurance,,,true,891477.27,149383.83
Long Island,Nassau,2908000,000511,NYU Langone Hospital-Long Island,70 or Older,115,M,White,Not Span/Hispanic,12,Emergency,Home w/ Home Health Services,2019,CIR027,ARTERIAL DISSECTIONS,CAR022,HEART VALVE REPLACEMENT AND OTHER VALVE PROCEDURES (NON-ENDOVASCULAR),162,CARDIAC VALVE PROCEDURES W AMI OR COMPLEX PDX,05,DISEASES AND DISORDERS OF THE CIRCULATORY SYSTEM,3,Major,Major,Surgical,Medicare,Medicare,,,,true,462646.06,74051.13
Long Island,Nassau,2908000,000511,NYU Langone Hospital-Long Island,70 or Older,117,F,White,Not Span/Hispanic,4,Elective,Home w/ Home Health Services,2019,INJ033,"COMPLICATION OF CARDIOVASCULAR DEVICE, IMPLANT OR GRAFT, INITIAL ENCOUNTER",ADM001,TRANSFUSION OF BLOOD AND BLOOD PRODUCTS,162,CARDIAC VALVE PROCEDURES W AMI OR COMPLEX PDX,05,DISEASES AND DISORDERS OF THE CIRCULATORY SYSTEM,4,Extreme,Major,Surgical,Medicare,Medicare,,,,false,288779.2,42333.02
Long Island,Nassau,2908000,000511,NYU Langone Hospital-Long Island,70 or Older,117,M,White,Not Span/Hispanic,10,Elective,Home w/ Home Health Services,2019,CIR009,ACUTE MYOCARDIAL INFARCTION,CAR003,CORONARY ARTERY BYPASS GRAFTS (CABG),162,CARDIAC VALVE PROCEDURES W AMI OR COMPLEX PDX,05,DISEASES AND DISORDERS OF THE CIRCULATORY SYSTEM,3,Major,Major,Surgical,Medicare,,,,,false,376097.89,57943.01
Long Island,Nassau,2908000,000511,NYU Langone Hospital-Long Island,70 or Older,119,M,White,Not Span/Hispanic,34,Urgent,Home w/ Home Health Services,2019,INJ033,"COMPLICATION OF CARDIOVASCULAR DEVICE, IMPLANT OR GRAFT, INITIAL ENCOUNTER",CAR022,HEART VALVE REPLACEMENT AND OTHER VALVE PROCEDURES (NON-ENDOVASCULAR),162,CARDIAC VALVE PROCEDURES W AMI OR COMPLEX PDX,05,DISEASES AND DISORDERS OF THE CIRCULATORY SYSTEM,4,Extreme,Extreme,Surgical,Medicare,Private Health Insurance,,,,false,1162210.01,189278.87
