Hospital Service Area,Hospital County,Operating Certificate Number,Permanent Facility Id,Facility Name,Age Group,Zip Code - 3 digits,Gender,Race,Ethnicity,Length of Stay,Type of Admission,Patient Disposition,Discharge Year,CCS Diagnosis Code,CCS Diagnosis Description,CCS Procedure Code,CCS Procedure Description,APR DRG Code,APR DRG Description,APR MDC Code,APR MDC Description,APR Severity of Illness Code,APR Severity of Illness Description,APR Risk of Mortality,APR Medical Surgical Description,Payment Typology 1,Payment Typology 2,Payment Typology 3,Birth Weight,Abortion Edit Indicator,Emergency Department Indicator,Total Charges,Total Costs
New York City,Manhattan,7002001,001438,Bellevue Hospital Center,50 to 69,104,F,Black/African American,Unknown,43,Urgent,Skilled Nursing Home,2020,INJ033,"COMPLICATION OF CARDIOVASCULAR DEVICE, IMPLANT OR GRAFT, INITIAL ENCOUNTER",CAR022,HEART VALVE REPLACEMENT AND OTHER VALVE PROCEDURES (NON-ENDOVASCULAR),162,CARDIAC VALVE PROCEDURES W AMI OR COMPLEX PDX,05,DISEASES AND DISORDERS OF THE CIRCULATORY SYSTEM,4,Extreme,Extreme,Surgical,Medicare,Medicaid,,,,N,500378.62,287759.74
New York City,Manhattan,7002001,001438,Bellevue Hospital Center,30 to 49,104,M,Black/African American,Not Span/Hispanic,14,Urgent,Home w/ Home Health Services,2020,CIR027,ARTERIAL DISSECTIONS,CAR012,VESSEL REPAIR AND REPLACEMENT,162,CARDIAC VALVE PROCEDURES W AMI OR COMPLEX PDX,05,DISEASES AND DISORDERS OF THE CIRCULATORY SYSTEM,3,Major,Major,Surgical,Self-Pay,,,,,N,165789.61,95342.95
New York City,Manhattan,7002001,001438,Bellevue Hospital Center,50 to 69,,F,Other Race,Not Span/Hispanic,14,Emergency,Home or Self Care,2020,INJ033,"COMPLICATION OF CARDIOVASCULAR DEVICE, IMPLANT OR GRAFT, INITIAL ENCOUNTER",CAR022,HEART VALVE REPLACEMENT AND OTHER VALVE PROCEDURES (NON-ENDOVASCULAR),162,CARDIAC VALVE PROCEDURES W AMI OR COMPLEX PDX,05,DISEASES AND DISORDERS OF THE CIRCULATORY SYSTEM,2,Moderate,Major,Surgical,Medicaid,,,,,Y,285729.94,164318.72
New York City,Manhattan,7002001,001438,Bellevue Hospital Center,50 to 69,113,M,Other Race,Spanish/Hispanic,39,Urgent,Home or Self Care,2020,CIR004,ENDOCARDITIS AND ENDOCARDIAL DISEASE,CAR022,HEART VALVE REPLACEMENT AND OTHER VALVE PROCEDURES (NON-ENDOVASCULAR),162,CARDIAC VALVE PROCEDURES W AMI OR COMPLEX PDX,05,DISEASES AND DISORDERS OF THE CIRCULATORY SYSTEM,4,Extreme,Extreme,Surgical,Medicaid,,,,,N,401294.61,230778.11
New York City,Manhattan,7002001,001438,Bellevue Hospital Center,30 to 49,114,M,Other Race,Not Span/Hispanic,13,Urgent,Home or Self Care,2020,CIR004,ENDOCARDITIS AND ENDOCARDIAL DISEASE,CAR022,HEART VALVE REPLACEMENT AND OTHER VALVE PROCEDURES (NON-ENDOVASCULAR),162,CARDIAC VALVE PROCEDURES W AMI OR COMPLEX PDX,05,DISEASES AND DISORDERS OF THE CIRCULATORY SYSTEM,2,Moderate,Moderate,Surgical,Medicaid,,,,,N,226758.19,130405.01
New York City,Manhattan,7002001,001438,Bellevue Hospital Center,30 to 49,114,M,Other Race,Not Span/Hispanic,23,Emergency,Home w/ Home Health Services,2020,INJ033,"COMPLICATION OF CARDIOVASCULAR DEVICE, IMPLANT OR GRAFT, INITIAL ENCOUNTER",CAR022,HEART VALVE REPLACEMENT AND OTHER VALVE PROCEDURES (NON-ENDOVASCULAR),162,CARDIAC VALVE PROCEDURES W AMI OR COMPLEX PDX,05,DISEASES AND DISORDERS OF THE CIRCULATORY SYSTEM,3,Major,Major,Surgical,Medicaid,,,,,Y,400821.16,230505.84
New York City,Manhattan,7002001,001438,Bellevue Hospital Center,70 or Older,112,M,Other Race,Not Span/Hispanic,27,Emergency,Inpatient Rehabilitation Facility,2020,INJ033,"COMPLICATION OF CARDIOVASCULAR DEVICE, IMPLANT OR GRAFT, INITIAL ENCOUNTER",CAR022,HEART VALVE REPLACEMENT AND OTHER VALVE PROCEDURES (NON-ENDOVASCULAR),162,CARDIAC VALVE PROCEDURES W AMI OR COMPLEX PDX,05,DISEASES AND DISORDERS OF THE CIRCULATORY SYSTEM,3,Major,Major,Surgical,Medicaid,,,,,Y,403536.06,232067.13
New York City,Manhattan,7002001,001438,Bellevue Hospital Center,50 to 69,114,M,Black/African American,Not Span/Hispanic,11,Urgent,Inpatient Rehabilitation Facility,2020,CIR027,ARTERIAL DISSECTIONS,CAR022,HEART VALVE REPLACEMENT AND OTHER VALVE PROCEDURES (NON-ENDOVASCULAR),162,CARDIAC VALVE PROCEDURES W AMI OR COMPLEX PDX,05,DISEASES AND DISORDERS OF THE CIRCULATORY SYSTEM,3,Major,Major,Surgical,Medicaid,,,,,N,211210.31,121463.67
New York City,Manhattan,7002001,001438,Bellevue Hospital Center,50 to 69,112,M,Black/African American,Not Span/Hispanic,40,Urgent,Skilled Nursing Home,2020,INJ033,"COMPLICATION OF CARDIOVASCULAR DEVICE, IMPLANT OR GRAFT, INITIAL ENCOUNTER",CAR022,HEART VALVE REPLACEMENT AND OTHER VALVE PROCEDURES (NON-ENDOVASCULAR),162,CARDIAC VALVE PROCEDURES W AMI OR COMPLEX PDX,05,DISEASES AND DISORDERS OF THE CIRCULATORY SYSTEM,4,Extreme,Extreme,Surgical,Self-Pay,,,,,N,420478.89,241810.68
New York City,Manhattan,7002001,001438,Bellevue Hospital Center,30 to 49,112,F,Black/African American,Not Span/Hispanic,24,Urgent,Home w/ Home Health Services,2020,CIR004,ENDOCARDITIS AND ENDOCARDIAL DISEASE,CAR022,HEART VALVE REPLACEMENT AND OTHER VALVE PROCEDURES (NON-ENDOVASCULAR),162,CARDIAC VALVE PROCEDURES W AMI OR COMPLEX PDX,05,DISEASES AND DISORDERS OF THE CIRCULATORY SYSTEM,4,Extreme,Major,Surgical,Medicaid,,,,,N,274380.29,157791.71
New York City,Manhattan,7002001,001438,Bellevue Hospital Center,30 to 49,104,M,Other Race,Spanish/Hispanic,43,Urgent,Home or Self Care,2020,CIR004,ENDOCARDITIS AND ENDOCARDIAL DISEASE,CAR022,HEART VALVE REPLACEMENT AND OTHER VALVE PROCEDURES (NON-ENDOVASCULAR),162,CARDIAC VALVE PROCEDURES W AMI OR COMPLEX PDX,05,DISEASES AND DISORDERS OF THE CIRCULATORY SYSTEM,4,Extreme,Extreme,Surgical,Medicaid,,,,,N,426276.12,245144.58
New York City,Manhattan,7002001,001438,Bellevue Hospital Center,50 to 69,100,F,Other Race,Not Span/Hispanic,17,Emergency,Home w/ Home Health Services,2020,CIR027,ARTERIAL DISSECTIONS,CAR022,HEART VALVE REPLACEMENT AND OTHER VALVE PROCEDURES (NON-ENDOVASCULAR),162,CARDIAC VALVE PROCEDURES W AMI OR COMPLEX PDX,05,DISEASES AND DISORDERS OF THE CIRCULATORY SYSTEM,3,Major,Extreme,Surgical,Medicaid,,,,,Y,374473.67,215353.82
New York City,Manhattan,7002001,001438,Bellevue Hospital Center,50 to 69,112,M,Other Race,Spanish/Hispanic,27,Emergency,Home or Self Care,2020,INJ033,"COMPLICATION OF CARDIOVASCULAR DEVICE, IMPLANT OR GRAFT, INITIAL ENCOUNTER",CAR009,LEFT ATRIAL APPENDAGE PROCEDURES,162,CARDIAC VALVE PROCEDURES W AMI OR COMPLEX PDX,05,DISEASES AND DISORDERS OF THE CIRCULATORY SYSTEM,4,Extreme,Extreme,Surgical,Medicaid,,,,,Y,318638.33,183243.81
New York City,Manhattan,7002001,001438,Bellevue Hospital Center,30 to 49,100,M,White,Not Span/Hispanic,63,Emergency,Expired,2020,INJ033,"COMPLICATION OF CARDIOVASCULAR DEVICE, IMPLANT OR GRAFT, INITIAL ENCOUNTER",CAR022,HEART VALVE REPLACEMENT AND OTHER VALVE PROCEDURES (NON-ENDOVASCULAR),162,CARDIAC VALVE PROCEDURES W AMI OR COMPLEX PDX,05,DISEASES AND DISORDERS OF THE CIRCULATORY SYSTEM,4,Extreme,Extreme,Surgical,Medicaid,,,,,Y,1445433.05,831245.42
New York City,Manhattan,7002001,001438,Bellevue Hospital Center,70 or Older,112,M,Other Race,Spanish/Hispanic,26,Urgent,Skilled Nursing Home,2020,CIR027,ARTERIAL DISSECTIONS,CAR012,VESSEL REPAIR AND REPLACEMENT,162,CARDIAC VALVE PROCEDURES W AMI OR COMPLEX PDX,05,DISEASES AND DISORDERS OF THE CIRCULATORY SYSTEM,3,Major,Major,Surgical,Medicaid,,,,,N,572008.9,328953.17
New York City,Manhattan,7002001,001438,Bellevue Hospital Center,50 to 69,100,M,Black/African American,Not Span/Hispanic,36,Emergency,Inpatient Rehabilitation Facility,2020,INJ033,"COMPLICATION OF CARDIOVASCULAR DEVICE, IMPLANT OR GRAFT, INITIAL ENCOUNTER",CAR022,HEART VALVE REPLACEMENT AND OTHER VALVE PROCEDURES (NON-ENDOVASCULAR),162,CARDIAC VALVE PROCEDURES W AMI OR COMPLEX PDX,05,DISEASES AND DISORDERS OF THE CIRCULATORY SYSTEM,4,Extreme,Extreme,Surgical,Medicaid,,,,,Y,613556.75,352846.67
New York City,Manhattan,7002001,001438,Bellevue Hospital Center,50 to 69,114,F,Other Race,Spanish/Hispanic,15,Urgent,Expired,2020,CIR004,ENDOCARDITIS AND ENDOCARDIAL DISEASE,CAR022,HEART VALVE REPLACEMENT AND OTHER VALVE PROCEDURES (NON-ENDOVASCULAR),162,CARDIAC VALVE PROCEDURES W AMI OR COMPLEX PDX,05,DISEASES AND DISORDERS OF THE CIRCULATORY SYSTEM,4,Extreme,Extreme,Surgical,Medicare,,,,,N,434395.29,249813.78
New York City,Manhattan,7002001,001438,Bellevue Hospital Center,50 to 69,114,F,Black/African American,Not Span/Hispanic,22,Elective,Home w/ Home Health Services,2020,INJ033,"COMPLICATION OF CARDIOVASCULAR DEVICE, IMPLANT OR GRAFT, INITIAL ENCOUNTER",CAR022,HEART VALVE REPLACEMENT AND OTHER VALVE PROCEDURES (NON-ENDOVASCULAR),162,CARDIAC VALVE PROCEDURES W AMI OR COMPLEX PDX,05,DISEASES AND DISORDERS OF THE CIRCULATORY SYSTEM,3,Major,Major,Surgical,Private Health Insurance,,,,,N,304636.91,175191.81
