Hospital Service Area,Hospital County,Operating Certificate Number,Permanent Facility Id,Facility Name,Age Group,Zip Code - 3 digits,Gender,Race,Ethnicity,Length of Stay,Type of Admission,Patient Disposition,Discharge Year,CCS Diagnosis Code,CCS Diagnosis Description,CCS Procedure Code,CCS Procedure Description,APR DRG Code,APR DRG Description,APR MDC Code,APR MDC Description,APR Severity of Illness Code,APR Severity of Illness Description,APR Risk of Mortality,APR Medical Surgical Description,Payment Typology 1,Payment Typology 2,Payment Typology 3,Birth Weight,Abortion Edit Indicator,Emergency Department Indicator,Total Charges,Total Costs
Long Island,Nassau,2908000,000511,NYU Winthrop Hospital,70 or Older,117,F,White,Not Span/Hispanic,9,Elective,Home w/ Home Health Services,2017,096,Heart valve disorders,043,HEART VALVE PRCS,163,Cardiac valve procedures w/o AMI or complex PDX,05,Diseases and Disorders of the Circulatory System,3,Major,Major,Surgical,Medicare,Medicare,Blue Cross/Blue Shield,,N,N,330065.23,84024.49
Long Island,Nassau,2908000,000511,NYU Winthrop Hospital,50 to 69,115,M,White,Spanish/Hispanic,11,Urgent,Home w/ Home Health Services,2017,096,Heart valve disorders,043,HEART VALVE PRCS,163,Cardiac valve procedures w/o AMI or complex PDX,05,Diseases and Disorders of the Circulatory System,1,Minor,Minor,Surgical,Medicaid,,,,N,N,254763.74,64887.46
Long Island,Nassau,2908000,000511,NYU Winthrop Hospital,50 to 69,115,M,Black/African American,Not Span/Hispanic,26,Emergency,Home w/ Home Health Services,2017,099,Hypertension with complications and secondary hypertension,043,HEART VALVE PRCS,163,Cardiac valve procedures w/o AMI or complex PDX,05,Diseases and Disorders of the Circulatory System,3,Major,Moderate,Surgical,Medicaid,,,,N,Y,738196.63,177966.70
Long Island,Nassau,2908000,000511,NYU Winthrop Hospital,70 or Older,115,M,White,Not Span/Hispanic,11,Emergency,Home or Self Care,2017,096,Heart valve disorders,043,HEART VALVE PRCS,163,Cardiac valve procedures w/o AMI or complex PDX,05,Diseases and Disorders of the Circulatory System,3,Major,Major,Surgical,Medicare,Medicare,Blue Cross/Blue Shield,,N,Y,297420.56,75165.57
Long Island,Nassau,2908000,000511,NYU Winthrop Hospital,70 or Older,110,F,White,Not Span/Hispanic,9,Elective,Home w/ Home Health Services,2017,096,Heart valve disorders,043,HEART VALVE PRCS,163,Cardiac valve procedures w/o AMI or complex PDX,05,Diseases and Disorders of the Circulatory System,3,Major,Major,Surgical,Medicare,Medicare,,,N,N,466288.30,116269.33
Long Island,Nassau,2908000,000511,NYU Winthrop Hospital,70 or Older,115,M,White,Not Span/Hispanic,6,Elective,Home w/ Home Health Services,2017,096,Heart valve disorders,043,HEART VALVE PRCS,163,Cardiac valve procedures w/o AMI or complex PDX,05,Diseases and Disorders of the Circulatory System,2,Moderate,Moderate,Surgical,Medicare,Medicare,,,N,N,270069.63,66125.74
Long Island,Nassau,2908000,000511,NYU Winthrop Hospital,50 to 69,117,M,White,Not Span/Hispanic,4,Elective,Home w/ Home Health Services,2017,096,Heart valve disorders,043,HEART VALVE PRCS,163,Cardiac valve procedures w/o AMI or complex PDX,05,Diseases and Disorders of the Circulatory System,2,Moderate,Minor,Surgical,Private Health Insurance,,,,N,N,161634.71,42009.90
Long Island,Nassau,2908000,000511,NYU Winthrop Hospital,50 to 69,115,F,White,Not Span/Hispanic,7,Elective,Home w/ Home Health Services,2017,096,Heart valve disorders,043,HEART VALVE PRCS,163,Cardiac valve procedures w/o AMI or complex PDX,05,Diseases and Disorders of the Circulatory System,3,Major,Major,Surgical,Medicare,Medicare,Private Health Insurance,,N,N,527179.64,124802.61
Long Island,Nassau,2908000,000511,NYU Winthrop Hospital,50 to 69,114,M,White,Not Span/Hispanic,5,Elective,Home w/ Home Health Services,2017,213,Cardiac and circulatory congenital anomalies,043,HEART VALVE PRCS,163,Cardiac valve procedures w/o AMI or complex PDX,05,Diseases and Disorders of the Circulatory System,2,Moderate,Moderate,Surgical,Private Health Insurance,,,,N,N,354533.75,84246.98
Long Island,Nassau,2908000,000511,NYU Winthrop Hospital,70 or Older,117,M,White,Not Span/Hispanic,4,Elective,Home w/ Home Health Services,2017,096,Heart valve disorders,043,HEART VALVE PRCS,163,Cardiac valve procedures w/o AMI or complex PDX,05,Diseases and Disorders of the Circulatory System,2,Moderate,Moderate,Surgical,Medicare,Medicare,Private Health Insurance,,N,N,275964.56,70417.80
Long Island,Nassau,2908000,000511,NYU Winthrop Hospital,30 to 49,115,F,White,Not Span/Hispanic,4,Elective,Home w/ Home Health Services,2017,096,Heart valve disorders,043,HEART VALVE PRCS,163,Cardiac valve procedures w/o AMI or complex PDX,05,Diseases and Disorders of the Circulatory System,1,Minor,Minor,Surgical,Medicaid,Medicaid,,,N,N,150755.52,40031.42
Long Island,Nassau,2908000,000511,NYU Winthrop Hospital,50 to 69,115,M,White,Not Span/Hispanic,10,Emergency,Home w/ Home Health Services,2017,096,Heart valve disorders,043,HEART VALVE PRCS,163,Cardiac valve procedures w/o AMI or complex PDX,05,Diseases and Disorders of the Circulatory System,3,Major,Moderate,Surgical,Private Health Insurance,,,,N,Y,316699.61,79870.25
Long Island,Nassau,2908000,000511,NYU Winthrop Hospital,50 to 69,119,F,White,Not Span/Hispanic,8,Urgent,Home w/ Home Health Services,2017,101,Coronary atherosclerosis and other heart disease,043,HEART VALVE PRCS,163,Cardiac valve procedures w/o AMI or complex PDX,05,Diseases and Disorders of the Circulatory System,2,Moderate,Moderate,Surgical,Medicare,Medicare,,,N,N,237255.43,61126.15
Long Island,Nassau,2908000,000511,NYU Winthrop Hospital,50 to 69,119,M,White,Not Span/Hispanic,7,Elective,Home w/ Home Health Services,2017,096,Heart valve disorders,043,HEART VALVE PRCS,163,Cardiac valve procedures w/o AMI or complex PDX,05,Diseases and Disorders of the Circulatory System,3,Major,Major,Surgical,Medicaid,Medicaid,,,N,N,303956.96,78430.65
Long Island,Nassau,2908000,000511,NYU Winthrop Hospital,70 or Older,117,F,White,Not Span/Hispanic,8,Urgent,Home or Self Care,2017,096,Heart valve disorders,043,HEART VALVE PRCS,163,Cardiac valve procedures w/o AMI or complex PDX,05,Diseases and Disorders of the Circulatory System,3,Major,Major,Surgical,Medicare,Medicare,Private Health Insurance,,N,N,406206.26,100363.83
Long Island,Nassau,2908000,000511,NYU Winthrop Hospital,70 or Older,115,F,White,Not Span/Hispanic,7,Elective,Home w/ Home Health Services,2017,096,Heart valve disorders,043,HEART VALVE PRCS,163,Cardiac valve procedures w/o AMI or complex PDX,05,Diseases and Disorders of the Circulatory System,3,Major,Major,Surgical,Medicare,Medicare,Private Health Insurance,,N,N,241486.07,57024.52
Long Island,Nassau,2908000,000511,NYU Winthrop Hospital,70 or Older,115,F,White,Not Span/Hispanic,13,Emergency,Home w/ Home Health Services,2017,096,Heart valve disorders,043,HEART VALVE PRCS,163,Cardiac valve procedures w/o AMI or complex PDX,05,Diseases and Disorders of the Circulatory System,4,Extreme,Major,Surgical,Medicare,Medicare,Private Health Insurance,,N,Y,324739.42,82258.04
Long Island,Nassau,2908000,000511,NYU Winthrop Hospital,50 to 69,119,M,White,Not Span/Hispanic,9,Urgent,Home w/ Home Health Services,2017,101,Coronary atherosclerosis and other heart disease,044,COR ARTERY BYP GRF-CABG,163,Cardiac valve procedures w/o AMI or complex PDX,05,Diseases and Disorders of the Circulatory System,3,Major,Moderate,Surgical,Medicare,Medicare,,,N,N,272740.49,63917.74
Long Island,Nassau,2908000,000511,NYU Winthrop Hospital,50 to 69,119,M,White,Not Span/Hispanic,6,Elective,Home w/ Home Health Services,2017,096,Heart valve disorders,043,HEART VALVE PRCS,163,Cardiac valve procedures w/o AMI or complex PDX,05,Diseases and Disorders of the Circulatory System,3,Major,Moderate,Surgical,Medicare,Medicare,Private Health Insurance,,N,N,206444.80,52722.06
Long Island,Nassau,2908000,000511,NYU Winthrop Hospital,70 or Older,115,M,White,Not Span/Hispanic,8,Elective,Skilled Nursing Home,2017,096,Heart valve disorders,043,HEART VALVE PRCS,163,Cardiac valve procedures w/o AMI or complex PDX,05,Diseases and Disorders of the Circulatory System,3,Major,Major,Surgical,Medicare,Medicare,Private Health Insurance,,N,N,255701.06,59845.41
Long Island,Nassau,2908000,000511,NYU Winthrop Hospital,70 or Older,115,M,Black/African American,Not Span/Hispanic,7,Emergency,Home or Self Care,2017,096,Heart valve disorders,043,HEART VALVE PRCS,163,Cardiac valve procedures w/o AMI or complex PDX,05,Diseases and Disorders of the Circulatory System,3,Major,Major,Surgical,Medicare,Medicare,,,N,Y,257149.22,61583.51
Long Island,Nassau,2908000,000511,NYU Winthrop Hospital,30 to 49,112,F,Black/African American,Not Span/Hispanic,5,Elective,Home w/ Home Health Services,2017,096,Heart valve disorders,043,HEART VALVE PRCS,163,Cardiac valve procedures w/o AMI or complex PDX,05,Diseases and Disorders of the Circulatory System,2,Moderate,Major,Surgical,Private Health Insurance,,,,N,N,334955.82,87481.08
Long Island,Nassau,2908000,000511,NYU Winthrop Hospital,50 to 69,112,M,Other Race,Not Span/Hispanic,4,Elective,Home w/ Home Health Services,2017,096,Heart valve disorders,043,HEART VALVE PRCS,163,Cardiac valve procedures w/o AMI or complex PDX,05,Diseases and Disorders of the Circulatory System,2,Moderate,Moderate,Surgical,Medicare,Medicare,,,N,N,172393.67,43931.78
Long Island,Nassau,2908000,000511,NYU Winthrop Hospital,50 to 69,117,M,White,Not Span/Hispanic,4,Elective,Home w/ Home Health Services,2017,213,Cardiac and circulatory congenital anomalies,043,HEART VALVE PRCS,163,Cardiac valve procedures w/o AMI or complex PDX,05,Diseases and Disorders of the Circulatory System,2,Moderate,Minor,Surgical,Blue Cross/Blue Shield,,,,N,N,155818.22,40595.30
Long Island,Nassau,2908000,000511,NYU Winthrop Hospital,50 to 69,115,M,White,Not Span/Hispanic,4,Elective,Home w/ Home Health Services,2017,096,Heart valve disorders,043,HEART VALVE PRCS,163,Cardiac valve procedures w/o AMI or complex PDX,05,Diseases and Disorders of the Circulatory System,3,Major,Moderate,Surgical,Medicare,Medicare,Blue Cross/Blue Shield,,N,N,323494.07,82945.44
Long Island,Nassau,2908000,000511,NYU Winthrop Hospital,70 or Older,OOS,M,White,Not Span/Hispanic,7,Elective,Home w/ Home Health Services,2017,096,Heart valve disorders,043,HEART VALVE PRCS,163,Cardiac valve procedures w/o AMI or complex PDX,05,Diseases and Disorders of the Circulatory System,3,Major,Extreme,Surgical,Medicare,Medicare,Blue Cross/Blue Shield,,N,N,246385.09,59141.08
Long Island,Nassau,2908000,000511,NYU Winthrop Hospital,50 to 69,110,F,White,Not Span/Hispanic,3,Elective,Home w/ Home Health Services,2017,096,Heart valve disorders,043,HEART VALVE PRCS,163,Cardiac valve procedures w/o AMI or complex PDX,05,Diseases and Disorders of the Circulatory System,2,Moderate,Moderate,Surgical,Medicare,Medicare,Blue Cross/Blue Shield,,N,N,191449.82,49400.79
Long Island,Nassau,2908000,000511,NYU Winthrop Hospital,70 or Older,110,F,White,Not Span/Hispanic,2,Elective,Home or Self Care,2017,096,Heart valve disorders,043,HEART VALVE PRCS,163,Cardiac valve procedures w/o AMI or complex PDX,05,Diseases and Disorders of the Circulatory System,2,Moderate,Moderate,Surgical,Blue Cross/Blue Shield,Medicare,,,N,N,320404.20,79208.88
Long Island,Nassau,2908000,000511,NYU Winthrop Hospital,50 to 69,114,M,Black/African American,Not Span/Hispanic,5,Elective,Home w/ Home Health Services,2017,096,Heart valve disorders,043,HEART VALVE PRCS,163,Cardiac valve procedures w/o AMI or complex PDX,05,Diseases and Disorders of the Circulatory System,2,Moderate,Moderate,Surgical,Medicare,Medicare,,,N,N,153978.60,39380.28
Long Island,Nassau,2908000,000511,NYU Winthrop Hospital,70 or Older,114,F,Black/African American,Not Span/Hispanic,11,Emergency,Skilled Nursing Home,2017,096,Heart valve disorders,043,HEART VALVE PRCS,163,Cardiac valve procedures w/o AMI or complex PDX,05,Diseases and Disorders of the Circulatory System,3,Major,Major,Surgical,Medicare,Medicare,,,N,Y,292453.48,71435.49
Long Island,Nassau,2908000,000511,NYU Winthrop Hospital,70 or Older,115,M,White,Not Span/Hispanic,3,Elective,Home or Self Care,2017,096,Heart valve disorders,043,HEART VALVE PRCS,163,Cardiac valve procedures w/o AMI or complex PDX,05,Diseases and Disorders of the Circulatory System,3,Major,Major,Surgical,Medicare,Medicare,Blue Cross/Blue Shield,,N,N,331536.55,79383.46
Long Island,Nassau,2908000,000511,NYU Winthrop Hospital,70 or Older,115,M,White,Not Span/Hispanic,22,Elective,Inpatient Rehabilitation Facility,2017,096,Heart valve disorders,043,HEART VALVE PRCS,163,Cardiac valve procedures w/o AMI or complex PDX,05,Diseases and Disorders of the Circulatory System,3,Major,Major,Surgical,Medicare,Medicare,Private Health Insurance,,N,N,486411.18,106830.90
Long Island,Nassau,2908000,000511,NYU Winthrop Hospital,50 to 69,115,M,White,Not Span/Hispanic,5,Elective,Home w/ Home Health Services,2017,096,Heart valve disorders,043,HEART VALVE PRCS,163,Cardiac valve procedures w/o AMI or complex PDX,05,Diseases and Disorders of the Circulatory System,3,Major,Major,Surgical,Medicare,Medicare,Blue Cross/Blue Shield,,N,N,217824.79,53276.92
Long Island,Nassau,2908000,000511,NYU Winthrop Hospital,50 to 69,115,M,Black/African American,Not Span/Hispanic,13,Emergency,Home w/ Home Health Services,2017,096,Heart valve disorders,043,HEART VALVE PRCS,163,Cardiac valve procedures w/o AMI or complex PDX,05,Diseases and Disorders of the Circulatory System,3,Major,Moderate,Surgical,Medicaid,Medicaid,,,N,Y,370741.77,89298.06
Long Island,Nassau,2908000,000511,NYU Winthrop Hospital,70 or Older,119,F,White,Not Span/Hispanic,8,Elective,Skilled Nursing Home,2017,096,Heart valve disorders,043,HEART VALVE PRCS,163,Cardiac valve procedures w/o AMI or complex PDX,05,Diseases and Disorders of the Circulatory System,3,Major,Major,Surgical,Medicare,Medicare,Private Health Insurance,,N,N,339676.68,78676.90
Long Island,Nassau,2908000,000511,NYU Winthrop Hospital,70 or Older,115,M,White,Not Span/Hispanic,6,Elective,Home w/ Home Health Services,2017,096,Heart valve disorders,043,HEART VALVE PRCS,163,Cardiac valve procedures w/o AMI or complex PDX,05,Diseases and Disorders of the Circulatory System,3,Major,Major,Surgical,Medicare,Medicare,Blue Cross/Blue Shield,,N,N,234645.29,57311.07
Long Island,Nassau,2908000,000511,NYU Winthrop Hospital,70 or Older,117,M,White,Not Span/Hispanic,7,Elective,Skilled Nursing Home,2017,096,Heart valve disorders,043,HEART VALVE PRCS,163,Cardiac valve procedures w/o AMI or complex PDX,05,Diseases and Disorders of the Circulatory System,3,Major,Major,Surgical,Medicare,Medicare,Blue Cross/Blue Shield,,N,N,267174.48,64904.12
Long Island,Nassau,2908000,000511,NYU Winthrop Hospital,50 to 69,117,M,White,Not Span/Hispanic,7,Urgent,Home w/ Home Health Services,2017,096,Heart valve disorders,043,HEART VALVE PRCS,163,Cardiac valve procedures w/o AMI or complex PDX,05,Diseases and Disorders of the Circulatory System,3,Major,Major,Surgical,Medicare,Medicare,Private Health Insurance,,N,N,238898.68,60031.75
Long Island,Nassau,2908000,000511,NYU Winthrop Hospital,50 to 69,118,M,White,Spanish/Hispanic,6,Elective,Home w/ Home Health Services,2017,096,Heart valve disorders,043,HEART VALVE PRCS,163,Cardiac valve procedures w/o AMI or complex PDX,05,Diseases and Disorders of the Circulatory System,2,Moderate,Moderate,Surgical,Private Health Insurance,Self-Pay,,,N,N,274228.20,69395.74
Long Island,Nassau,2908000,000511,NYU Winthrop Hospital,70 or Older,OOS,F,Black/African American,Not Span/Hispanic,12,Emergency,Home w/ Home Health Services,2017,096,Heart valve disorders,043,HEART VALVE PRCS,163,Cardiac valve procedures w/o AMI or complex PDX,05,Diseases and Disorders of the Circulatory System,3,Major,Major,Surgical,Medicare,Medicare,,,N,Y,311645.39,78672.48
Long Island,Nassau,2908000,000511,NYU Winthrop Hospital,50 to 69,119,M,White,Not Span/Hispanic,12,Emergency,Home w/ Home Health Services,2017,096,Heart valve disorders,043,HEART VALVE PRCS,163,Cardiac valve procedures w/o AMI or complex PDX,05,Diseases and Disorders of the Circulatory System,3,Major,Major,Surgical,Medicare,Medicare,Blue Cross/Blue Shield,,N,Y,301885.95,76297.51
Long Island,Nassau,2908000,000511,NYU Winthrop Hospital,70 or Older,117,M,White,Not Span/Hispanic,9,Elective,Home w/ Home Health Services,2017,096,Heart valve disorders,044,COR ARTERY BYP GRF-CABG,163,Cardiac valve procedures w/o AMI or complex PDX,05,Diseases and Disorders of the Circulatory System,3,Major,Major,Surgical,Medicare,Medicare,,,N,N,263062.31,65580.07
Long Island,Nassau,2908000,000511,NYU Winthrop Hospital,50 to 69,,F,Other Race,Unknown,10,Urgent,Home w/ Home Health Services,2017,101,Coronary atherosclerosis and other heart disease,044,COR ARTERY BYP GRF-CABG,163,Cardiac valve procedures w/o AMI or complex PDX,05,Diseases and Disorders of the Circulatory System,2,Moderate,Moderate,Surgical,Private Health Insurance,,,,N,N,308338.02,81519.02
Long Island,Nassau,2908000,000511,NYU Winthrop Hospital,70 or Older,119,M,White,Unknown,5,Urgent,Home or Self Care,2017,096,Heart valve disorders,043,HEART VALVE PRCS,163,Cardiac valve procedures w/o AMI or complex PDX,05,Diseases and Disorders of the Circulatory System,3,Major,Moderate,Surgical,Medicare,Medicare,Private Health Insurance,,N,N,633767.25,145668.90
Long Island,Nassau,2908000,000511,NYU Winthrop Hospital,50 to 69,115,M,White,Not Span/Hispanic,5,Elective,Home w/ Home Health Services,2017,096,Heart valve disorders,043,HEART VALVE PRCS,163,Cardiac valve procedures w/o AMI or complex PDX,05,Diseases and Disorders of the Circulatory System,2,Moderate,Moderate,Surgical,Private Health Insurance,,,,N,N,240483.03,62705.10
Long Island,Nassau,2908000,000511,NYU Winthrop Hospital,70 or Older,115,M,White,Not Span/Hispanic,4,Elective,Home w/ Home Health Services,2017,096,Heart valve disorders,043,HEART VALVE PRCS,163,Cardiac valve procedures w/o AMI or complex PDX,05,Diseases and Disorders of the Circulatory System,2,Moderate,Moderate,Surgical,Medicare,Medicare,Private Health Insurance,,N,N,215946.70,56706.34
Long Island,Nassau,2908000,000511,NYU Winthrop Hospital,50 to 69,113,F,White,Not Span/Hispanic,10,Urgent,Home or Self Care,2017,096,Heart valve disorders,043,HEART VALVE PRCS,163,Cardiac valve procedures w/o AMI or complex PDX,05,Diseases and Disorders of the Circulatory System,2,Moderate,Moderate,Surgical,Medicare,Medicare,Private Health Insurance,,N,N,358006.79,91371.70
Long Island,Nassau,2908000,000511,NYU Winthrop Hospital,50 to 69,118,M,White,Not Span/Hispanic,7,Elective,Home or Self Care,2017,096,Heart valve disorders,043,HEART VALVE PRCS,163,Cardiac valve procedures w/o AMI or complex PDX,05,Diseases and Disorders of the Circulatory System,3,Major,Moderate,Surgical,Private Health Insurance,,,,N,N,384322.14,94900.88
Long Island,Nassau,2908000,000511,NYU Winthrop Hospital,50 to 69,115,F,Black/African American,Not Span/Hispanic,12,Emergency,Home or Self Care,2017,096,Heart valve disorders,043,HEART VALVE PRCS,163,Cardiac valve procedures w/o AMI or complex PDX,05,Diseases and Disorders of the Circulatory System,2,Moderate,Moderate,Surgical,Private Health Insurance,,,,N,Y,426805.10,112375.66
Long Island,Nassau,2908000,000511,NYU Winthrop Hospital,50 to 69,117,M,White,Unknown,8,Urgent,Skilled Nursing Home,2017,096,Heart valve disorders,043,HEART VALVE PRCS,163,Cardiac valve procedures w/o AMI or complex PDX,05,Diseases and Disorders of the Circulatory System,2,Moderate,Moderate,Surgical,Medicare,Medicare,,,N,N,286505.40,74508.80
Long Island,Nassau,2908000,000511,NYU Winthrop Hospital,50 to 69,117,F,White,Not Span/Hispanic,5,Elective,Home w/ Home Health Services,2017,213,Cardiac and circulatory congenital anomalies,043,HEART VALVE PRCS,163,Cardiac valve procedures w/o AMI or complex PDX,05,Diseases and Disorders of the Circulatory System,3,Major,Major,Surgical,Private Health Insurance,,,,N,N,316204.70,82298.65
Long Island,Nassau,2908000,000511,NYU Winthrop Hospital,70 or Older,117,M,White,Not Span/Hispanic,5,Elective,Home or Self Care,2017,096,Heart valve disorders,043,HEART VALVE PRCS,163,Cardiac valve procedures w/o AMI or complex PDX,05,Diseases and Disorders of the Circulatory System,2,Moderate,Moderate,Surgical,Private Health Insurance,Medicare,Medicare,,N,N,261137.07,68658.68
Long Island,Nassau,2908000,000511,NYU Winthrop Hospital,50 to 69,115,M,Black/African American,Not Span/Hispanic,4,Elective,Home w/ Home Health Services,2017,096,Heart valve disorders,043,HEART VALVE PRCS,163,Cardiac valve procedures w/o AMI or complex PDX,05,Diseases and Disorders of the Circulatory System,2,Moderate,Minor,Surgical,Private Health Insurance,,,,N,N,184288.61,48769.16
Long Island,Nassau,2908000,000511,NYU Winthrop Hospital,50 to 69,117,F,White,Not Span/Hispanic,7,Elective,Home w/ Home Health Services,2017,096,Heart valve disorders,043,HEART VALVE PRCS,163,Cardiac valve procedures w/o AMI or complex PDX,05,Diseases and Disorders of the Circulatory System,2,Moderate,Moderate,Surgical,Medicare,Medicare,Blue Cross/Blue Shield,,N,N,239041.32,64070.84
Long Island,Nassau,2908000,000511,NYU Winthrop Hospital,50 to 69,115,M,White,Not Span/Hispanic,2,Elective,Home or Self Care,2017,096,Heart valve disorders,043,HEART VALVE PRCS,163,Cardiac valve procedures w/o AMI or complex PDX,05,Diseases and Disorders of the Circulatory System,2,Moderate,Moderate,Surgical,Medicare,Medicare,Private Health Insurance,,N,N,383081.15,97407.59
Long Island,Nassau,2908000,000511,NYU Winthrop Hospital,50 to 69,119,F,White,Not Span/Hispanic,7,Elective,Home or Self Care,2017,096,Heart valve disorders,043,HEART VALVE PRCS,163,Cardiac valve procedures w/o AMI or complex PDX,05,Diseases and Disorders of the Circulatory System,3,Major,Major,Surgical,Blue Cross/Blue Shield,,,,N,N,329114.59,83243.71
Long Island,Nassau,2908000,000511,NYU Winthrop Hospital,70 or Older,110,F,White,Not Span/Hispanic,34,Emergency,Skilled Nursing Home,2017,096,Heart valve disorders,047,DX CARDIAC CATHETERIZTN,163,Cardiac valve procedures w/o AMI or complex PDX,05,Diseases and Disorders of the Circulatory System,4,Extreme,Major,Surgical,Medicare,Private Health Insurance,Medicare,,N,Y,924142.55,216645.79
Long Island,Nassau,2908000,000511,NYU Winthrop Hospital,70 or Older,119,F,White,Not Span/Hispanic,12,Urgent,Home w/ Home Health Services,2017,096,Heart valve disorders,043,HEART VALVE PRCS,163,Cardiac valve procedures w/o AMI or complex PDX,05,Diseases and Disorders of the Circulatory System,3,Major,Major,Surgical,Medicare,Medicare,,,N,N,384786.08,101504.88
Long Island,Nassau,2908000,000511,NYU Winthrop Hospital,70 or Older,117,F,White,Not Span/Hispanic,10,Elective,Home w/ Home Health Services,2017,096,Heart valve disorders,044,COR ARTERY BYP GRF-CABG,163,Cardiac valve procedures w/o AMI or complex PDX,05,Diseases and Disorders of the Circulatory System,3,Major,Major,Surgical,Medicare,Medicare,Blue Cross/Blue Shield,,N,N,376414.17,98054.05
Long Island,Nassau,2908000,000511,NYU Winthrop Hospital,70 or Older,117,F,White,Not Span/Hispanic,7,Elective,Home w/ Home Health Services,2017,096,Heart valve disorders,043,HEART VALVE PRCS,163,Cardiac valve procedures w/o AMI or complex PDX,05,Diseases and Disorders of the Circulatory System,2,Moderate,Moderate,Surgical,Medicare,Medicare,,,N,N,304904.72,82955.20
Long Island,Nassau,2908000,000511,NYU Winthrop Hospital,70 or Older,119,F,White,Not Span/Hispanic,6,Elective,Home w/ Home Health Services,2017,096,Heart valve disorders,043,HEART VALVE PRCS,163,Cardiac valve procedures w/o AMI or complex PDX,05,Diseases and Disorders of the Circulatory System,2,Moderate,Moderate,Surgical,Medicare,Medicare,Blue Cross/Blue Shield,,N,N,299969.83,80590.49