Hospital Service Area,Hospital County,Operating Certificate Number,Permanent Facility Id,Facility Name,Age Group,Zip Code - 3 digits,Gender,Race,Ethnicity,Length of Stay,Type of Admission,Patient Disposition,Discharge Year,CCS Diagnosis Code,CCS Diagnosis Description,CCS Procedure Code,CCS Procedure Description,APR DRG Code,APR DRG Description,APR MDC Code,APR MDC Description,APR Severity of Illness Code,APR Severity of Illness Description,APR Risk of Mortality,APR Medical Surgical Description,Payment Typology 1,Payment Typology 2,Payment Typology 3,Birth Weight,Abortion Edit Indicator,Emergency Department Indicator,Total Charges,Total Costs
New York City,Manhattan,7002001,001438,Bellevue Hospital Center,30 to 49,114,M,Other Race,Not Span/Hispanic,19,Emergency,Home or Self Care,2019,CIR011,CORONARY ATHEROSCLEROSIS AND OTHER HEART DISEASE,CAR003,CORONARY ARTERY BYPASS GRAFTS (CABG),163,CARDIAC VALVE PROCEDURES W/O AMI OR COMPLEX PDX,05,DISEASES AND DISORDERS OF THE CIRCULATORY SYSTEM,2,Moderate,Moderate,Surgical,Medicaid,Medicaid,,,,false,119618.75,79498.62
New York City,Manhattan,7002001,001438,Bellevue Hospital Center,50 to 69,112,M,Other Race,Not Span/Hispanic,10,Emergency,Home w/ Home Health Services,2019,CIR003,NONRHEUMATIC AND UNSPECIFIED VALVE DISORDERS,CAR022,HEART VALVE REPLACEMENT AND OTHER VALVE PROCEDURES (NON-ENDOVASCULAR),163,CARDIAC VALVE PROCEDURES W/O AMI OR COMPLEX PDX,05,DISEASES AND DISORDERS OF THE CIRCULATORY SYSTEM,3,Major,Major,Surgical,Medicare,,,,,false,60657.78,40313.16
New York City,Manhattan,7002001,001438,Bellevue Hospital Center,70 or Older,112,F,Black/African American,Not Span/Hispanic,12,Emergency,Home or Self Care,2019,CIR001,CHRONIC RHEUMATIC HEART DISEASE,CAR009,LEFT ATRIAL APPENDAGE PROCEDURES,163,CARDIAC VALVE PROCEDURES W/O AMI OR COMPLEX PDX,05,DISEASES AND DISORDERS OF THE CIRCULATORY SYSTEM,3,Major,Major,Surgical,Medicare,Medicare,,,,false,71629.36,47604.87
New York City,Manhattan,7002001,001438,Bellevue Hospital Center,70 or Older,112,M,Other Race,Not Span/Hispanic,15,Emergency,Home or Self Care,2019,CIR003,NONRHEUMATIC AND UNSPECIFIED VALVE DISORDERS,CAR022,HEART VALVE REPLACEMENT AND OTHER VALVE PROCEDURES (NON-ENDOVASCULAR),163,CARDIAC VALVE PROCEDURES W/O AMI OR COMPLEX PDX,05,DISEASES AND DISORDERS OF THE CIRCULATORY SYSTEM,3,Major,Major,Surgical,Medicaid,Medicaid,,,,false,94348.02,62703.69
New York City,Manhattan,7002001,001438,Bellevue Hospital Center,50 to 69,104,F,Other Race,Not Span/Hispanic,16,Emergency,Home w/ Home Health Services,2019,CIR001,CHRONIC RHEUMATIC HEART DISEASE,CAR022,HEART VALVE REPLACEMENT AND OTHER VALVE PROCEDURES (NON-ENDOVASCULAR),163,CARDIAC VALVE PROCEDURES W/O AMI OR COMPLEX PDX,05,DISEASES AND DISORDERS OF THE CIRCULATORY SYSTEM,3,Major,Moderate,Surgical,Medicaid,Medicaid,,,,true,97282.78,64654.14
New York City,Manhattan,7002001,001438,Bellevue Hospital Center,30 to 49,100,F,Black/African American,Not Span/Hispanic,18,Emergency,Home or Self Care,2019,CIR001,CHRONIC RHEUMATIC HEART DISEASE,CAR022,HEART VALVE REPLACEMENT AND OTHER VALVE PROCEDURES (NON-ENDOVASCULAR),163,CARDIAC VALVE PROCEDURES W/O AMI OR COMPLEX PDX,05,DISEASES AND DISORDERS OF THE CIRCULATORY SYSTEM,3,Major,Moderate,Surgical,Medicaid,,,,,false,133957.74,89028.31
New York City,Manhattan,7002001,001438,Bellevue Hospital Center,50 to 69,114,M,Other Race,Spanish/Hispanic,8,Emergency,Home or Self Care,2019,CIR003,NONRHEUMATIC AND UNSPECIFIED VALVE DISORDERS,CAR022,HEART VALVE REPLACEMENT AND OTHER VALVE PROCEDURES (NON-ENDOVASCULAR),163,CARDIAC VALVE PROCEDURES W/O AMI OR COMPLEX PDX,05,DISEASES AND DISORDERS OF THE CIRCULATORY SYSTEM,2,Moderate,Moderate,Surgical,Medicaid,,,,,false,51532.3,34248.37
New York City,Manhattan,7002001,001438,Bellevue Hospital Center,18 to 29,114,M,Other Race,Not Span/Hispanic,15,Emergency,Home w/ Home Health Services,2019,CIR001,CHRONIC RHEUMATIC HEART DISEASE,CAR022,HEART VALVE REPLACEMENT AND OTHER VALVE PROCEDURES (NON-ENDOVASCULAR),163,CARDIAC VALVE PROCEDURES W/O AMI OR COMPLEX PDX,05,DISEASES AND DISORDERS OF THE CIRCULATORY SYSTEM,3,Major,Moderate,Surgical,Medicaid,,,,,false,94593.47,62866.82
New York City,Manhattan,7002001,001438,Bellevue Hospital Center,50 to 69,113,F,Other Race,Not Span/Hispanic,11,Elective,Home or Self Care,2019,CIR001,CHRONIC RHEUMATIC HEART DISEASE,CAR022,HEART VALVE REPLACEMENT AND OTHER VALVE PROCEDURES (NON-ENDOVASCULAR),163,CARDIAC VALVE PROCEDURES W/O AMI OR COMPLEX PDX,05,DISEASES AND DISORDERS OF THE CIRCULATORY SYSTEM,3,Major,Major,Surgical,Private Health Insurance,,,,,false,72023.93,47867.1
New York City,Manhattan,7002001,001438,Bellevue Hospital Center,18 to 29,112,F,Black/African American,Not Span/Hispanic,12,Emergency,Home or Self Care,2019,CIR001,CHRONIC RHEUMATIC HEART DISEASE,CAR022,HEART VALVE REPLACEMENT AND OTHER VALVE PROCEDURES (NON-ENDOVASCULAR),163,CARDIAC VALVE PROCEDURES W/O AMI OR COMPLEX PDX,05,DISEASES AND DISORDERS OF THE CIRCULATORY SYSTEM,3,Major,Major,Surgical,Medicaid,,,,,false,79050.64,52537.06
New York City,Manhattan,7002001,001438,Bellevue Hospital Center,18 to 29,104,F,Black/African American,Not Span/Hispanic,11,Emergency,Home or Self Care,2019,CIR003,NONRHEUMATIC AND UNSPECIFIED VALVE DISORDERS,CAR022,HEART VALVE REPLACEMENT AND OTHER VALVE PROCEDURES (NON-ENDOVASCULAR),163,CARDIAC VALVE PROCEDURES W/O AMI OR COMPLEX PDX,05,DISEASES AND DISORDERS OF THE CIRCULATORY SYSTEM,4,Extreme,Major,Surgical,Private Health Insurance,Medicaid,,,,false,70574.31,46903.69
New York City,Manhattan,7002001,001438,Bellevue Hospital Center,50 to 69,114,M,Other Race,Not Span/Hispanic,24,Emergency,Home or Self Care,2019,CIR019,HEART FAILURE,CAR022,HEART VALVE REPLACEMENT AND OTHER VALVE PROCEDURES (NON-ENDOVASCULAR),163,CARDIAC VALVE PROCEDURES W/O AMI OR COMPLEX PDX,05,DISEASES AND DISORDERS OF THE CIRCULATORY SYSTEM,3,Major,Major,Surgical,Blue Cross/Blue Shield,,,,,false,159375.15,105920.72
New York City,Manhattan,7002001,001438,Bellevue Hospital Center,30 to 49,104,M,Other Race,Not Span/Hispanic,12,Emergency,Home or Self Care,2019,CIR001,CHRONIC RHEUMATIC HEART DISEASE,CAR022,HEART VALVE REPLACEMENT AND OTHER VALVE PROCEDURES (NON-ENDOVASCULAR),163,CARDIAC VALVE PROCEDURES W/O AMI OR COMPLEX PDX,05,DISEASES AND DISORDERS OF THE CIRCULATORY SYSTEM,3,Major,Major,Surgical,Medicaid,,,,,true,90666.42,60256.9
New York City,Manhattan,7002001,001438,Bellevue Hospital Center,50 to 69,112,F,Other Race,Not Span/Hispanic,12,Emergency,Home or Self Care,2019,CIR001,CHRONIC RHEUMATIC HEART DISEASE,CAR022,HEART VALVE REPLACEMENT AND OTHER VALVE PROCEDURES (NON-ENDOVASCULAR),163,CARDIAC VALVE PROCEDURES W/O AMI OR COMPLEX PDX,05,DISEASES AND DISORDERS OF THE CIRCULATORY SYSTEM,2,Moderate,Moderate,Surgical,Private Health Insurance,,,,,false,74980.85,49832.27
New York City,Manhattan,7002001,001438,Bellevue Hospital Center,70 or Older,112,M,Other Race,Not Span/Hispanic,10,Emergency,Home or Self Care,2019,CIR003,NONRHEUMATIC AND UNSPECIFIED VALVE DISORDERS,CAR022,HEART VALVE REPLACEMENT AND OTHER VALVE PROCEDURES (NON-ENDOVASCULAR),163,CARDIAC VALVE PROCEDURES W/O AMI OR COMPLEX PDX,05,DISEASES AND DISORDERS OF THE CIRCULATORY SYSTEM,2,Moderate,Moderate,Surgical,Medicare,Medicare,,,,false,70105.9,46592.38
New York City,Manhattan,7002001,001438,Bellevue Hospital Center,50 to 69,100,M,Other Race,Not Span/Hispanic,10,Emergency,Home or Self Care,2019,CIR003,NONRHEUMATIC AND UNSPECIFIED VALVE DISORDERS,CAR022,HEART VALVE REPLACEMENT AND OTHER VALVE PROCEDURES (NON-ENDOVASCULAR),163,CARDIAC VALVE PROCEDURES W/O AMI OR COMPLEX PDX,05,DISEASES AND DISORDERS OF THE CIRCULATORY SYSTEM,3,Major,Moderate,Surgical,Medicaid,,,,,false,62659.12,41643.25
New York City,Manhattan,7002001,001438,Bellevue Hospital Center,50 to 69,104,F,Other Race,Not Span/Hispanic,26,Emergency,Home or Self Care,2019,CIR001,CHRONIC RHEUMATIC HEART DISEASE,CAR022,HEART VALVE REPLACEMENT AND OTHER VALVE PROCEDURES (NON-ENDOVASCULAR),163,CARDIAC VALVE PROCEDURES W/O AMI OR COMPLEX PDX,05,DISEASES AND DISORDERS OF THE CIRCULATORY SYSTEM,4,Extreme,Extreme,Surgical,Medicare,Medicaid,,,,true,150434.83,99978.99
New York City,Manhattan,7002001,001438,Bellevue Hospital Center,70 or Older,104,F,Other Race,Not Span/Hispanic,28,Emergency,Home w/ Home Health Services,2019,CIR001,CHRONIC RHEUMATIC HEART DISEASE,CAR022,HEART VALVE REPLACEMENT AND OTHER VALVE PROCEDURES (NON-ENDOVASCULAR),163,CARDIAC VALVE PROCEDURES W/O AMI OR COMPLEX PDX,05,DISEASES AND DISORDERS OF THE CIRCULATORY SYSTEM,3,Major,Major,Surgical,Medicaid,,,,,false,153703.43,102151.3
New York City,Manhattan,7002001,001438,Bellevue Hospital Center,70 or Older,113,F,Black/African American,Not Span/Hispanic,14,Emergency,Home w/ Home Health Services,2019,CIR003,NONRHEUMATIC AND UNSPECIFIED VALVE DISORDERS,CAR022,HEART VALVE REPLACEMENT AND OTHER VALVE PROCEDURES (NON-ENDOVASCULAR),163,CARDIAC VALVE PROCEDURES W/O AMI OR COMPLEX PDX,05,DISEASES AND DISORDERS OF THE CIRCULATORY SYSTEM,3,Major,Major,Surgical,Medicaid,,,,,false,97823.13,65013.25
New York City,Manhattan,7002001,001438,Bellevue Hospital Center,50 to 69,112,M,Other Race,Spanish/Hispanic,15,Emergency,Home or Self Care,2019,CIR003,NONRHEUMATIC AND UNSPECIFIED VALVE DISORDERS,CAR012,VESSEL REPAIR AND REPLACEMENT,163,CARDIAC VALVE PROCEDURES W/O AMI OR COMPLEX PDX,05,DISEASES AND DISORDERS OF THE CIRCULATORY SYSTEM,4,Extreme,Extreme,Surgical,Medicaid,Medicaid,,,,false,97362.72,64707.26
New York City,Manhattan,7002001,001438,Bellevue Hospital Center,50 to 69,112,M,Black/African American,Not Span/Hispanic,14,Emergency,Home or Self Care,2019,CIR001,CHRONIC RHEUMATIC HEART DISEASE,CAR022,HEART VALVE REPLACEMENT AND OTHER VALVE PROCEDURES (NON-ENDOVASCULAR),163,CARDIAC VALVE PROCEDURES W/O AMI OR COMPLEX PDX,05,DISEASES AND DISORDERS OF THE CIRCULATORY SYSTEM,3,Major,Moderate,Surgical,Medicaid,Medicaid,,,,false,94705.83,62941.49
New York City,Manhattan,7002001,001438,Bellevue Hospital Center,50 to 69,112,F,Black/African American,Not Span/Hispanic,32,Emergency,Home or Self Care,2019,CIR001,CHRONIC RHEUMATIC HEART DISEASE,CAR022,HEART VALVE REPLACEMENT AND OTHER VALVE PROCEDURES (NON-ENDOVASCULAR),163,CARDIAC VALVE PROCEDURES W/O AMI OR COMPLEX PDX,05,DISEASES AND DISORDERS OF THE CIRCULATORY SYSTEM,3,Major,Moderate,Surgical,Private Health Insurance,,,,,true,196572.05,130641.78
New York City,Manhattan,7002001,001438,Bellevue Hospital Center,30 to 49,104,M,Black/African American,Not Span/Hispanic,48,Urgent,Home or Self Care,2019,CIR003,NONRHEUMATIC AND UNSPECIFIED VALVE DISORDERS,CAR022,HEART VALVE REPLACEMENT AND OTHER VALVE PROCEDURES (NON-ENDOVASCULAR),163,CARDIAC VALVE PROCEDURES W/O AMI OR COMPLEX PDX,05,DISEASES AND DISORDERS OF THE CIRCULATORY SYSTEM,4,Extreme,Extreme,Surgical,Medicaid,,,,,false,267845.38,178010.04
New York City,Manhattan,7002001,001438,Bellevue Hospital Center,50 to 69,112,M,White,Not Span/Hispanic,9,Urgent,Home w/ Home Health Services,2019,CIR003,NONRHEUMATIC AND UNSPECIFIED VALVE DISORDERS,CAR022,HEART VALVE REPLACEMENT AND OTHER VALVE PROCEDURES (NON-ENDOVASCULAR),163,CARDIAC VALVE PROCEDURES W/O AMI OR COMPLEX PDX,05,DISEASES AND DISORDERS OF THE CIRCULATORY SYSTEM,2,Moderate,Moderate,Surgical,Medicaid,,,,,false,148572.62,98741.36
New York City,Manhattan,7002001,001438,Bellevue Hospital Center,50 to 69,114,F,Other Race,Not Span/Hispanic,22,Urgent,Home or Self Care,2019,CIR001,CHRONIC RHEUMATIC HEART DISEASE,CAR022,HEART VALVE REPLACEMENT AND OTHER VALVE PROCEDURES (NON-ENDOVASCULAR),163,CARDIAC VALVE PROCEDURES W/O AMI OR COMPLEX PDX,05,DISEASES AND DISORDERS OF THE CIRCULATORY SYSTEM,4,Extreme,Major,Surgical,Private Health Insurance,,,,,false,265753.89,176620.04
New York City,Manhattan,7002001,001438,Bellevue Hospital Center,70 or Older,114,M,Other Race,Not Span/Hispanic,15,Urgent,Home w/ Home Health Services,2019,CIR011,CORONARY ATHEROSCLEROSIS AND OTHER HEART DISEASE,CAR003,CORONARY ARTERY BYPASS GRAFTS (CABG),163,CARDIAC VALVE PROCEDURES W/O AMI OR COMPLEX PDX,05,DISEASES AND DISORDERS OF THE CIRCULATORY SYSTEM,4,Extreme,Extreme,Surgical,Self-Pay,,,,,false,218389.77,145141.84
New York City,Manhattan,7002001,001438,Bellevue Hospital Center,70 or Older,104,M,Other Race,Not Span/Hispanic,26,Urgent,Home or Self Care,2019,CIR011,CORONARY ATHEROSCLEROSIS AND OTHER HEART DISEASE,CAR022,HEART VALVE REPLACEMENT AND OTHER VALVE PROCEDURES (NON-ENDOVASCULAR),163,CARDIAC VALVE PROCEDURES W/O AMI OR COMPLEX PDX,05,DISEASES AND DISORDERS OF THE CIRCULATORY SYSTEM,4,Extreme,Extreme,Surgical,Medicare,,,,,false,288209.07,191543.75
New York City,Manhattan,7002001,001438,Bellevue Hospital Center,70 or Older,104,M,Other Race,Spanish/Hispanic,11,Elective,Home or Self Care,2019,CIR011,CORONARY ATHEROSCLEROSIS AND OTHER HEART DISEASE,CAR003,CORONARY ARTERY BYPASS GRAFTS (CABG),163,CARDIAC VALVE PROCEDURES W/O AMI OR COMPLEX PDX,05,DISEASES AND DISORDERS OF THE CIRCULATORY SYSTEM,4,Extreme,Extreme,Surgical,Medicare,Medicaid,,,,false,171149.89,113746.22
New York City,Manhattan,7002001,001438,Bellevue Hospital Center,50 to 69,114,F,Other Race,Not Span/Hispanic,22,Elective,Home w/ Home Health Services,2019,CIR001,CHRONIC RHEUMATIC HEART DISEASE,CAR022,HEART VALVE REPLACEMENT AND OTHER VALVE PROCEDURES (NON-ENDOVASCULAR),163,CARDIAC VALVE PROCEDURES W/O AMI OR COMPLEX PDX,05,DISEASES AND DISORDERS OF THE CIRCULATORY SYSTEM,3,Major,Moderate,Surgical,Private Health Insurance,,,,,false,342606.85,227696.51
New York City,Manhattan,7002001,001438,Bellevue Hospital Center,70 or Older,112,M,White,Unknown,59,Urgent,Home or Self Care,2019,CIR001,CHRONIC RHEUMATIC HEART DISEASE,CAR022,HEART VALVE REPLACEMENT AND OTHER VALVE PROCEDURES (NON-ENDOVASCULAR),163,CARDIAC VALVE PROCEDURES W/O AMI OR COMPLEX PDX,05,DISEASES AND DISORDERS OF THE CIRCULATORY SYSTEM,3,Major,Major,Surgical,Medicaid,,,,,false,522414.33,347196.56
New York City,Manhattan,7002001,001438,Bellevue Hospital Center,50 to 69,100,F,Other Race,Not Span/Hispanic,16,Elective,Home or Self Care,2019,CIR001,CHRONIC RHEUMATIC HEART DISEASE,CAR022,HEART VALVE REPLACEMENT AND OTHER VALVE PROCEDURES (NON-ENDOVASCULAR),163,CARDIAC VALVE PROCEDURES W/O AMI OR COMPLEX PDX,05,DISEASES AND DISORDERS OF THE CIRCULATORY SYSTEM,3,Major,Major,Surgical,Medicaid,,,,,false,335775.46,223156.37
New York City,Manhattan,7002001,001438,Bellevue Hospital Center,30 to 49,114,F,Black/African American,Unknown,12,Elective,Home or Self Care,2019,CIR003,NONRHEUMATIC AND UNSPECIFIED VALVE DISORDERS,CAR022,HEART VALVE REPLACEMENT AND OTHER VALVE PROCEDURES (NON-ENDOVASCULAR),163,CARDIAC VALVE PROCEDURES W/O AMI OR COMPLEX PDX,05,DISEASES AND DISORDERS OF THE CIRCULATORY SYSTEM,4,Extreme,Major,Surgical,Medicaid,,,,,false,174028.3,115659.21
New York City,Manhattan,7002001,001438,Bellevue Hospital Center,50 to 69,104,F,Other Race,Spanish/Hispanic,10,Elective,Home w/ Home Health Services,2019,CIR001,CHRONIC RHEUMATIC HEART DISEASE,CAR022,HEART VALVE REPLACEMENT AND OTHER VALVE PROCEDURES (NON-ENDOVASCULAR),163,CARDIAC VALVE PROCEDURES W/O AMI OR COMPLEX PDX,05,DISEASES AND DISORDERS OF THE CIRCULATORY SYSTEM,3,Major,Major,Surgical,Medicaid,,,,,false,158924.97,105621.54
New York City,Manhattan,7002001,001438,Bellevue Hospital Center,18 to 29,113,F,Other Race,Not Span/Hispanic,24,Urgent,Home w/ Home Health Services,2019,CIR001,CHRONIC RHEUMATIC HEART DISEASE,CAR022,HEART VALVE REPLACEMENT AND OTHER VALVE PROCEDURES (NON-ENDOVASCULAR),163,CARDIAC VALVE PROCEDURES W/O AMI OR COMPLEX PDX,05,DISEASES AND DISORDERS OF THE CIRCULATORY SYSTEM,4,Extreme,Extreme,Surgical,Medicaid,,,,,false,304097.56,202103.24
New York City,Manhattan,7002001,001438,Bellevue Hospital Center,50 to 69,114,M,Other Race,Not Span/Hispanic,14,Emergency,Home or Self Care,2019,MAL001,CARDIAC AND CIRCULATORY CONGENITAL ANOMALIES,CAR022,HEART VALVE REPLACEMENT AND OTHER VALVE PROCEDURES (NON-ENDOVASCULAR),163,CARDIAC VALVE PROCEDURES W/O AMI OR COMPLEX PDX,05,DISEASES AND DISORDERS OF THE CIRCULATORY SYSTEM,3,Major,Major,Surgical,Self-Pay,,,,,true,189387.48,125866.92
New York City,Manhattan,7002001,001438,Bellevue Hospital Center,50 to 69,104,F,Other Race,Not Span/Hispanic,25,Urgent,Home or Self Care,2019,CIR001,CHRONIC RHEUMATIC HEART DISEASE,CAR022,HEART VALVE REPLACEMENT AND OTHER VALVE PROCEDURES (NON-ENDOVASCULAR),163,CARDIAC VALVE PROCEDURES W/O AMI OR COMPLEX PDX,05,DISEASES AND DISORDERS OF THE CIRCULATORY SYSTEM,3,Major,Major,Surgical,Medicaid,,,,,false,253068.51,168189.33
New York City,Manhattan,7002001,001438,Bellevue Hospital Center,50 to 69,103,F,Other Race,Not Span/Hispanic,16,Urgent,Home w/ Home Health Services,2019,CIR003,NONRHEUMATIC AND UNSPECIFIED VALVE DISORDERS,CAR022,HEART VALVE REPLACEMENT AND OTHER VALVE PROCEDURES (NON-ENDOVASCULAR),163,CARDIAC VALVE PROCEDURES W/O AMI OR COMPLEX PDX,05,DISEASES AND DISORDERS OF THE CIRCULATORY SYSTEM,2,Moderate,Moderate,Surgical,Medicaid,,,,,false,186013.89,123624.83
New York City,Manhattan,7002001,001438,Bellevue Hospital Center,50 to 69,104,M,Other Race,Spanish/Hispanic,10,Elective,Home w/ Home Health Services,2019,CIR003,NONRHEUMATIC AND UNSPECIFIED VALVE DISORDERS,CAR022,HEART VALVE REPLACEMENT AND OTHER VALVE PROCEDURES (NON-ENDOVASCULAR),163,CARDIAC VALVE PROCEDURES W/O AMI OR COMPLEX PDX,05,DISEASES AND DISORDERS OF THE CIRCULATORY SYSTEM,3,Major,Moderate,Surgical,Medicare,Medicaid,,,,false,162291.7,107859.06
New York City,Manhattan,7002001,001438,Bellevue Hospital Center,30 to 49,112,M,White,Not Span/Hispanic,11,Elective,Home or Self Care,2019,CIR003,NONRHEUMATIC AND UNSPECIFIED VALVE DISORDERS,CAR022,HEART VALVE REPLACEMENT AND OTHER VALVE PROCEDURES (NON-ENDOVASCULAR),163,CARDIAC VALVE PROCEDURES W/O AMI OR COMPLEX PDX,05,DISEASES AND DISORDERS OF THE CIRCULATORY SYSTEM,3,Major,Major,Surgical,Medicaid,,,,,false,154792.68,102875.22
New York City,Manhattan,7002001,001438,Bellevue Hospital Center,30 to 49,113,M,Black/African American,Not Span/Hispanic,12,Elective,Court/Law Enforcement,2019,CIR003,NONRHEUMATIC AND UNSPECIFIED VALVE DISORDERS,CAR022,HEART VALVE REPLACEMENT AND OTHER VALVE PROCEDURES (NON-ENDOVASCULAR),163,CARDIAC VALVE PROCEDURES W/O AMI OR COMPLEX PDX,05,DISEASES AND DISORDERS OF THE CIRCULATORY SYSTEM,3,Major,Major,Surgical,Medicaid,,,,,false,162205.11,107801.52
New York City,Manhattan,7002001,001438,Bellevue Hospital Center,70 or Older,104,F,Other Race,Spanish/Hispanic,10,Elective,Home or Self Care,2019,CIR029,AORTIC; PERIPHERAL; AND VISCERAL ARTERY ANEURYSMS,CAR012,VESSEL REPAIR AND REPLACEMENT,163,CARDIAC VALVE PROCEDURES W/O AMI OR COMPLEX PDX,05,DISEASES AND DISORDERS OF THE CIRCULATORY SYSTEM,2,Moderate,Major,Surgical,Medicare,,,,,false,157142.02,104436.59
New York City,Manhattan,7002001,001438,Bellevue Hospital Center,30 to 49,114,M,Other Race,Unknown,50,Urgent,Home or Self Care,2019,CIR003,NONRHEUMATIC AND UNSPECIFIED VALVE DISORDERS,CAR022,HEART VALVE REPLACEMENT AND OTHER VALVE PROCEDURES (NON-ENDOVASCULAR),163,CARDIAC VALVE PROCEDURES W/O AMI OR COMPLEX PDX,05,DISEASES AND DISORDERS OF THE CIRCULATORY SYSTEM,4,Extreme,Extreme,Surgical,Medicaid,,,,,false,681296.21,452789.46
New York City,Manhattan,7002001,001438,Bellevue Hospital Center,50 to 69,112,F,Black/African American,Not Span/Hispanic,19,Urgent,Home w/ Home Health Services,2019,CIR001,CHRONIC RHEUMATIC HEART DISEASE,CAR022,HEART VALVE REPLACEMENT AND OTHER VALVE PROCEDURES (NON-ENDOVASCULAR),163,CARDIAC VALVE PROCEDURES W/O AMI OR COMPLEX PDX,05,DISEASES AND DISORDERS OF THE CIRCULATORY SYSTEM,3,Major,Major,Surgical,Private Health Insurance,,,,,false,236225.51,156995.47
New York City,Manhattan,7002001,001438,Bellevue Hospital Center,70 or Older,113,M,Other Race,Spanish/Hispanic,18,Emergency,Home or Self Care,2019,CIR003,NONRHEUMATIC AND UNSPECIFIED VALVE DISORDERS,CAR022,HEART VALVE REPLACEMENT AND OTHER VALVE PROCEDURES (NON-ENDOVASCULAR),163,CARDIAC VALVE PROCEDURES W/O AMI OR COMPLEX PDX,05,DISEASES AND DISORDERS OF THE CIRCULATORY SYSTEM,4,Extreme,Extreme,Surgical,Medicaid,,,,,true,290044.86,192763.81
New York City,Manhattan,7002001,001438,Bellevue Hospital Center,30 to 49,112,M,Black/African American,Spanish/Hispanic,13,Urgent,Home or Self Care,2019,CIR003,NONRHEUMATIC AND UNSPECIFIED VALVE DISORDERS,CAR022,HEART VALVE REPLACEMENT AND OTHER VALVE PROCEDURES (NON-ENDOVASCULAR),163,CARDIAC VALVE PROCEDURES W/O AMI OR COMPLEX PDX,05,DISEASES AND DISORDERS OF THE CIRCULATORY SYSTEM,3,Major,Major,Surgical,Medicaid,,,,,false,169242.96,112478.87
New York City,Manhattan,7002001,001438,Bellevue Hospital Center,70 or Older,112,F,Other Race,Spanish/Hispanic,19,Elective,Home or Self Care,2019,CIR003,NONRHEUMATIC AND UNSPECIFIED VALVE DISORDERS,CAR022,HEART VALVE REPLACEMENT AND OTHER VALVE PROCEDURES (NON-ENDOVASCULAR),163,CARDIAC VALVE PROCEDURES W/O AMI OR COMPLEX PDX,05,DISEASES AND DISORDERS OF THE CIRCULATORY SYSTEM,3,Major,Major,Surgical,Medicare,Medicaid,,,,false,232070.32,154233.93
New York City,Manhattan,7002001,001438,Bellevue Hospital Center,70 or Older,104,F,Other Race,Spanish/Hispanic,34,Urgent,Home w/ Home Health Services,2019,CIR001,CHRONIC RHEUMATIC HEART DISEASE,CAR022,HEART VALVE REPLACEMENT AND OTHER VALVE PROCEDURES (NON-ENDOVASCULAR),163,CARDIAC VALVE PROCEDURES W/O AMI OR COMPLEX PDX,05,DISEASES AND DISORDERS OF THE CIRCULATORY SYSTEM,3,Major,Major,Surgical,Medicaid,,,,,false,330140.51,219411.38
New York City,Manhattan,7002001,001438,Bellevue Hospital Center,70 or Older,113,M,Black/African American,Not Span/Hispanic,20,Urgent,Home or Self Care,2019,CIR001,CHRONIC RHEUMATIC HEART DISEASE,CAR022,HEART VALVE REPLACEMENT AND OTHER VALVE PROCEDURES (NON-ENDOVASCULAR),163,CARDIAC VALVE PROCEDURES W/O AMI OR COMPLEX PDX,05,DISEASES AND DISORDERS OF THE CIRCULATORY SYSTEM,4,Extreme,Extreme,Surgical,Medicare,Medicaid,,,,false,291318.07,193609.99
New York City,Manhattan,7002001,001438,Bellevue Hospital Center,18 to 29,112,F,Black/African American,Not Span/Hispanic,29,Elective,Home w/ Home Health Services,2019,CIR001,CHRONIC RHEUMATIC HEART DISEASE,CAR022,HEART VALVE REPLACEMENT AND OTHER VALVE PROCEDURES (NON-ENDOVASCULAR),163,CARDIAC VALVE PROCEDURES W/O AMI OR COMPLEX PDX,05,DISEASES AND DISORDERS OF THE CIRCULATORY SYSTEM,4,Extreme,Extreme,Surgical,Medicaid,,,,,false,343701.3,228423.88
New York City,Manhattan,7002001,001438,Bellevue Hospital Center,30 to 49,114,M,Other Race,Not Span/Hispanic,17,Elective,Home w/ Home Health Services,2019,CIR003,NONRHEUMATIC AND UNSPECIFIED VALVE DISORDERS,CAR022,HEART VALVE REPLACEMENT AND OTHER VALVE PROCEDURES (NON-ENDOVASCULAR),163,CARDIAC VALVE PROCEDURES W/O AMI OR COMPLEX PDX,05,DISEASES AND DISORDERS OF THE CIRCULATORY SYSTEM,4,Extreme,Extreme,Surgical,Private Health Insurance,,,,,false,119190.89,79214.27
New York City,Manhattan,7002001,001438,Bellevue Hospital Center,50 to 69,113,F,Other Race,Spanish/Hispanic,9,Elective,Home or Self Care,2019,MAL001,CARDIAC AND CIRCULATORY CONGENITAL ANOMALIES,CAR022,HEART VALVE REPLACEMENT AND OTHER VALVE PROCEDURES (NON-ENDOVASCULAR),163,CARDIAC VALVE PROCEDURES W/O AMI OR COMPLEX PDX,05,DISEASES AND DISORDERS OF THE CIRCULATORY SYSTEM,3,Major,Major,Surgical,Medicaid,,,,,false,142678.63,94824.22
New York City,Manhattan,7002001,001438,Bellevue Hospital Center,50 to 69,113,F,Other Race,Spanish/Hispanic,12,Urgent,Home or Self Care,2019,CIR001,CHRONIC RHEUMATIC HEART DISEASE,CAR022,HEART VALVE REPLACEMENT AND OTHER VALVE PROCEDURES (NON-ENDOVASCULAR),163,CARDIAC VALVE PROCEDURES W/O AMI OR COMPLEX PDX,05,DISEASES AND DISORDERS OF THE CIRCULATORY SYSTEM,3,Major,Moderate,Surgical,Medicaid,,,,,false,157992,105001.48