Hospital Service Area,Hospital County,Operating Certificate Number,Permanent Facility Id,Facility Name,Age Group,Zip Code - 3 digits,Gender,Race,Ethnicity,Length of Stay,Type of Admission,Patient Disposition,Discharge Year,CCS Diagnosis Code,CCS Diagnosis Description,CCS Procedure Code,CCS Procedure Description,APR DRG Code,APR DRG Description,APR MDC Code,APR MDC Description,APR Severity of Illness Code,APR Severity of Illness Description,APR Risk of Mortality,APR Medical Surgical Description,Payment Typology 1,Payment Typology 2,Payment Typology 3,Birth Weight,Abortion Edit Indicator,Emergency Department Indicator,Total Charges,Total Costs
New York City,Manhattan,7002001,001438,Bellevue Hospital Center,50 to 69,113,M,Other Race,Not Span/Hispanic,14,Emergency,Home or Self Care,2019,CIR009,ACUTE MYOCARDIAL INFARCTION,CAR003,CORONARY ARTERY BYPASS GRAFTS (CABG),165,CORONARY BYPASS W AMI OR COMPLEX PDX,05,DISEASES AND DISORDERS OF THE CIRCULATORY SYSTEM,3,Major,Major,Surgical,Medicaid,,,,,false,102368.06,68033.81
New York City,Manhattan,7002001,001438,Bellevue Hospital Center,50 to 69,112,M,Other Race,Not Span/Hispanic,16,Emergency,Home or Self Care,2019,CIR009,ACUTE MYOCARDIAL INFARCTION,CAR003,CORONARY ARTERY BYPASS GRAFTS (CABG),165,CORONARY BYPASS W AMI OR COMPLEX PDX,05,DISEASES AND DISORDERS OF THE CIRCULATORY SYSTEM,3,Major,Major,Surgical,Medicare,Medicare,Medicaid,,,false,107374.58,71361.15
New York City,Manhattan,7002001,001438,Bellevue Hospital Center,50 to 69,112,M,Other Race,Not Span/Hispanic,16,Emergency,Home or Self Care,2019,INJ033,"COMPLICATION OF CARDIOVASCULAR DEVICE, IMPLANT OR GRAFT, INITIAL ENCOUNTER",CAR003,CORONARY ARTERY BYPASS GRAFTS (CABG),165,CORONARY BYPASS W AMI OR COMPLEX PDX,05,DISEASES AND DISORDERS OF THE CIRCULATORY SYSTEM,3,Major,Moderate,Surgical,Self-Pay,,,,,true,104188.88,69243.93
New York City,Manhattan,7002001,001438,Bellevue Hospital Center,50 to 69,113,M,Other Race,Not Span/Hispanic,13,Emergency,Home or Self Care,2019,INJ033,"COMPLICATION OF CARDIOVASCULAR DEVICE, IMPLANT OR GRAFT, INITIAL ENCOUNTER",CAR003,CORONARY ARTERY BYPASS GRAFTS (CABG),165,CORONARY BYPASS W AMI OR COMPLEX PDX,05,DISEASES AND DISORDERS OF THE CIRCULATORY SYSTEM,3,Major,Moderate,Surgical,Private Health Insurance,,,,,false,81902.94,54432.69
New York City,Manhattan,7002001,001438,Bellevue Hospital Center,30 to 49,112,F,Black/African American,Not Span/Hispanic,11,Emergency,Home or Self Care,2019,CIR009,ACUTE MYOCARDIAL INFARCTION,CAR003,CORONARY ARTERY BYPASS GRAFTS (CABG),165,CORONARY BYPASS W AMI OR COMPLEX PDX,05,DISEASES AND DISORDERS OF THE CIRCULATORY SYSTEM,2,Moderate,Moderate,Surgical,Medicaid,,,,,false,82383.87,54752.32
New York City,Manhattan,7002001,001438,Bellevue Hospital Center,30 to 49,112,M,Black/African American,Not Span/Hispanic,18,Emergency,Home or Self Care,2019,CIR009,ACUTE MYOCARDIAL INFARCTION,CAR003,CORONARY ARTERY BYPASS GRAFTS (CABG),165,CORONARY BYPASS W AMI OR COMPLEX PDX,05,DISEASES AND DISORDERS OF THE CIRCULATORY SYSTEM,4,Extreme,Extreme,Surgical,Medicaid,Medicaid,,,,true,132989.57,88384.87
New York City,Manhattan,7002001,001438,Bellevue Hospital Center,70 or Older,113,F,Other Race,Not Span/Hispanic,11,Emergency,Home w/ Home Health Services,2019,CIR009,ACUTE MYOCARDIAL INFARCTION,CAR003,CORONARY ARTERY BYPASS GRAFTS (CABG),165,CORONARY BYPASS W AMI OR COMPLEX PDX,05,DISEASES AND DISORDERS OF THE CIRCULATORY SYSTEM,4,Extreme,Extreme,Surgical,Medicaid,,,,,false,81605.39,54234.94
New York City,Manhattan,7002001,001438,Bellevue Hospital Center,50 to 69,100,M,Other Race,Not Span/Hispanic,39,Emergency,Another Type Not Listed,2019,CIR009,ACUTE MYOCARDIAL INFARCTION,CAR003,CORONARY ARTERY BYPASS GRAFTS (CABG),165,CORONARY BYPASS W AMI OR COMPLEX PDX,05,DISEASES AND DISORDERS OF THE CIRCULATORY SYSTEM,4,Extreme,Extreme,Surgical,Medicare,Medicaid,,,,false,196500,130593.9
New York City,Manhattan,7002001,001438,Bellevue Hospital Center,50 to 69,112,M,Other Race,Not Span/Hispanic,13,Emergency,Home or Self Care,2019,INJ033,"COMPLICATION OF CARDIOVASCULAR DEVICE, IMPLANT OR GRAFT, INITIAL ENCOUNTER",CAR003,CORONARY ARTERY BYPASS GRAFTS (CABG),165,CORONARY BYPASS W AMI OR COMPLEX PDX,05,DISEASES AND DISORDERS OF THE CIRCULATORY SYSTEM,2,Moderate,Moderate,Surgical,Self-Pay,,,,,false,86247.94,57320.38
New York City,Manhattan,7002001,001438,Bellevue Hospital Center,50 to 69,114,M,Other Race,Not Span/Hispanic,11,Emergency,Home or Self Care,2019,CIR009,ACUTE MYOCARDIAL INFARCTION,CAR003,CORONARY ARTERY BYPASS GRAFTS (CABG),165,CORONARY BYPASS W AMI OR COMPLEX PDX,05,DISEASES AND DISORDERS OF THE CIRCULATORY SYSTEM,3,Major,Moderate,Surgical,Medicaid,,,,,false,72379.19,48103.21
New York City,Manhattan,7002001,001438,Bellevue Hospital Center,50 to 69,100,F,Other Race,Not Span/Hispanic,10,Emergency,Home or Self Care,2019,INJ033,"COMPLICATION OF CARDIOVASCULAR DEVICE, IMPLANT OR GRAFT, INITIAL ENCOUNTER",CAR003,CORONARY ARTERY BYPASS GRAFTS (CABG),165,CORONARY BYPASS W AMI OR COMPLEX PDX,05,DISEASES AND DISORDERS OF THE CIRCULATORY SYSTEM,3,Major,Major,Surgical,Medicaid,,,,,true,127662.55,84844.53
New York City,Manhattan,7002001,001438,Bellevue Hospital Center,50 to 69,112,M,Other Race,Spanish/Hispanic,13,Urgent,Home w/ Home Health Services,2019,INJ033,"COMPLICATION OF CARDIOVASCULAR DEVICE, IMPLANT OR GRAFT, INITIAL ENCOUNTER",CAR003,CORONARY ARTERY BYPASS GRAFTS (CABG),165,CORONARY BYPASS W AMI OR COMPLEX PDX,05,DISEASES AND DISORDERS OF THE CIRCULATORY SYSTEM,3,Major,Major,Surgical,Medicare,,,,,false,182709.2,121428.53
New York City,Manhattan,7002001,001438,Bellevue Hospital Center,50 to 69,113,M,Other Race,Not Span/Hispanic,9,Urgent,Home or Self Care,2019,INJ033,"COMPLICATION OF CARDIOVASCULAR DEVICE, IMPLANT OR GRAFT, INITIAL ENCOUNTER",CAR003,CORONARY ARTERY BYPASS GRAFTS (CABG),165,CORONARY BYPASS W AMI OR COMPLEX PDX,05,DISEASES AND DISORDERS OF THE CIRCULATORY SYSTEM,2,Moderate,Moderate,Surgical,Medicaid,,,,,false,126229.95,83892.42
New York City,Manhattan,7002001,001438,Bellevue Hospital Center,70 or Older,114,M,Other Race,Not Span/Hispanic,21,Urgent,Home or Self Care,2019,CIR009,ACUTE MYOCARDIAL INFARCTION,CAR003,CORONARY ARTERY BYPASS GRAFTS (CABG),165,CORONARY BYPASS W AMI OR COMPLEX PDX,05,DISEASES AND DISORDERS OF THE CIRCULATORY SYSTEM,3,Major,Major,Surgical,Medicare,,,,,false,236775.75,157361.16
New York City,Manhattan,7002001,001438,Bellevue Hospital Center,70 or Older,114,M,Other Race,Not Span/Hispanic,14,Urgent,Home w/ Home Health Services,2019,CIR009,ACUTE MYOCARDIAL INFARCTION,CAR003,CORONARY ARTERY BYPASS GRAFTS (CABG),165,CORONARY BYPASS W AMI OR COMPLEX PDX,05,DISEASES AND DISORDERS OF THE CIRCULATORY SYSTEM,4,Extreme,Extreme,Surgical,Medicaid,,,,,false,211940.72,140855.8
New York City,Manhattan,7002001,001438,Bellevue Hospital Center,50 to 69,112,M,Black/African American,Not Span/Hispanic,16,Urgent,Home or Self Care,2019,CIR009,ACUTE MYOCARDIAL INFARCTION,CAR003,CORONARY ARTERY BYPASS GRAFTS (CABG),165,CORONARY BYPASS W AMI OR COMPLEX PDX,05,DISEASES AND DISORDERS OF THE CIRCULATORY SYSTEM,3,Major,Moderate,Surgical,Medicaid,,,,,false,198362.29,131831.58
New York City,Manhattan,7002001,001438,Bellevue Hospital Center,70 or Older,111,M,Other Race,Spanish/Hispanic,12,Urgent,Home or Self Care,2019,CIR009,ACUTE MYOCARDIAL INFARCTION,CAR003,CORONARY ARTERY BYPASS GRAFTS (CABG),165,CORONARY BYPASS W AMI OR COMPLEX PDX,05,DISEASES AND DISORDERS OF THE CIRCULATORY SYSTEM,4,Extreme,Extreme,Surgical,Medicare,,,,,false,169122.84,112399.04
New York City,Manhattan,7002001,001438,Bellevue Hospital Center,70 or Older,112,M,Other Race,Unknown,22,Urgent,Home or Self Care,2019,CIR009,ACUTE MYOCARDIAL INFARCTION,CAR003,CORONARY ARTERY BYPASS GRAFTS (CABG),165,CORONARY BYPASS W AMI OR COMPLEX PDX,05,DISEASES AND DISORDERS OF THE CIRCULATORY SYSTEM,3,Major,Major,Surgical,Medicaid,,,,,false,271012.31,180114.78
New York City,Manhattan,7002001,001438,Bellevue Hospital Center,50 to 69,112,M,Black/African American,Not Span/Hispanic,21,Urgent,Home or Self Care,2019,CIR009,ACUTE MYOCARDIAL INFARCTION,CAR003,CORONARY ARTERY BYPASS GRAFTS (CABG),165,CORONARY BYPASS W AMI OR COMPLEX PDX,05,DISEASES AND DISORDERS OF THE CIRCULATORY SYSTEM,4,Extreme,Extreme,Surgical,Medicaid,,,,,false,330894.7,219912.62
New York City,Manhattan,7002001,001438,Bellevue Hospital Center,50 to 69,104,M,Black/African American,Not Span/Hispanic,21,Urgent,Home w/ Home Health Services,2019,CIR009,ACUTE MYOCARDIAL INFARCTION,CAR003,CORONARY ARTERY BYPASS GRAFTS (CABG),165,CORONARY BYPASS W AMI OR COMPLEX PDX,05,DISEASES AND DISORDERS OF THE CIRCULATORY SYSTEM,3,Major,Moderate,Surgical,Medicaid,,,,,false,270383.36,179696.78
New York City,Manhattan,7002001,001438,Bellevue Hospital Center,30 to 49,113,F,Other Race,Spanish/Hispanic,17,Emergency,Court/Law Enforcement,2019,CIR009,ACUTE MYOCARDIAL INFARCTION,CAR003,CORONARY ARTERY BYPASS GRAFTS (CABG),165,CORONARY BYPASS W AMI OR COMPLEX PDX,05,DISEASES AND DISORDERS OF THE CIRCULATORY SYSTEM,3,Major,Major,Surgical,Medicaid,,,,,true,203882.11,135500.05
New York City,Manhattan,7002001,001438,Bellevue Hospital Center,50 to 69,114,F,Other Race,Not Span/Hispanic,13,Urgent,Home or Self Care,2019,CIR009,ACUTE MYOCARDIAL INFARCTION,CAR003,CORONARY ARTERY BYPASS GRAFTS (CABG),165,CORONARY BYPASS W AMI OR COMPLEX PDX,05,DISEASES AND DISORDERS OF THE CIRCULATORY SYSTEM,3,Major,Moderate,Surgical,Medicaid,,,,,false,174180.97,115760.67
New York City,Manhattan,7002001,001438,Bellevue Hospital Center,50 to 69,112,M,Other Race,Spanish/Hispanic,15,Urgent,Home w/ Home Health Services,2019,CIR009,ACUTE MYOCARDIAL INFARCTION,CAR003,CORONARY ARTERY BYPASS GRAFTS (CABG),165,CORONARY BYPASS W AMI OR COMPLEX PDX,05,DISEASES AND DISORDERS OF THE CIRCULATORY SYSTEM,3,Major,Moderate,Surgical,Medicaid,,,,,false,194833.35,129486.24
New York City,Manhattan,7002001,001438,Bellevue Hospital Center,50 to 69,114,M,Other Race,Not Span/Hispanic,11,Urgent,Home or Self Care,2019,CIR009,ACUTE MYOCARDIAL INFARCTION,CAR003,CORONARY ARTERY BYPASS GRAFTS (CABG),165,CORONARY BYPASS W AMI OR COMPLEX PDX,05,DISEASES AND DISORDERS OF THE CIRCULATORY SYSTEM,3,Major,Extreme,Surgical,Medicaid,,,,,false,163870.02,108908.02
New York City,Manhattan,7002001,001438,Bellevue Hospital Center,30 to 49,111,M,Other Race,Unknown,10,Urgent,Home w/ Home Health Services,2019,CIR009,ACUTE MYOCARDIAL INFARCTION,CAR003,CORONARY ARTERY BYPASS GRAFTS (CABG),165,CORONARY BYPASS W AMI OR COMPLEX PDX,05,DISEASES AND DISORDERS OF THE CIRCULATORY SYSTEM,4,Extreme,Extreme,Surgical,Medicaid,,,,,false,191124.71,127021.48
New York City,Manhattan,7002001,001438,Bellevue Hospital Center,30 to 49,114,M,Other Race,Not Span/Hispanic,11,Urgent,Home or Self Care,2019,CIR009,ACUTE MYOCARDIAL INFARCTION,CAR003,CORONARY ARTERY BYPASS GRAFTS (CABG),165,CORONARY BYPASS W AMI OR COMPLEX PDX,05,DISEASES AND DISORDERS OF THE CIRCULATORY SYSTEM,3,Major,Moderate,Surgical,Medicaid,,,,,false,150886.44,100279.13
New York City,Manhattan,7002001,001438,Bellevue Hospital Center,50 to 69,114,M,Other Race,Unknown,13,Urgent,Home or Self Care,2019,CIR009,ACUTE MYOCARDIAL INFARCTION,CAR003,CORONARY ARTERY BYPASS GRAFTS (CABG),165,CORONARY BYPASS W AMI OR COMPLEX PDX,05,DISEASES AND DISORDERS OF THE CIRCULATORY SYSTEM,2,Moderate,Moderate,Surgical,Medicaid,,,,,false,171298.8,113845.18
New York City,Manhattan,7002001,001438,Bellevue Hospital Center,50 to 69,113,M,Other Race,Not Span/Hispanic,8,Urgent,Home or Self Care,2019,CIR009,ACUTE MYOCARDIAL INFARCTION,CAR003,CORONARY ARTERY BYPASS GRAFTS (CABG),165,CORONARY BYPASS W AMI OR COMPLEX PDX,05,DISEASES AND DISORDERS OF THE CIRCULATORY SYSTEM,3,Major,Moderate,Surgical,Medicaid,,,,,false,134921.44,89668.79
New York City,Manhattan,7002001,001438,Bellevue Hospital Center,50 to 69,112,M,Other Race,Unknown,14,Emergency,Home w/ Home Health Services,2019,CIR009,ACUTE MYOCARDIAL INFARCTION,CAR003,CORONARY ARTERY BYPASS GRAFTS (CABG),165,CORONARY BYPASS W AMI OR COMPLEX PDX,05,DISEASES AND DISORDERS OF THE CIRCULATORY SYSTEM,4,Extreme,Extreme,Surgical,Medicaid,,,,,true,220187.99,146336.94
