Hospital Service Area,Hospital County,Operating Certificate Number,Permanent Facility Id,Facility Name,Age Group,Zip Code - 3 digits,Gender,Race,Ethnicity,Length of Stay,Type of Admission,Patient Disposition,Discharge Year,CCS Diagnosis Code,CCS Diagnosis Description,CCS Procedure Code,CCS Procedure Description,APR DRG Code,APR DRG Description,APR MDC Code,APR MDC Description,APR Severity of Illness Code,APR Severity of Illness Description,APR Risk of Mortality,APR Medical Surgical Description,Payment Typology 1,Payment Typology 2,Payment Typology 3,Birth Weight,Abortion Edit Indicator,Emergency Department Indicator,Total Charges,Total Costs
New York City,Manhattan,7002053,001463,NYU Langone Hospitals,70 or Older,113,F,Other Race,Not Span/Hispanic,2,Elective,Home or Self Care,2019,CIR011,CORONARY ATHEROSCLEROSIS AND OTHER HEART DISEASE,CAR003,CORONARY ARTERY BYPASS GRAFTS (CABG),166,CORONARY BYPASS W/O AMI OR COMPLEX PDX,05,DISEASES AND DISORDERS OF THE CIRCULATORY SYSTEM,2,Moderate,Major,Surgical,Medicare,,,,,false,214819.19,36910.55
New York City,Manhattan,7002053,001463,NYU Langone Hospitals,50 to 69,OOS,M,Other Race,Not Span/Hispanic,3,Elective,Home or Self Care,2019,CIR011,CORONARY ATHEROSCLEROSIS AND OTHER HEART DISEASE,CAR003,CORONARY ARTERY BYPASS GRAFTS (CABG),166,CORONARY BYPASS W/O AMI OR COMPLEX PDX,05,DISEASES AND DISORDERS OF THE CIRCULATORY SYSTEM,2,Moderate,Major,Surgical,Private Health Insurance,,,,,false,222391.92,40291.83
New York City,Manhattan,7002053,001463,NYU Langone Hospitals,50 to 69,112,M,White,Unknown,3,Elective,Home or Self Care,2019,CIR011,CORONARY ATHEROSCLEROSIS AND OTHER HEART DISEASE,CAR003,CORONARY ARTERY BYPASS GRAFTS (CABG),166,CORONARY BYPASS W/O AMI OR COMPLEX PDX,05,DISEASES AND DISORDERS OF THE CIRCULATORY SYSTEM,2,Moderate,Moderate,Surgical,Medicaid,,,,,false,189750.39,35676.02
New York City,Manhattan,7002053,001463,NYU Langone Hospitals,50 to 69,112,M,Other Race,Spanish/Hispanic,5,Elective,Home w/ Home Health Services,2019,CIR011,CORONARY ATHEROSCLEROSIS AND OTHER HEART DISEASE,CAR003,CORONARY ARTERY BYPASS GRAFTS (CABG),166,CORONARY BYPASS W/O AMI OR COMPLEX PDX,05,DISEASES AND DISORDERS OF THE CIRCULATORY SYSTEM,3,Major,Major,Surgical,Medicare,,,,,false,268192.92,55348.94
New York City,Manhattan,7002053,001463,NYU Langone Hospitals,70 or Older,OOS,M,White,Not Span/Hispanic,5,Elective,Home or Self Care,2019,CIR011,CORONARY ATHEROSCLEROSIS AND OTHER HEART DISEASE,CAR003,CORONARY ARTERY BYPASS GRAFTS (CABG),166,CORONARY BYPASS W/O AMI OR COMPLEX PDX,05,DISEASES AND DISORDERS OF THE CIRCULATORY SYSTEM,2,Moderate,Major,Surgical,Medicare,Blue Cross/Blue Shield,,,,false,383823.94,78815.4
New York City,Manhattan,7002053,001463,NYU Langone Hospitals,70 or Older,100,M,White,Not Span/Hispanic,5,Elective,Home w/ Home Health Services,2019,CIR011,CORONARY ATHEROSCLEROSIS AND OTHER HEART DISEASE,CAR003,CORONARY ARTERY BYPASS GRAFTS (CABG),166,CORONARY BYPASS W/O AMI OR COMPLEX PDX,05,DISEASES AND DISORDERS OF THE CIRCULATORY SYSTEM,2,Moderate,Minor,Surgical,Medicare,Blue Cross/Blue Shield,,,,false,206073.93,45737.26
New York City,Manhattan,7002053,001463,NYU Langone Hospitals,70 or Older,114,F,Other Race,Unknown,14,Elective,Inpatient Rehabilitation Facility,2019,CIR011,CORONARY ATHEROSCLEROSIS AND OTHER HEART DISEASE,CAR003,CORONARY ARTERY BYPASS GRAFTS (CABG),166,CORONARY BYPASS W/O AMI OR COMPLEX PDX,05,DISEASES AND DISORDERS OF THE CIRCULATORY SYSTEM,4,Extreme,Extreme,Surgical,Medicaid,,,,,false,1120581.64,226064.65
New York City,Manhattan,7002053,001463,NYU Langone Hospitals,50 to 69,100,M,White,Spanish/Hispanic,6,Elective,Home or Self Care,2019,CIR011,CORONARY ATHEROSCLEROSIS AND OTHER HEART DISEASE,CAR003,CORONARY ARTERY BYPASS GRAFTS (CABG),166,CORONARY BYPASS W/O AMI OR COMPLEX PDX,05,DISEASES AND DISORDERS OF THE CIRCULATORY SYSTEM,2,Moderate,Minor,Surgical,Medicaid,,,,,false,222979.7,48506.04
New York City,Manhattan,7002053,001463,NYU Langone Hospitals,50 to 69,113,M,Other Race,Spanish/Hispanic,5,Elective,Home w/ Home Health Services,2019,CIR011,CORONARY ATHEROSCLEROSIS AND OTHER HEART DISEASE,CAR003,CORONARY ARTERY BYPASS GRAFTS (CABG),166,CORONARY BYPASS W/O AMI OR COMPLEX PDX,05,DISEASES AND DISORDERS OF THE CIRCULATORY SYSTEM,3,Major,Major,Surgical,Medicare,Medicaid,,,,false,327085.37,62509.55
New York City,Manhattan,7002053,001463,NYU Langone Hospitals,70 or Older,114,M,Other Race,Not Span/Hispanic,8,Elective,Home w/ Home Health Services,2019,CIR011,CORONARY ATHEROSCLEROSIS AND OTHER HEART DISEASE,MAM005,MEASUREMENT DURING CARDIAC CATHETERIZATION,166,CORONARY BYPASS W/O AMI OR COMPLEX PDX,05,DISEASES AND DISORDERS OF THE CIRCULATORY SYSTEM,3,Major,Major,Surgical,Private Health Insurance,Medicaid,,,,false,304983.23,66375.85
New York City,Manhattan,7002053,001463,NYU Langone Hospitals,30 to 49,113,M,Other Race,Not Span/Hispanic,5,Elective,Home or Self Care,2019,CIR011,CORONARY ATHEROSCLEROSIS AND OTHER HEART DISEASE,CAR003,CORONARY ARTERY BYPASS GRAFTS (CABG),166,CORONARY BYPASS W/O AMI OR COMPLEX PDX,05,DISEASES AND DISORDERS OF THE CIRCULATORY SYSTEM,3,Major,Major,Surgical,Medicaid,,,,,false,382620.25,81202.79
New York City,Manhattan,7002053,001463,NYU Langone Hospitals,30 to 49,112,M,Multi-racial,Spanish/Hispanic,7,Elective,Home w/ Home Health Services,2019,CIR011,CORONARY ATHEROSCLEROSIS AND OTHER HEART DISEASE,CAR003,CORONARY ARTERY BYPASS GRAFTS (CABG),166,CORONARY BYPASS W/O AMI OR COMPLEX PDX,05,DISEASES AND DISORDERS OF THE CIRCULATORY SYSTEM,3,Major,Major,Surgical,Medicaid,,,,,false,323894.91,70432.7
New York City,Manhattan,7002053,001463,NYU Langone Hospitals,70 or Older,115,F,Black/African American,Not Span/Hispanic,15,Emergency,Inpatient Rehabilitation Facility,2019,CIR011,CORONARY ATHEROSCLEROSIS AND OTHER HEART DISEASE,CAR003,CORONARY ARTERY BYPASS GRAFTS (CABG),166,CORONARY BYPASS W/O AMI OR COMPLEX PDX,05,DISEASES AND DISORDERS OF THE CIRCULATORY SYSTEM,4,Extreme,Extreme,Surgical,Medicare,,,,,false,566779.99,136213.31
New York City,Manhattan,7002053,001463,NYU Langone Hospitals,50 to 69,117,M,White,Not Span/Hispanic,5,Elective,Home or Self Care,2019,CIR011,CORONARY ATHEROSCLEROSIS AND OTHER HEART DISEASE,CAR003,CORONARY ARTERY BYPASS GRAFTS (CABG),166,CORONARY BYPASS W/O AMI OR COMPLEX PDX,05,DISEASES AND DISORDERS OF THE CIRCULATORY SYSTEM,3,Major,Moderate,Surgical,Blue Cross/Blue Shield,,,,,false,196518.5,41336.24
New York City,Manhattan,7002053,001463,NYU Langone Hospitals,70 or Older,113,F,White,Not Span/Hispanic,3,Elective,Home w/ Home Health Services,2019,CIR011,CORONARY ATHEROSCLEROSIS AND OTHER HEART DISEASE,CAR003,CORONARY ARTERY BYPASS GRAFTS (CABG),166,CORONARY BYPASS W/O AMI OR COMPLEX PDX,05,DISEASES AND DISORDERS OF THE CIRCULATORY SYSTEM,3,Major,Major,Surgical,Medicare,,,,,false,178115.79,35849.9
New York City,Manhattan,7002053,001463,NYU Langone Hospitals,70 or Older,110,M,White,Not Span/Hispanic,4,Elective,Home w/ Home Health Services,2019,CIR011,CORONARY ATHEROSCLEROSIS AND OTHER HEART DISEASE,CAR003,CORONARY ARTERY BYPASS GRAFTS (CABG),166,CORONARY BYPASS W/O AMI OR COMPLEX PDX,05,DISEASES AND DISORDERS OF THE CIRCULATORY SYSTEM,3,Major,Major,Surgical,Blue Cross/Blue Shield,Medicare,,,,false,228430.94,47735.77
New York City,Manhattan,7002053,001463,NYU Langone Hospitals,50 to 69,113,M,Other Race,Not Span/Hispanic,3,Elective,Home or Self Care,2019,CIR011,CORONARY ATHEROSCLEROSIS AND OTHER HEART DISEASE,CAR003,CORONARY ARTERY BYPASS GRAFTS (CABG),166,CORONARY BYPASS W/O AMI OR COMPLEX PDX,05,DISEASES AND DISORDERS OF THE CIRCULATORY SYSTEM,2,Moderate,Moderate,Surgical,Medicaid,,,,,false,196484.12,38004.02
New York City,Manhattan,7002053,001463,NYU Langone Hospitals,70 or Older,112,M,White,Not Span/Hispanic,5,Elective,Inpatient Rehabilitation Facility,2019,CIR011,CORONARY ATHEROSCLEROSIS AND OTHER HEART DISEASE,CAR003,CORONARY ARTERY BYPASS GRAFTS (CABG),166,CORONARY BYPASS W/O AMI OR COMPLEX PDX,05,DISEASES AND DISORDERS OF THE CIRCULATORY SYSTEM,3,Major,Moderate,Surgical,Medicare,Medicaid,,,,false,202135.39,44397.01
New York City,Manhattan,7002053,001463,NYU Langone Hospitals,70 or Older,112,M,Other Race,Not Span/Hispanic,10,Emergency,Home w/ Home Health Services,2019,CIR011,CORONARY ATHEROSCLEROSIS AND OTHER HEART DISEASE,CAR003,CORONARY ARTERY BYPASS GRAFTS (CABG),166,CORONARY BYPASS W/O AMI OR COMPLEX PDX,05,DISEASES AND DISORDERS OF THE CIRCULATORY SYSTEM,3,Major,Major,Surgical,Medicare,,,,,true,343772.43,70036.09
New York City,Manhattan,7002053,001463,NYU Langone Hospitals,70 or Older,100,M,White,Not Span/Hispanic,17,Elective,Home w/ Home Health Services,2019,NEO073,BENIGN NEOPLASMS,CAR022,HEART VALVE REPLACEMENT AND OTHER VALVE PROCEDURES (NON-ENDOVASCULAR),166,CORONARY BYPASS W/O AMI OR COMPLEX PDX,05,DISEASES AND DISORDERS OF THE CIRCULATORY SYSTEM,3,Major,Major,Surgical,Medicare,Private Health Insurance,,,,false,455737.91,111117.36
New York City,Manhattan,7002053,001463,NYU Langone Hospitals,50 to 69,111,M,White,Not Span/Hispanic,10,Emergency,Home or Self Care,2019,CIR011,CORONARY ATHEROSCLEROSIS AND OTHER HEART DISEASE,CAR003,CORONARY ARTERY BYPASS GRAFTS (CABG),166,CORONARY BYPASS W/O AMI OR COMPLEX PDX,05,DISEASES AND DISORDERS OF THE CIRCULATORY SYSTEM,3,Major,Moderate,Surgical,Private Health Insurance,,,,,true,338501.93,79392.18
New York City,Manhattan,7002053,001463,NYU Langone Hospitals,50 to 69,109,M,White,Not Span/Hispanic,6,Elective,Home or Self Care,2019,CIR011,CORONARY ATHEROSCLEROSIS AND OTHER HEART DISEASE,CAR003,CORONARY ARTERY BYPASS GRAFTS (CABG),166,CORONARY BYPASS W/O AMI OR COMPLEX PDX,05,DISEASES AND DISORDERS OF THE CIRCULATORY SYSTEM,3,Major,Major,Surgical,Medicare,Medicare,,,,false,226963.07,47123.46
New York City,Manhattan,7002053,001463,NYU Langone Hospitals,70 or Older,OOS,M,White,Not Span/Hispanic,5,Elective,Home w/ Home Health Services,2019,CIR011,CORONARY ATHEROSCLEROSIS AND OTHER HEART DISEASE,CAR003,CORONARY ARTERY BYPASS GRAFTS (CABG),166,CORONARY BYPASS W/O AMI OR COMPLEX PDX,05,DISEASES AND DISORDERS OF THE CIRCULATORY SYSTEM,2,Moderate,Moderate,Surgical,Private Health Insurance,Medicare,,,,false,200450.4,43231.07
New York City,Manhattan,7002053,001463,NYU Langone Hospitals,70 or Older,OOS,M,Black/African American,Not Span/Hispanic,5,Elective,Home or Self Care,2019,CIR011,CORONARY ATHEROSCLEROSIS AND OTHER HEART DISEASE,CAR003,CORONARY ARTERY BYPASS GRAFTS (CABG),166,CORONARY BYPASS W/O AMI OR COMPLEX PDX,05,DISEASES AND DISORDERS OF THE CIRCULATORY SYSTEM,3,Major,Extreme,Surgical,Medicare,Blue Cross/Blue Shield,,,,false,324911.28,60749.77
New York City,Manhattan,7002053,001463,NYU Langone Hospitals,50 to 69,111,M,White,Not Span/Hispanic,7,Emergency,Home w/ Home Health Services,2019,CIR011,CORONARY ATHEROSCLEROSIS AND OTHER HEART DISEASE,CAR003,CORONARY ARTERY BYPASS GRAFTS (CABG),166,CORONARY BYPASS W/O AMI OR COMPLEX PDX,05,DISEASES AND DISORDERS OF THE CIRCULATORY SYSTEM,3,Major,Major,Surgical,Private Health Insurance,,,,,false,327647.03,65468.02
New York City,Manhattan,7002053,001463,NYU Langone Hospitals,50 to 69,111,M,White,Not Span/Hispanic,4,Emergency,Home or Self Care,2019,CIR011,CORONARY ATHEROSCLEROSIS AND OTHER HEART DISEASE,CAR003,CORONARY ARTERY BYPASS GRAFTS (CABG),166,CORONARY BYPASS W/O AMI OR COMPLEX PDX,05,DISEASES AND DISORDERS OF THE CIRCULATORY SYSTEM,3,Major,Major,Surgical,Private Health Insurance,,,,,true,247071.19,51256.11
New York City,Manhattan,7002053,001463,NYU Langone Hospitals,70 or Older,100,M,White,Not Span/Hispanic,4,Elective,Home or Self Care,2019,CIR011,CORONARY ATHEROSCLEROSIS AND OTHER HEART DISEASE,CAR003,CORONARY ARTERY BYPASS GRAFTS (CABG),166,CORONARY BYPASS W/O AMI OR COMPLEX PDX,05,DISEASES AND DISORDERS OF THE CIRCULATORY SYSTEM,3,Major,Major,Surgical,Medicare,Medicare,,,,false,207568.17,41290.55
New York City,Manhattan,7002053,001463,NYU Langone Hospitals,50 to 69,114,M,Other Race,Unknown,4,Elective,Home w/ Home Health Services,2019,CIR011,CORONARY ATHEROSCLEROSIS AND OTHER HEART DISEASE,CAR003,CORONARY ARTERY BYPASS GRAFTS (CABG),166,CORONARY BYPASS W/O AMI OR COMPLEX PDX,05,DISEASES AND DISORDERS OF THE CIRCULATORY SYSTEM,3,Major,Major,Surgical,Medicaid,,,,,false,219636.9,45807.42
New York City,Manhattan,7002053,001463,NYU Langone Hospitals,50 to 69,113,M,Other Race,Not Span/Hispanic,10,Emergency,Home w/ Home Health Services,2019,CIR011,CORONARY ATHEROSCLEROSIS AND OTHER HEART DISEASE,CAR003,CORONARY ARTERY BYPASS GRAFTS (CABG),166,CORONARY BYPASS W/O AMI OR COMPLEX PDX,05,DISEASES AND DISORDERS OF THE CIRCULATORY SYSTEM,3,Major,Major,Surgical,Private Health Insurance,,,,,true,390826.98,85355.23
New York City,Manhattan,7002053,001463,NYU Langone Hospitals,50 to 69,115,M,White,Not Span/Hispanic,8,Elective,Home or Self Care,2019,CIR011,CORONARY ATHEROSCLEROSIS AND OTHER HEART DISEASE,CAR003,CORONARY ARTERY BYPASS GRAFTS (CABG),166,CORONARY BYPASS W/O AMI OR COMPLEX PDX,05,DISEASES AND DISORDERS OF THE CIRCULATORY SYSTEM,3,Major,Major,Surgical,Blue Cross/Blue Shield,,,,,false,315390.91,65664.22
New York City,Manhattan,7002053,001463,NYU Langone Hospitals,70 or Older,107,F,White,Not Span/Hispanic,4,Elective,Home or Self Care,2019,CIR011,CORONARY ATHEROSCLEROSIS AND OTHER HEART DISEASE,CAR003,CORONARY ARTERY BYPASS GRAFTS (CABG),166,CORONARY BYPASS W/O AMI OR COMPLEX PDX,05,DISEASES AND DISORDERS OF THE CIRCULATORY SYSTEM,2,Moderate,Moderate,Surgical,Private Health Insurance,,,,,false,313934.88,54005.85
New York City,Manhattan,7002053,001463,NYU Langone Hospitals,50 to 69,OOS,M,White,Not Span/Hispanic,7,Emergency,Home w/ Home Health Services,2019,CIR011,CORONARY ATHEROSCLEROSIS AND OTHER HEART DISEASE,CAR003,CORONARY ARTERY BYPASS GRAFTS (CABG),166,CORONARY BYPASS W/O AMI OR COMPLEX PDX,05,DISEASES AND DISORDERS OF THE CIRCULATORY SYSTEM,3,Major,Major,Surgical,Blue Cross/Blue Shield,,,,,true,270520.59,58186.39
New York City,Manhattan,7002053,001463,NYU Langone Hospitals,50 to 69,111,M,White,Not Span/Hispanic,5,Elective,Home w/ Home Health Services,2019,CIR011,CORONARY ATHEROSCLEROSIS AND OTHER HEART DISEASE,CAR003,CORONARY ARTERY BYPASS GRAFTS (CABG),166,CORONARY BYPASS W/O AMI OR COMPLEX PDX,05,DISEASES AND DISORDERS OF THE CIRCULATORY SYSTEM,3,Major,Major,Surgical,Medicare,Blue Cross/Blue Shield,,,,false,290327.43,59879.02
New York City,Manhattan,7002053,001463,NYU Langone Hospitals,50 to 69,114,M,Other Race,Not Span/Hispanic,6,Elective,Home w/ Home Health Services,2019,CIR011,CORONARY ATHEROSCLEROSIS AND OTHER HEART DISEASE,CAR003,CORONARY ARTERY BYPASS GRAFTS (CABG),166,CORONARY BYPASS W/O AMI OR COMPLEX PDX,05,DISEASES AND DISORDERS OF THE CIRCULATORY SYSTEM,2,Moderate,Moderate,Surgical,Medicaid,,,,,false,304539.15,60781.63
New York City,Manhattan,7002053,001463,NYU Langone Hospitals,70 or Older,115,M,Black/African American,Not Span/Hispanic,4,Elective,Home or Self Care,2019,CIR011,CORONARY ATHEROSCLEROSIS AND OTHER HEART DISEASE,CAR003,CORONARY ARTERY BYPASS GRAFTS (CABG),166,CORONARY BYPASS W/O AMI OR COMPLEX PDX,05,DISEASES AND DISORDERS OF THE CIRCULATORY SYSTEM,3,Major,Major,Surgical,Medicare,,,,,false,292845.11,55052.08
New York City,Manhattan,7002053,001463,NYU Langone Hospitals,70 or Older,100,M,Other Race,Not Span/Hispanic,8,Emergency,Home or Self Care,2019,CIR011,CORONARY ATHEROSCLEROSIS AND OTHER HEART DISEASE,CAR003,CORONARY ARTERY BYPASS GRAFTS (CABG),166,CORONARY BYPASS W/O AMI OR COMPLEX PDX,05,DISEASES AND DISORDERS OF THE CIRCULATORY SYSTEM,3,Major,Extreme,Surgical,Private Health Insurance,Medicare,,,,true,438522.29,88927.32
New York City,Manhattan,7002053,001463,NYU Langone Hospitals,70 or Older,112,F,White,Not Span/Hispanic,11,Elective,Inpatient Rehabilitation Facility,2019,CIR011,CORONARY ATHEROSCLEROSIS AND OTHER HEART DISEASE,CAR003,CORONARY ARTERY BYPASS GRAFTS (CABG),166,CORONARY BYPASS W/O AMI OR COMPLEX PDX,05,DISEASES AND DISORDERS OF THE CIRCULATORY SYSTEM,3,Major,Major,Surgical,Medicare,Medicaid,,,,false,245128.43,65885.86
New York City,Manhattan,7002053,001463,NYU Langone Hospitals,50 to 69,113,M,Other Race,Spanish/Hispanic,6,Elective,Skilled Nursing Home,2019,CIR011,CORONARY ATHEROSCLEROSIS AND OTHER HEART DISEASE,CAR003,CORONARY ARTERY BYPASS GRAFTS (CABG),166,CORONARY BYPASS W/O AMI OR COMPLEX PDX,05,DISEASES AND DISORDERS OF THE CIRCULATORY SYSTEM,3,Major,Major,Surgical,Medicaid,,,,,false,224192.35,43323.89
New York City,Manhattan,7002053,001463,NYU Langone Hospitals,50 to 69,OOS,M,White,Not Span/Hispanic,3,Elective,Home or Self Care,2019,CIR011,CORONARY ATHEROSCLEROSIS AND OTHER HEART DISEASE,CAR003,CORONARY ARTERY BYPASS GRAFTS (CABG),166,CORONARY BYPASS W/O AMI OR COMPLEX PDX,05,DISEASES AND DISORDERS OF THE CIRCULATORY SYSTEM,1,Minor,Minor,Surgical,Blue Cross/Blue Shield,,,,,false,274163.42,49479.57
New York City,Manhattan,7002053,001463,NYU Langone Hospitals,70 or Older,112,M,Other Race,Spanish/Hispanic,4,Elective,Home or Self Care,2019,CIR011,CORONARY ATHEROSCLEROSIS AND OTHER HEART DISEASE,CAR003,CORONARY ARTERY BYPASS GRAFTS (CABG),166,CORONARY BYPASS W/O AMI OR COMPLEX PDX,05,DISEASES AND DISORDERS OF THE CIRCULATORY SYSTEM,2,Moderate,Major,Surgical,Medicaid,,,,,false,192849.59,39794.52
New York City,Manhattan,7002053,001463,NYU Langone Hospitals,50 to 69,112,M,White,Not Span/Hispanic,5,Elective,Home w/ Home Health Services,2019,CIR011,CORONARY ATHEROSCLEROSIS AND OTHER HEART DISEASE,CAR003,CORONARY ARTERY BYPASS GRAFTS (CABG),166,CORONARY BYPASS W/O AMI OR COMPLEX PDX,05,DISEASES AND DISORDERS OF THE CIRCULATORY SYSTEM,3,Major,Moderate,Surgical,Private Health Insurance,,,,,false,228713.45,45518.01
New York City,Manhattan,7002053,001463,NYU Langone Hospitals,70 or Older,OOS,M,White,Not Span/Hispanic,3,Elective,Home w/ Home Health Services,2019,CIR011,CORONARY ATHEROSCLEROSIS AND OTHER HEART DISEASE,CAR003,CORONARY ARTERY BYPASS GRAFTS (CABG),166,CORONARY BYPASS W/O AMI OR COMPLEX PDX,05,DISEASES AND DISORDERS OF THE CIRCULATORY SYSTEM,3,Major,Major,Surgical,Medicare,Blue Cross/Blue Shield,,,,false,223416.38,40502.41
New York City,Manhattan,7002053,001463,NYU Langone Hospitals,50 to 69,112,M,Black/African American,Not Span/Hispanic,3,Elective,Home or Self Care,2019,CIR011,CORONARY ATHEROSCLEROSIS AND OTHER HEART DISEASE,CAR003,CORONARY ARTERY BYPASS GRAFTS (CABG),166,CORONARY BYPASS W/O AMI OR COMPLEX PDX,05,DISEASES AND DISORDERS OF THE CIRCULATORY SYSTEM,3,Major,Major,Surgical,Medicare,,,,,false,260986.8,46112.57
New York City,Manhattan,7002053,001463,NYU Langone Hospitals,70 or Older,112,M,White,Not Span/Hispanic,9,Elective,Home w/ Home Health Services,2019,CIR011,CORONARY ATHEROSCLEROSIS AND OTHER HEART DISEASE,CAR003,CORONARY ARTERY BYPASS GRAFTS (CABG),166,CORONARY BYPASS W/O AMI OR COMPLEX PDX,05,DISEASES AND DISORDERS OF THE CIRCULATORY SYSTEM,3,Major,Moderate,Surgical,Medicare,Medicaid,,,,false,328607.64,81776.47
New York City,Manhattan,7002053,001463,NYU Langone Hospitals,50 to 69,OOS,M,Other Race,Not Span/Hispanic,4,Elective,Home w/ Home Health Services,2019,CIR011,CORONARY ATHEROSCLEROSIS AND OTHER HEART DISEASE,CAR003,CORONARY ARTERY BYPASS GRAFTS (CABG),166,CORONARY BYPASS W/O AMI OR COMPLEX PDX,05,DISEASES AND DISORDERS OF THE CIRCULATORY SYSTEM,3,Major,Minor,Surgical,Private Health Insurance,,,,,false,201082.86,37915.74
New York City,Manhattan,7002053,001463,NYU Langone Hospitals,50 to 69,113,F,Other Race,Unknown,4,Elective,Home w/ Home Health Services,2019,CIR011,CORONARY ATHEROSCLEROSIS AND OTHER HEART DISEASE,CAR003,CORONARY ARTERY BYPASS GRAFTS (CABG),166,CORONARY BYPASS W/O AMI OR COMPLEX PDX,05,DISEASES AND DISORDERS OF THE CIRCULATORY SYSTEM,3,Major,Moderate,Surgical,Medicare,Medicaid,,,,false,287550.92,50187.58
New York City,Manhattan,7002053,001463,NYU Langone Hospitals,70 or Older,113,M,White,Not Span/Hispanic,13,Elective,Inpatient Rehabilitation Facility,2019,CIR011,CORONARY ATHEROSCLEROSIS AND OTHER HEART DISEASE,CAR003,CORONARY ARTERY BYPASS GRAFTS (CABG),166,CORONARY BYPASS W/O AMI OR COMPLEX PDX,05,DISEASES AND DISORDERS OF THE CIRCULATORY SYSTEM,3,Major,Major,Surgical,Medicaid,,,,,false,430830.54,109702.38
New York City,Manhattan,7002053,001463,NYU Langone Hospitals,70 or Older,112,M,White,Not Span/Hispanic,5,Elective,Home or Self Care,2019,CIR011,CORONARY ATHEROSCLEROSIS AND OTHER HEART DISEASE,CAR003,CORONARY ARTERY BYPASS GRAFTS (CABG),166,CORONARY BYPASS W/O AMI OR COMPLEX PDX,05,DISEASES AND DISORDERS OF THE CIRCULATORY SYSTEM,3,Major,Moderate,Surgical,Medicare,Medicaid,,,,false,179936.54,40038.81
New York City,Manhattan,7002053,001463,NYU Langone Hospitals,50 to 69,112,M,White,Not Span/Hispanic,8,Elective,Home w/ Home Health Services,2019,CIR011,CORONARY ATHEROSCLEROSIS AND OTHER HEART DISEASE,CAR003,CORONARY ARTERY BYPASS GRAFTS (CABG),166,CORONARY BYPASS W/O AMI OR COMPLEX PDX,05,DISEASES AND DISORDERS OF THE CIRCULATORY SYSTEM,3,Major,Major,Surgical,Medicare,,,,,false,311133.03,69161.44
New York City,Manhattan,7002053,001463,NYU Langone Hospitals,70 or Older,112,M,White,Not Span/Hispanic,4,Elective,Home w/ Home Health Services,2019,CIR011,CORONARY ATHEROSCLEROSIS AND OTHER HEART DISEASE,CAR003,CORONARY ARTERY BYPASS GRAFTS (CABG),166,CORONARY BYPASS W/O AMI OR COMPLEX PDX,05,DISEASES AND DISORDERS OF THE CIRCULATORY SYSTEM,3,Major,Moderate,Surgical,Medicare,,,,,false,189081.11,39274.91
New York City,Manhattan,7002053,001463,NYU Langone Hospitals,50 to 69,114,M,Other Race,Not Span/Hispanic,26,Elective,Inpatient Rehabilitation Facility,2019,CIR011,CORONARY ATHEROSCLEROSIS AND OTHER HEART DISEASE,CAR003,CORONARY ARTERY BYPASS GRAFTS (CABG),166,CORONARY BYPASS W/O AMI OR COMPLEX PDX,05,DISEASES AND DISORDERS OF THE CIRCULATORY SYSTEM,4,Extreme,Extreme,Surgical,Medicaid,,,,,false,1048016.32,264194.77
New York City,Manhattan,7002053,001463,NYU Langone Hospitals,70 or Older,113,M,Other Race,Not Span/Hispanic,4,Elective,Home or Self Care,2019,CIR011,CORONARY ATHEROSCLEROSIS AND OTHER HEART DISEASE,MAM005,MEASUREMENT DURING CARDIAC CATHETERIZATION,166,CORONARY BYPASS W/O AMI OR COMPLEX PDX,05,DISEASES AND DISORDERS OF THE CIRCULATORY SYSTEM,2,Moderate,Moderate,Surgical,Medicare,,,,,false,294177.46,55225.94
New York City,Manhattan,7002053,001463,NYU Langone Hospitals,70 or Older,100,M,White,Not Span/Hispanic,4,Elective,Skilled Nursing Home,2019,CIR011,CORONARY ATHEROSCLEROSIS AND OTHER HEART DISEASE,CAR003,CORONARY ARTERY BYPASS GRAFTS (CABG),166,CORONARY BYPASS W/O AMI OR COMPLEX PDX,05,DISEASES AND DISORDERS OF THE CIRCULATORY SYSTEM,3,Major,Major,Surgical,Medicare,,,,,false,241810.5,46932.64
New York City,Manhattan,7002053,001463,NYU Langone Hospitals,50 to 69,100,M,White,Not Span/Hispanic,6,Elective,Home w/ Home Health Services,2019,CIR011,CORONARY ATHEROSCLEROSIS AND OTHER HEART DISEASE,CAR003,CORONARY ARTERY BYPASS GRAFTS (CABG),166,CORONARY BYPASS W/O AMI OR COMPLEX PDX,05,DISEASES AND DISORDERS OF THE CIRCULATORY SYSTEM,3,Major,Moderate,Surgical,Private Health Insurance,,,,,false,191672.86,43507.87
New York City,Manhattan,7002053,001463,NYU Langone Hospitals,50 to 69,OOS,M,White,Not Span/Hispanic,4,Elective,Home or Self Care,2019,CIR032,OTHER SPECIFIED AND UNSPECIFIED CIRCULATORY DISEASE,CAR012,VESSEL REPAIR AND REPLACEMENT,166,CORONARY BYPASS W/O AMI OR COMPLEX PDX,05,DISEASES AND DISORDERS OF THE CIRCULATORY SYSTEM,3,Major,Moderate,Surgical,Private Health Insurance,,,,,false,206739.19,41031.91
New York City,Manhattan,7002053,001463,NYU Langone Hospitals,70 or Older,114,M,White,Not Span/Hispanic,8,Elective,Home w/ Home Health Services,2019,CIR011,CORONARY ATHEROSCLEROSIS AND OTHER HEART DISEASE,CAR003,CORONARY ARTERY BYPASS GRAFTS (CABG),166,CORONARY BYPASS W/O AMI OR COMPLEX PDX,05,DISEASES AND DISORDERS OF THE CIRCULATORY SYSTEM,3,Major,Major,Surgical,Medicare,Medicaid,,,,false,290940.31,60633.58