Hospital Service Area,Hospital County,Operating Certificate Number,Permanent Facility Id,Facility Name,Age Group,Zip Code - 3 digits,Gender,Race,Ethnicity,Length of Stay,Type of Admission,Patient Disposition,Discharge Year,CCS Diagnosis Code,CCS Diagnosis Description,CCS Procedure Code,CCS Procedure Description,APR DRG Code,APR DRG Description,APR MDC Code,APR MDC Description,APR Severity of Illness Code,APR Severity of Illness Description,APR Risk of Mortality,APR Medical Surgical Description,Payment Typology 1,Payment Typology 2,Payment Typology 3,Birth Weight,Abortion Edit Indicator,Emergency Department Indicator,Total Charges,Total Costs
Long Island,Nassau,2908000,000511,NYU Langone Hospital-Long Island,50 to 69,117,M,White,Not Span/Hispanic,6,Elective,Home w/ Home Health Services,2019,CIR011,CORONARY ATHEROSCLEROSIS AND OTHER HEART DISEASE,CAR003,CORONARY ARTERY BYPASS GRAFTS (CABG),166,CORONARY BYPASS W/O AMI OR COMPLEX PDX,05,DISEASES AND DISORDERS OF THE CIRCULATORY SYSTEM,3,Major,Major,Surgical,Blue Cross/Blue Shield,,,,,false,211602.5,34642.69
Long Island,Nassau,2908000,000511,NYU Langone Hospital-Long Island,70 or Older,119,M,White,Not Span/Hispanic,21,Urgent,Skilled Nursing Home,2019,CIR011,CORONARY ATHEROSCLEROSIS AND OTHER HEART DISEASE,GNR005,CONTROL OF BLEEDING (NON-ENDOSCOPIC),166,CORONARY BYPASS W/O AMI OR COMPLEX PDX,05,DISEASES AND DISORDERS OF THE CIRCULATORY SYSTEM,4,Extreme,Extreme,Surgical,Medicare,Medicare,,,,false,639310.55,101611.73
Long Island,Nassau,2908000,000511,NYU Langone Hospital-Long Island,50 to 69,117,F,White,Not Span/Hispanic,5,Elective,Home w/ Home Health Services,2019,CIR011,CORONARY ATHEROSCLEROSIS AND OTHER HEART DISEASE,CAR003,CORONARY ARTERY BYPASS GRAFTS (CABG),166,CORONARY BYPASS W/O AMI OR COMPLEX PDX,05,DISEASES AND DISORDERS OF THE CIRCULATORY SYSTEM,2,Moderate,Moderate,Surgical,Blue Cross/Blue Shield,,,,,false,176223.41,28865.86
Long Island,Nassau,2908000,000511,NYU Langone Hospital-Long Island,50 to 69,117,M,Other Race,Not Span/Hispanic,4,Elective,Home w/ Home Health Services,2019,CIR011,CORONARY ATHEROSCLEROSIS AND OTHER HEART DISEASE,CAR003,CORONARY ARTERY BYPASS GRAFTS (CABG),166,CORONARY BYPASS W/O AMI OR COMPLEX PDX,05,DISEASES AND DISORDERS OF THE CIRCULATORY SYSTEM,3,Major,Extreme,Surgical,Medicaid,,,,,false,187830.41,30263.98
Long Island,Nassau,2908000,000511,NYU Langone Hospital-Long Island,50 to 69,115,M,White,Not Span/Hispanic,15,Urgent,Skilled Nursing Home,2019,CIR011,CORONARY ATHEROSCLEROSIS AND OTHER HEART DISEASE,CAR003,CORONARY ARTERY BYPASS GRAFTS (CABG),166,CORONARY BYPASS W/O AMI OR COMPLEX PDX,05,DISEASES AND DISORDERS OF THE CIRCULATORY SYSTEM,3,Major,Major,Surgical,Private Health Insurance,Medicare,,,,false,365248.28,62388.39
Long Island,Nassau,2908000,000511,NYU Langone Hospital-Long Island,50 to 69,119,M,White,Not Span/Hispanic,6,Urgent,Home w/ Home Health Services,2019,CIR011,CORONARY ATHEROSCLEROSIS AND OTHER HEART DISEASE,CAR003,CORONARY ARTERY BYPASS GRAFTS (CABG),166,CORONARY BYPASS W/O AMI OR COMPLEX PDX,05,DISEASES AND DISORDERS OF THE CIRCULATORY SYSTEM,3,Major,Moderate,Surgical,Medicare,Medicare,,,,false,234769.28,37148.53
Long Island,Nassau,2908000,000511,NYU Langone Hospital-Long Island,70 or Older,119,M,White,Not Span/Hispanic,9,Emergency,Home w/ Home Health Services,2019,CIR011,CORONARY ATHEROSCLEROSIS AND OTHER HEART DISEASE,CAR003,CORONARY ARTERY BYPASS GRAFTS (CABG),166,CORONARY BYPASS W/O AMI OR COMPLEX PDX,05,DISEASES AND DISORDERS OF THE CIRCULATORY SYSTEM,3,Major,Major,Surgical,Medicare,Medicare,,,,true,343207.65,53829.8
Long Island,Nassau,2908000,000511,NYU Langone Hospital-Long Island,50 to 69,117,M,White,Not Span/Hispanic,12,Urgent,Home w/ Home Health Services,2019,CIR011,CORONARY ATHEROSCLEROSIS AND OTHER HEART DISEASE,CAR003,CORONARY ARTERY BYPASS GRAFTS (CABG),166,CORONARY BYPASS W/O AMI OR COMPLEX PDX,05,DISEASES AND DISORDERS OF THE CIRCULATORY SYSTEM,4,Extreme,Extreme,Surgical,Medicaid,Medicaid,,,,true,338775.56,54833.39
Long Island,Nassau,2908000,000511,NYU Langone Hospital-Long Island,70 or Older,117,M,White,Not Span/Hispanic,8,Elective,Skilled Nursing Home,2019,CIR011,CORONARY ATHEROSCLEROSIS AND OTHER HEART DISEASE,CAR003,CORONARY ARTERY BYPASS GRAFTS (CABG),166,CORONARY BYPASS W/O AMI OR COMPLEX PDX,05,DISEASES AND DISORDERS OF THE CIRCULATORY SYSTEM,4,Extreme,Extreme,Surgical,Medicare,Medicare,Blue Cross/Blue Shield,,,false,224471.35,37073.86
Long Island,Nassau,2908000,000511,NYU Langone Hospital-Long Island,70 or Older,115,M,White,Not Span/Hispanic,8,Emergency,Home w/ Home Health Services,2019,CIR011,CORONARY ATHEROSCLEROSIS AND OTHER HEART DISEASE,CAR003,CORONARY ARTERY BYPASS GRAFTS (CABG),166,CORONARY BYPASS W/O AMI OR COMPLEX PDX,05,DISEASES AND DISORDERS OF THE CIRCULATORY SYSTEM,3,Major,Major,Surgical,Medicare,Medicare,Blue Cross/Blue Shield,,,true,275986.17,44781.36
Long Island,Nassau,2908000,000511,NYU Langone Hospital-Long Island,50 to 69,117,F,White,Not Span/Hispanic,5,Urgent,Home w/ Home Health Services,2019,CIR011,CORONARY ATHEROSCLEROSIS AND OTHER HEART DISEASE,CAR003,CORONARY ARTERY BYPASS GRAFTS (CABG),166,CORONARY BYPASS W/O AMI OR COMPLEX PDX,05,DISEASES AND DISORDERS OF THE CIRCULATORY SYSTEM,2,Moderate,Moderate,Surgical,Medicare,Medicare,Private Health Insurance,,,false,227016.09,35279.36
Long Island,Nassau,2908000,000511,NYU Langone Hospital-Long Island,50 to 69,115,M,Other Race,Spanish/Hispanic,6,Emergency,Home w/ Home Health Services,2019,CIR011,CORONARY ATHEROSCLEROSIS AND OTHER HEART DISEASE,CAR003,CORONARY ARTERY BYPASS GRAFTS (CABG),166,CORONARY BYPASS W/O AMI OR COMPLEX PDX,05,DISEASES AND DISORDERS OF THE CIRCULATORY SYSTEM,3,Major,Minor,Surgical,Medicaid,Medicaid,,,,true,219642.79,34670.76
Long Island,Nassau,2908000,000511,NYU Langone Hospital-Long Island,50 to 69,117,M,White,Not Span/Hispanic,13,Urgent,Home w/ Home Health Services,2019,CIR011,CORONARY ATHEROSCLEROSIS AND OTHER HEART DISEASE,CAR003,CORONARY ARTERY BYPASS GRAFTS (CABG),166,CORONARY BYPASS W/O AMI OR COMPLEX PDX,05,DISEASES AND DISORDERS OF THE CIRCULATORY SYSTEM,3,Major,Major,Surgical,Private Health Insurance,,,,,false,327218.92,55185.75
Long Island,Nassau,2908000,000511,NYU Langone Hospital-Long Island,50 to 69,115,M,White,Not Span/Hispanic,5,Urgent,Home w/ Home Health Services,2019,CIR011,CORONARY ATHEROSCLEROSIS AND OTHER HEART DISEASE,CAR003,CORONARY ARTERY BYPASS GRAFTS (CABG),166,CORONARY BYPASS W/O AMI OR COMPLEX PDX,05,DISEASES AND DISORDERS OF THE CIRCULATORY SYSTEM,3,Major,Moderate,Surgical,Medicare,Medicare,Private Health Insurance,,,false,238159.31,36492.79
Long Island,Nassau,2908000,000511,NYU Langone Hospital-Long Island,70 or Older,117,F,White,Not Span/Hispanic,8,Urgent,Home w/ Home Health Services,2019,CIR011,CORONARY ATHEROSCLEROSIS AND OTHER HEART DISEASE,CAR003,CORONARY ARTERY BYPASS GRAFTS (CABG),166,CORONARY BYPASS W/O AMI OR COMPLEX PDX,05,DISEASES AND DISORDERS OF THE CIRCULATORY SYSTEM,3,Major,Major,Surgical,Medicare,Medicare,Private Health Insurance,,,false,369943.88,56054.94
Long Island,Nassau,2908000,000511,NYU Langone Hospital-Long Island,50 to 69,115,M,White,Not Span/Hispanic,8,Emergency,Home w/ Home Health Services,2019,CIR011,CORONARY ATHEROSCLEROSIS AND OTHER HEART DISEASE,MAM005,MEASUREMENT DURING CARDIAC CATHETERIZATION,166,CORONARY BYPASS W/O AMI OR COMPLEX PDX,05,DISEASES AND DISORDERS OF THE CIRCULATORY SYSTEM,3,Major,Moderate,Surgical,Private Health Insurance,,,,,true,260964.86,42186.23
Long Island,Nassau,2908000,000511,NYU Langone Hospital-Long Island,70 or Older,115,M,White,Not Span/Hispanic,7,Elective,Home w/ Home Health Services,2019,CIR011,CORONARY ATHEROSCLEROSIS AND OTHER HEART DISEASE,CAR003,CORONARY ARTERY BYPASS GRAFTS (CABG),166,CORONARY BYPASS W/O AMI OR COMPLEX PDX,05,DISEASES AND DISORDERS OF THE CIRCULATORY SYSTEM,2,Moderate,Moderate,Surgical,Medicare,Medicare,Private Health Insurance,,,false,252214.9,42693.96
Long Island,Nassau,2908000,000511,NYU Langone Hospital-Long Island,50 to 69,113,M,White,Not Span/Hispanic,5,Urgent,Home w/ Home Health Services,2019,CIR011,CORONARY ATHEROSCLEROSIS AND OTHER HEART DISEASE,CAR003,CORONARY ARTERY BYPASS GRAFTS (CABG),166,CORONARY BYPASS W/O AMI OR COMPLEX PDX,05,DISEASES AND DISORDERS OF THE CIRCULATORY SYSTEM,2,Moderate,Minor,Surgical,Private Health Insurance,,,,,false,168477.22,27969.59
Long Island,Nassau,2908000,000511,NYU Langone Hospital-Long Island,70 or Older,115,F,Black/African American,Not Span/Hispanic,9,Elective,Home w/ Home Health Services,2019,CIR011,CORONARY ATHEROSCLEROSIS AND OTHER HEART DISEASE,CAR003,CORONARY ARTERY BYPASS GRAFTS (CABG),166,CORONARY BYPASS W/O AMI OR COMPLEX PDX,05,DISEASES AND DISORDERS OF THE CIRCULATORY SYSTEM,4,Extreme,Extreme,Surgical,Medicare,Medicare,Private Health Insurance,,,false,266344.56,42936.66
Long Island,Nassau,2908000,000511,NYU Langone Hospital-Long Island,50 to 69,115,M,Other Race,Not Span/Hispanic,7,Elective,Home or Self Care,2019,CIR011,CORONARY ATHEROSCLEROSIS AND OTHER HEART DISEASE,CAR003,CORONARY ARTERY BYPASS GRAFTS (CABG),166,CORONARY BYPASS W/O AMI OR COMPLEX PDX,05,DISEASES AND DISORDERS OF THE CIRCULATORY SYSTEM,3,Major,Major,Surgical,Medicare,Medicare,Private Health Insurance,,,false,240709.27,38812.62
Long Island,Nassau,2908000,000511,NYU Langone Hospital-Long Island,50 to 69,114,M,Other Race,Spanish/Hispanic,8,Urgent,Home w/ Home Health Services,2019,CIR011,CORONARY ATHEROSCLEROSIS AND OTHER HEART DISEASE,CAR003,CORONARY ARTERY BYPASS GRAFTS (CABG),166,CORONARY BYPASS W/O AMI OR COMPLEX PDX,05,DISEASES AND DISORDERS OF THE CIRCULATORY SYSTEM,3,Major,Moderate,Surgical,Federal/State/Local/VA,,,,,false,268269.69,43295
Long Island,Nassau,2908000,000511,NYU Langone Hospital-Long Island,50 to 69,114,M,White,Spanish/Hispanic,10,Emergency,Home or Self Care,2019,CIR011,CORONARY ATHEROSCLEROSIS AND OTHER HEART DISEASE,CAR003,CORONARY ARTERY BYPASS GRAFTS (CABG),166,CORONARY BYPASS W/O AMI OR COMPLEX PDX,05,DISEASES AND DISORDERS OF THE CIRCULATORY SYSTEM,3,Major,Minor,Surgical,Private Health Insurance,,,,,true,253401.28,42444.78
Long Island,Nassau,2908000,000511,NYU Langone Hospital-Long Island,50 to 69,113,M,White,Not Span/Hispanic,10,Urgent,Home w/ Home Health Services,2019,CIR011,CORONARY ATHEROSCLEROSIS AND OTHER HEART DISEASE,CAR003,CORONARY ARTERY BYPASS GRAFTS (CABG),166,CORONARY BYPASS W/O AMI OR COMPLEX PDX,05,DISEASES AND DISORDERS OF THE CIRCULATORY SYSTEM,2,Moderate,Minor,Surgical,Private Health Insurance,,,,,false,279442.29,45749.24
Long Island,Nassau,2908000,000511,NYU Langone Hospital-Long Island,70 or Older,115,F,White,Not Span/Hispanic,27,Urgent,Skilled Nursing Home,2019,CIR011,CORONARY ATHEROSCLEROSIS AND OTHER HEART DISEASE,CAR003,CORONARY ARTERY BYPASS GRAFTS (CABG),166,CORONARY BYPASS W/O AMI OR COMPLEX PDX,05,DISEASES AND DISORDERS OF THE CIRCULATORY SYSTEM,4,Extreme,Extreme,Surgical,Medicare,Medicare,,,,false,539764.03,95008.02
Long Island,Nassau,2908000,000511,NYU Langone Hospital-Long Island,50 to 69,118,M,White,Not Span/Hispanic,5,Elective,Home w/ Home Health Services,2019,CIR011,CORONARY ATHEROSCLEROSIS AND OTHER HEART DISEASE,CAR003,CORONARY ARTERY BYPASS GRAFTS (CABG),166,CORONARY BYPASS W/O AMI OR COMPLEX PDX,05,DISEASES AND DISORDERS OF THE CIRCULATORY SYSTEM,3,Major,Moderate,Surgical,Blue Cross/Blue Shield,,,,,false,185166.73,30470.97
Long Island,Nassau,2908000,000511,NYU Langone Hospital-Long Island,70 or Older,115,M,Other Race,Not Span/Hispanic,9,Urgent,Home w/ Home Health Services,2019,CIR011,CORONARY ATHEROSCLEROSIS AND OTHER HEART DISEASE,CAR003,CORONARY ARTERY BYPASS GRAFTS (CABG),166,CORONARY BYPASS W/O AMI OR COMPLEX PDX,05,DISEASES AND DISORDERS OF THE CIRCULATORY SYSTEM,3,Major,Major,Surgical,Medicaid,,,,,true,321132.94,51735.63
Long Island,Nassau,2908000,000511,NYU Langone Hospital-Long Island,50 to 69,,F,Other Race,Not Span/Hispanic,6,Urgent,Home w/ Home Health Services,2019,CIR011,CORONARY ATHEROSCLEROSIS AND OTHER HEART DISEASE,CAR003,CORONARY ARTERY BYPASS GRAFTS (CABG),166,CORONARY BYPASS W/O AMI OR COMPLEX PDX,05,DISEASES AND DISORDERS OF THE CIRCULATORY SYSTEM,3,Major,Major,Surgical,Federal/State/Local/VA,,,,,false,212907.11,33506.76
Long Island,Nassau,2908000,000511,NYU Langone Hospital-Long Island,70 or Older,117,F,White,Not Span/Hispanic,15,Urgent,Skilled Nursing Home,2019,CIR011,CORONARY ATHEROSCLEROSIS AND OTHER HEART DISEASE,CAR003,CORONARY ARTERY BYPASS GRAFTS (CABG),166,CORONARY BYPASS W/O AMI OR COMPLEX PDX,05,DISEASES AND DISORDERS OF THE CIRCULATORY SYSTEM,4,Extreme,Major,Surgical,Medicare,Medicare,,,,false,304086.99,54140.26
Long Island,Nassau,2908000,000511,NYU Langone Hospital-Long Island,70 or Older,115,F,White,Not Span/Hispanic,10,Emergency,Skilled Nursing Home,2019,CIR011,CORONARY ATHEROSCLEROSIS AND OTHER HEART DISEASE,CAR003,CORONARY ARTERY BYPASS GRAFTS (CABG),166,CORONARY BYPASS W/O AMI OR COMPLEX PDX,05,DISEASES AND DISORDERS OF THE CIRCULATORY SYSTEM,3,Major,Major,Surgical,Medicare,Medicare,Blue Cross/Blue Shield,,,true,257009.17,42501.29
Long Island,Nassau,2908000,000511,NYU Langone Hospital-Long Island,70 or Older,117,M,White,Not Span/Hispanic,11,Urgent,Home w/ Home Health Services,2019,CIR011,CORONARY ATHEROSCLEROSIS AND OTHER HEART DISEASE,CAR003,CORONARY ARTERY BYPASS GRAFTS (CABG),166,CORONARY BYPASS W/O AMI OR COMPLEX PDX,05,DISEASES AND DISORDERS OF THE CIRCULATORY SYSTEM,3,Major,Major,Surgical,Medicare,Medicare,Private Health Insurance,,,false,309388.1,51640.92
Long Island,Nassau,2908000,000511,NYU Langone Hospital-Long Island,50 to 69,119,F,White,Not Span/Hispanic,9,Urgent,Home w/ Home Health Services,2019,CIR011,CORONARY ATHEROSCLEROSIS AND OTHER HEART DISEASE,CAR003,CORONARY ARTERY BYPASS GRAFTS (CABG),166,CORONARY BYPASS W/O AMI OR COMPLEX PDX,05,DISEASES AND DISORDERS OF THE CIRCULATORY SYSTEM,2,Moderate,Minor,Surgical,Medicare,Medicare,Blue Cross/Blue Shield,,,false,172079.85,31211.06
Long Island,Nassau,2908000,000511,NYU Langone Hospital-Long Island,70 or Older,116,F,White,Not Span/Hispanic,9,Urgent,Home w/ Home Health Services,2019,CIR011,CORONARY ATHEROSCLEROSIS AND OTHER HEART DISEASE,CAR003,CORONARY ARTERY BYPASS GRAFTS (CABG),166,CORONARY BYPASS W/O AMI OR COMPLEX PDX,05,DISEASES AND DISORDERS OF THE CIRCULATORY SYSTEM,3,Major,Minor,Surgical,Medicare,Medicare,Medicaid,,,false,260726.3,42769.27
Long Island,Nassau,2908000,000511,NYU Langone Hospital-Long Island,50 to 69,117,M,Black/African American,Not Span/Hispanic,4,Elective,Home w/ Home Health Services,2019,CIR011,CORONARY ATHEROSCLEROSIS AND OTHER HEART DISEASE,CAR003,CORONARY ARTERY BYPASS GRAFTS (CABG),166,CORONARY BYPASS W/O AMI OR COMPLEX PDX,05,DISEASES AND DISORDERS OF THE CIRCULATORY SYSTEM,3,Major,Moderate,Surgical,Blue Cross/Blue Shield,Private Health Insurance,,,,false,189650.3,29718.63
Long Island,Nassau,2908000,000511,NYU Langone Hospital-Long Island,30 to 49,114,M,Other Race,Not Span/Hispanic,5,Urgent,Home w/ Home Health Services,2019,CIR011,CORONARY ATHEROSCLEROSIS AND OTHER HEART DISEASE,MAM005,MEASUREMENT DURING CARDIAC CATHETERIZATION,166,CORONARY BYPASS W/O AMI OR COMPLEX PDX,05,DISEASES AND DISORDERS OF THE CIRCULATORY SYSTEM,1,Minor,Minor,Surgical,Federal/State/Local/VA,,,,,false,216378.11,34151.94
Long Island,Nassau,2908000,000511,NYU Langone Hospital-Long Island,70 or Older,110,M,White,Not Span/Hispanic,5,Urgent,Home w/ Home Health Services,2019,CIR011,CORONARY ATHEROSCLEROSIS AND OTHER HEART DISEASE,CAR003,CORONARY ARTERY BYPASS GRAFTS (CABG),166,CORONARY BYPASS W/O AMI OR COMPLEX PDX,05,DISEASES AND DISORDERS OF THE CIRCULATORY SYSTEM,3,Major,Minor,Surgical,Medicare,Medicare,Blue Cross/Blue Shield,,,false,268814.34,40215.68
Long Island,Nassau,2908000,000511,NYU Langone Hospital-Long Island,50 to 69,,F,White,Spanish/Hispanic,9,Urgent,Home w/ Home Health Services,2019,CIR011,CORONARY ATHEROSCLEROSIS AND OTHER HEART DISEASE,CAR003,CORONARY ARTERY BYPASS GRAFTS (CABG),166,CORONARY BYPASS W/O AMI OR COMPLEX PDX,05,DISEASES AND DISORDERS OF THE CIRCULATORY SYSTEM,3,Major,Moderate,Surgical,Medicare,Medicare,,,,false,251013.43,41839.01
Long Island,Nassau,2908000,000511,NYU Langone Hospital-Long Island,50 to 69,115,M,White,Not Span/Hispanic,8,Emergency,Home w/ Home Health Services,2019,CIR011,CORONARY ATHEROSCLEROSIS AND OTHER HEART DISEASE,CAR003,CORONARY ARTERY BYPASS GRAFTS (CABG),166,CORONARY BYPASS W/O AMI OR COMPLEX PDX,05,DISEASES AND DISORDERS OF THE CIRCULATORY SYSTEM,3,Major,Moderate,Surgical,Medicare,Medicare,,,,true,296242.1,46860.16
Long Island,Nassau,2908000,000511,NYU Langone Hospital-Long Island,50 to 69,117,M,Black/African American,Spanish/Hispanic,6,Elective,Home w/ Home Health Services,2019,CIR011,CORONARY ATHEROSCLEROSIS AND OTHER HEART DISEASE,CAR003,CORONARY ARTERY BYPASS GRAFTS (CABG),166,CORONARY BYPASS W/O AMI OR COMPLEX PDX,05,DISEASES AND DISORDERS OF THE CIRCULATORY SYSTEM,3,Major,Major,Surgical,Blue Cross/Blue Shield,,,,,false,181521.27,30403
Long Island,Nassau,2908000,000511,NYU Langone Hospital-Long Island,70 or Older,117,M,Black/African American,Not Span/Hispanic,7,Elective,Home w/ Home Health Services,2019,CIR011,CORONARY ATHEROSCLEROSIS AND OTHER HEART DISEASE,CAR003,CORONARY ARTERY BYPASS GRAFTS (CABG),166,CORONARY BYPASS W/O AMI OR COMPLEX PDX,05,DISEASES AND DISORDERS OF THE CIRCULATORY SYSTEM,2,Moderate,Major,Surgical,Medicare,Medicare,Private Health Insurance,,,false,177512.51,30698.89
Long Island,Nassau,2908000,000511,NYU Langone Hospital-Long Island,70 or Older,115,M,White,Not Span/Hispanic,7,Urgent,Home w/ Home Health Services,2019,CIR011,CORONARY ATHEROSCLEROSIS AND OTHER HEART DISEASE,CAR003,CORONARY ARTERY BYPASS GRAFTS (CABG),166,CORONARY BYPASS W/O AMI OR COMPLEX PDX,05,DISEASES AND DISORDERS OF THE CIRCULATORY SYSTEM,3,Major,Moderate,Surgical,Medicare,Medicare,Blue Cross/Blue Shield,,,false,234863.89,37774.4
Long Island,Nassau,2908000,000511,NYU Langone Hospital-Long Island,70 or Older,115,M,White,Not Span/Hispanic,9,Urgent,Inpatient Rehabilitation Facility,2019,CIR011,CORONARY ATHEROSCLEROSIS AND OTHER HEART DISEASE,CAR003,CORONARY ARTERY BYPASS GRAFTS (CABG),166,CORONARY BYPASS W/O AMI OR COMPLEX PDX,05,DISEASES AND DISORDERS OF THE CIRCULATORY SYSTEM,3,Major,Major,Surgical,Medicare,Medicare,Private Health Insurance,,,false,247225.51,41197.09
Long Island,Nassau,2908000,000511,NYU Langone Hospital-Long Island,70 or Older,115,M,White,Not Span/Hispanic,11,Elective,Home w/ Home Health Services,2019,CIR011,CORONARY ATHEROSCLEROSIS AND OTHER HEART DISEASE,CAR003,CORONARY ARTERY BYPASS GRAFTS (CABG),166,CORONARY BYPASS W/O AMI OR COMPLEX PDX,05,DISEASES AND DISORDERS OF THE CIRCULATORY SYSTEM,4,Extreme,Extreme,Surgical,Medicare,Medicare,,,,false,278884.58,48030.28
Long Island,Nassau,2908000,000511,NYU Langone Hospital-Long Island,70 or Older,118,M,White,Not Span/Hispanic,9,Urgent,Skilled Nursing Home,2019,CIR011,CORONARY ATHEROSCLEROSIS AND OTHER HEART DISEASE,CAR003,CORONARY ARTERY BYPASS GRAFTS (CABG),166,CORONARY BYPASS W/O AMI OR COMPLEX PDX,05,DISEASES AND DISORDERS OF THE CIRCULATORY SYSTEM,3,Major,Major,Surgical,Medicare,Medicare,Private Health Insurance,,,false,263531.15,41832.92
Long Island,Nassau,2908000,000511,NYU Langone Hospital-Long Island,50 to 69,115,M,Other Race,Spanish/Hispanic,4,Elective,Home w/ Home Health Services,2019,CIR011,CORONARY ATHEROSCLEROSIS AND OTHER HEART DISEASE,CAR003,CORONARY ARTERY BYPASS GRAFTS (CABG),166,CORONARY BYPASS W/O AMI OR COMPLEX PDX,05,DISEASES AND DISORDERS OF THE CIRCULATORY SYSTEM,3,Major,Major,Surgical,Private Health Insurance,,,,,false,209555.72,32087.44
Long Island,Nassau,2908000,000511,NYU Langone Hospital-Long Island,70 or Older,115,M,White,Not Span/Hispanic,11,Emergency,Home w/ Home Health Services,2019,CIR011,CORONARY ATHEROSCLEROSIS AND OTHER HEART DISEASE,CAR003,CORONARY ARTERY BYPASS GRAFTS (CABG),166,CORONARY BYPASS W/O AMI OR COMPLEX PDX,05,DISEASES AND DISORDERS OF THE CIRCULATORY SYSTEM,3,Major,Major,Surgical,Medicare,Medicare,,,,true,311709.37,49740.79
Long Island,Nassau,2908000,000511,NYU Langone Hospital-Long Island,70 or Older,117,M,White,Not Span/Hispanic,4,Elective,Home w/ Home Health Services,2019,CIR011,CORONARY ATHEROSCLEROSIS AND OTHER HEART DISEASE,CAR003,CORONARY ARTERY BYPASS GRAFTS (CABG),166,CORONARY BYPASS W/O AMI OR COMPLEX PDX,05,DISEASES AND DISORDERS OF THE CIRCULATORY SYSTEM,2,Moderate,Moderate,Surgical,Medicare,Medicare,,,,false,146701.25,23700.75
Long Island,Nassau,2908000,000511,NYU Langone Hospital-Long Island,70 or Older,117,M,White,Not Span/Hispanic,8,Elective,Skilled Nursing Home,2019,CIR011,CORONARY ATHEROSCLEROSIS AND OTHER HEART DISEASE,CAR003,CORONARY ARTERY BYPASS GRAFTS (CABG),166,CORONARY BYPASS W/O AMI OR COMPLEX PDX,05,DISEASES AND DISORDERS OF THE CIRCULATORY SYSTEM,4,Extreme,Extreme,Surgical,Medicare,Medicare,Private Health Insurance,,,false,315946.63,47229.23
Long Island,Nassau,2908000,000511,NYU Langone Hospital-Long Island,50 to 69,115,M,White,Not Span/Hispanic,7,Emergency,Home w/ Home Health Services,2019,CIR011,CORONARY ATHEROSCLEROSIS AND OTHER HEART DISEASE,CAR003,CORONARY ARTERY BYPASS GRAFTS (CABG),166,CORONARY BYPASS W/O AMI OR COMPLEX PDX,05,DISEASES AND DISORDERS OF THE CIRCULATORY SYSTEM,3,Major,Moderate,Surgical,Blue Cross/Blue Shield,,,,,true,220758.44,35855.04
Long Island,Nassau,2908000,000511,NYU Langone Hospital-Long Island,70 or Older,117,F,White,Not Span/Hispanic,76,Urgent,Skilled Nursing Home,2019,CIR011,CORONARY ATHEROSCLEROSIS AND OTHER HEART DISEASE,CAR003,CORONARY ARTERY BYPASS GRAFTS (CABG),166,CORONARY BYPASS W/O AMI OR COMPLEX PDX,05,DISEASES AND DISORDERS OF THE CIRCULATORY SYSTEM,4,Extreme,Extreme,Surgical,Medicare,Medicare,Blue Cross/Blue Shield,,,false,1829258.78,297437.47
Long Island,Nassau,2908000,000511,NYU Langone Hospital-Long Island,70 or Older,117,M,White,Not Span/Hispanic,6,Urgent,Home w/ Home Health Services,2019,CIR011,CORONARY ATHEROSCLEROSIS AND OTHER HEART DISEASE,CAR003,CORONARY ARTERY BYPASS GRAFTS (CABG),166,CORONARY BYPASS W/O AMI OR COMPLEX PDX,05,DISEASES AND DISORDERS OF THE CIRCULATORY SYSTEM,3,Major,Major,Surgical,Medicare,Medicare,Private Health Insurance,,,false,331976.75,49023.07
Long Island,Nassau,2908000,000511,NYU Langone Hospital-Long Island,70 or Older,117,M,White,Not Span/Hispanic,4,Elective,Home w/ Home Health Services,2019,CIR011,CORONARY ATHEROSCLEROSIS AND OTHER HEART DISEASE,CAR003,CORONARY ARTERY BYPASS GRAFTS (CABG),166,CORONARY BYPASS W/O AMI OR COMPLEX PDX,05,DISEASES AND DISORDERS OF THE CIRCULATORY SYSTEM,3,Major,Major,Surgical,Medicare,Medicare,Private Health Insurance,,,false,156985.36,25246.84
Long Island,Nassau,2908000,000511,NYU Langone Hospital-Long Island,50 to 69,115,M,White,Unknown,5,Urgent,Home w/ Home Health Services,2019,CIR011,CORONARY ATHEROSCLEROSIS AND OTHER HEART DISEASE,CAR003,CORONARY ARTERY BYPASS GRAFTS (CABG),166,CORONARY BYPASS W/O AMI OR COMPLEX PDX,05,DISEASES AND DISORDERS OF THE CIRCULATORY SYSTEM,1,Minor,Minor,Surgical,Federal/State/Local/VA,,,,,false,154777.96,26028.3
Long Island,Nassau,2908000,000511,NYU Langone Hospital-Long Island,70 or Older,113,M,Other Race,Not Span/Hispanic,7,Urgent,Home w/ Home Health Services,2019,CIR011,CORONARY ATHEROSCLEROSIS AND OTHER HEART DISEASE,MAM005,MEASUREMENT DURING CARDIAC CATHETERIZATION,166,CORONARY BYPASS W/O AMI OR COMPLEX PDX,05,DISEASES AND DISORDERS OF THE CIRCULATORY SYSTEM,2,Moderate,Moderate,Surgical,Medicare,Medicare,,,,false,221181.53,36330
Long Island,Nassau,2908000,000511,NYU Langone Hospital-Long Island,70 or Older,113,M,White,Not Span/Hispanic,7,Elective,Home w/ Home Health Services,2019,CIR011,CORONARY ATHEROSCLEROSIS AND OTHER HEART DISEASE,CAR003,CORONARY ARTERY BYPASS GRAFTS (CABG),166,CORONARY BYPASS W/O AMI OR COMPLEX PDX,05,DISEASES AND DISORDERS OF THE CIRCULATORY SYSTEM,4,Extreme,Extreme,Surgical,Medicare,Medicare,,,,false,258106.48,41515.12