Hospital Service Area,Hospital County,Operating Certificate Number,Permanent Facility Id,Facility Name,Age Group,Zip Code - 3 digits,Gender,Race,Ethnicity,Length of Stay,Type of Admission,Patient Disposition,Discharge Year,CCS Diagnosis Code,CCS Diagnosis Description,CCS Procedure Code,CCS Procedure Description,APR DRG Code,APR DRG Description,APR MDC Code,APR MDC Description,APR Severity of Illness Code,APR Severity of Illness Description,APR Risk of Mortality,APR Medical Surgical Description,Payment Typology 1,Payment Typology 2,Payment Typology 3,Birth Weight,Abortion Edit Indicator,Emergency Department Indicator,Total Charges,Total Costs
New York City,Bronx,7000006,003058,Montefiore Med Center - Jack D Weiler Hosp of A Einstein College Div,50 to 69,104,M,Other Race,Spanish/Hispanic,13,Emergency,Home w/ Home Health Services,2020,CIR011,CORONARY ATHEROSCLEROSIS AND OTHER HEART DISEASE,CAR003,CORONARY ARTERY BYPASS GRAFTS (CABG),166,CORONARY BYPASS W/O AMI OR COMPLEX PDX,05,DISEASES AND DISORDERS OF THE CIRCULATORY SYSTEM,3,Major,Minor,Surgical,Medicare,,,,,Y,317287.11,56121.22
New York City,Manhattan,7002024,001456,Mount Sinai Hospital,70 or Older,112,M,White,Not Span/Hispanic,7,Elective,Skilled Nursing Home,2020,CIR011,CORONARY ATHEROSCLEROSIS AND OTHER HEART DISEASE,CAR003,CORONARY ARTERY BYPASS GRAFTS (CABG),166,CORONARY BYPASS W/O AMI OR COMPLEX PDX,05,DISEASES AND DISORDERS OF THE CIRCULATORY SYSTEM,3,Major,Moderate,Surgical,Medicare,Private Health Insurance,Self-Pay,,,N,181351.45,38457.54
New York City,Bronx,7000006,003058,Montefiore Med Center - Jack D Weiler Hosp of A Einstein College Div,50 to 69,108,M,White,Not Span/Hispanic,4,Emergency,Home w/ Home Health Services,2020,CIR011,CORONARY ATHEROSCLEROSIS AND OTHER HEART DISEASE,CAR003,CORONARY ARTERY BYPASS GRAFTS (CABG),166,CORONARY BYPASS W/O AMI OR COMPLEX PDX,05,DISEASES AND DISORDERS OF THE CIRCULATORY SYSTEM,3,Major,Moderate,Surgical,Private Health Insurance,,,,,N,152251.32,28031.64
New York City,Manhattan,7002032,001469,Mount Sinai Morningside,50 to 69,OOS,M,Other Race,Not Span/Hispanic,7,Urgent,Home or Self Care,2020,CIR011,CORONARY ATHEROSCLEROSIS AND OTHER HEART DISEASE,CAR003,CORONARY ARTERY BYPASS GRAFTS (CABG),166,CORONARY BYPASS W/O AMI OR COMPLEX PDX,05,DISEASES AND DISORDERS OF THE CIRCULATORY SYSTEM,3,Major,Major,Surgical,Private Health Insurance,Self-Pay,,,,N,186762.58,47492.64
New York City,Manhattan,7002032,001469,Mount Sinai Morningside,30 to 49,112,F,Other Race,Not Span/Hispanic,3,Elective,Home or Self Care,2020,CIR011,CORONARY ATHEROSCLEROSIS AND OTHER HEART DISEASE,CAR003,CORONARY ARTERY BYPASS GRAFTS (CABG),166,CORONARY BYPASS W/O AMI OR COMPLEX PDX,05,DISEASES AND DISORDERS OF THE CIRCULATORY SYSTEM,3,Major,Major,Surgical,Medicaid,Medicaid,Self-Pay,,,N,98668.03,25952.88
New York City,Manhattan,7002032,001469,Mount Sinai Morningside,50 to 69,103,F,White,Not Span/Hispanic,13,Emergency,Home w/ Home Health Services,2020,CIR011,CORONARY ATHEROSCLEROSIS AND OTHER HEART DISEASE,CAR003,CORONARY ARTERY BYPASS GRAFTS (CABG),166,CORONARY BYPASS W/O AMI OR COMPLEX PDX,05,DISEASES AND DISORDERS OF THE CIRCULATORY SYSTEM,4,Extreme,Extreme,Surgical,Medicare,Blue Cross/Blue Shield,Self-Pay,,,Y,286360.47,69890.51
New York City,Manhattan,7002032,001469,Mount Sinai Morningside,70 or Older,103,M,Other Race,Unknown,10,Urgent,Skilled Nursing Home,2020,CIR011,CORONARY ATHEROSCLEROSIS AND OTHER HEART DISEASE,CAR003,CORONARY ARTERY BYPASS GRAFTS (CABG),166,CORONARY BYPASS W/O AMI OR COMPLEX PDX,05,DISEASES AND DISORDERS OF THE CIRCULATORY SYSTEM,2,Moderate,Moderate,Surgical,Medicare,Medicare,Self-Pay,,,N,227791.6,54496.23
New York City,Manhattan,7002032,001469,Mount Sinai Morningside,50 to 69,112,F,White,Spanish/Hispanic,5,Elective,Home w/ Home Health Services,2020,CIR011,CORONARY ATHEROSCLEROSIS AND OTHER HEART DISEASE,CAR003,CORONARY ARTERY BYPASS GRAFTS (CABG),166,CORONARY BYPASS W/O AMI OR COMPLEX PDX,05,DISEASES AND DISORDERS OF THE CIRCULATORY SYSTEM,3,Major,Moderate,Surgical,Medicare,Medicaid,Self-Pay,,,N,124211.86,30577.97
New York City,Manhattan,7002032,001469,Mount Sinai Morningside,50 to 69,100,M,White,Not Span/Hispanic,14,Urgent,Home or Self Care,2020,CIR011,CORONARY ATHEROSCLEROSIS AND OTHER HEART DISEASE,CAR003,CORONARY ARTERY BYPASS GRAFTS (CABG),166,CORONARY BYPASS W/O AMI OR COMPLEX PDX,05,DISEASES AND DISORDERS OF THE CIRCULATORY SYSTEM,4,Extreme,Extreme,Surgical,Private Health Insurance,Self-Pay,,,,N,268138.12,67091.01
New York City,Manhattan,7002032,001469,Mount Sinai Morningside,70 or Older,107,F,White,Not Span/Hispanic,3,Elective,Home w/ Home Health Services,2020,CIR011,CORONARY ATHEROSCLEROSIS AND OTHER HEART DISEASE,CAR003,CORONARY ARTERY BYPASS GRAFTS (CABG),166,CORONARY BYPASS W/O AMI OR COMPLEX PDX,05,DISEASES AND DISORDERS OF THE CIRCULATORY SYSTEM,2,Moderate,Major,Surgical,Medicare,Private Health Insurance,Self-Pay,,,N,119543.58,31551.6
New York City,Manhattan,7002024,001456,Mount Sinai Hospital,50 to 69,114,F,Other Race,Not Span/Hispanic,11,Elective,Skilled Nursing Home,2020,CIR011,CORONARY ATHEROSCLEROSIS AND OTHER HEART DISEASE,CAR003,CORONARY ARTERY BYPASS GRAFTS (CABG),166,CORONARY BYPASS W/O AMI OR COMPLEX PDX,05,DISEASES AND DISORDERS OF THE CIRCULATORY SYSTEM,4,Extreme,Extreme,Surgical,Medicare,Medicaid,Self-Pay,,,N,257335.6,44143.41
New York City,Manhattan,7002024,001456,Mount Sinai Hospital,70 or Older,111,M,Other Race,Unknown,10,Urgent,Home or Self Care,2020,CIR011,CORONARY ATHEROSCLEROSIS AND OTHER HEART DISEASE,CAR003,CORONARY ARTERY BYPASS GRAFTS (CABG),166,CORONARY BYPASS W/O AMI OR COMPLEX PDX,05,DISEASES AND DISORDERS OF THE CIRCULATORY SYSTEM,3,Major,Extreme,Surgical,Medicaid,Self-Pay,,,,N,204103.81,40532
New York City,Bronx,7000006,001169,Montefiore Medical Center - Henry & Lucy Moses Div,50 to 69,104,M,Other Race,Spanish/Hispanic,15,Elective,Home w/ Home Health Services,2020,CIR011,CORONARY ATHEROSCLEROSIS AND OTHER HEART DISEASE,CAR003,CORONARY ARTERY BYPASS GRAFTS (CABG),166,CORONARY BYPASS W/O AMI OR COMPLEX PDX,05,DISEASES AND DISORDERS OF THE CIRCULATORY SYSTEM,3,Major,Moderate,Surgical,Medicaid,,,,,N,332227.65,61259.68
New York City,Bronx,7000006,001169,Montefiore Medical Center - Henry & Lucy Moses Div,50 to 69,104,M,Black/African American,Not Span/Hispanic,6,Emergency,Home w/ Home Health Services,2020,CIR011,CORONARY ATHEROSCLEROSIS AND OTHER HEART DISEASE,CAR003,CORONARY ARTERY BYPASS GRAFTS (CABG),166,CORONARY BYPASS W/O AMI OR COMPLEX PDX,05,DISEASES AND DISORDERS OF THE CIRCULATORY SYSTEM,2,Moderate,Moderate,Surgical,Medicaid,,,,,Y,189018.12,33239.99
Long Island,Nassau,2908000,000511,NYU Langone Hospital-Long Island,50 to 69,115,M,White,Not Span/Hispanic,8,Elective,Home w/ Home Health Services,2020,CIR011,CORONARY ATHEROSCLEROSIS AND OTHER HEART DISEASE,CAR003,CORONARY ARTERY BYPASS GRAFTS (CABG),166,CORONARY BYPASS W/O AMI OR COMPLEX PDX,05,DISEASES AND DISORDERS OF THE CIRCULATORY SYSTEM,2,Moderate,Moderate,Surgical,Blue Cross/Blue Shield,,,,,N,247503.48,52002.93
Long Island,Nassau,2908000,000511,NYU Langone Hospital-Long Island,50 to 69,115,M,White,Not Span/Hispanic,5,Elective,Home w/ Home Health Services,2020,CIR011,CORONARY ATHEROSCLEROSIS AND OTHER HEART DISEASE,CAR003,CORONARY ARTERY BYPASS GRAFTS (CABG),166,CORONARY BYPASS W/O AMI OR COMPLEX PDX,05,DISEASES AND DISORDERS OF THE CIRCULATORY SYSTEM,3,Major,Moderate,Surgical,Private Health Insurance,,,,,N,241937.87,45040.06
New York City,Manhattan,7002054,001464,New York-Presbyterian Hospital - Columbia Presbyterian Center,50 to 69,109,M,Other Race,Not Span/Hispanic,9,Emergency,Home w/ Home Health Services,2020,CIR011,CORONARY ATHEROSCLEROSIS AND OTHER HEART DISEASE,CAR003,CORONARY ARTERY BYPASS GRAFTS (CABG),166,CORONARY BYPASS W/O AMI OR COMPLEX PDX,05,DISEASES AND DISORDERS OF THE CIRCULATORY SYSTEM,3,Major,Major,Surgical,Medicare,Medicare,Medicaid,,,N,219534.83,59167.47
New York City,Manhattan,7002054,001464,New York-Presbyterian Hospital - Columbia Presbyterian Center,50 to 69,104,M,White,Not Span/Hispanic,5,Elective,Home w/ Home Health Services,2020,CIR011,CORONARY ATHEROSCLEROSIS AND OTHER HEART DISEASE,CAR003,CORONARY ARTERY BYPASS GRAFTS (CABG),166,CORONARY BYPASS W/O AMI OR COMPLEX PDX,05,DISEASES AND DISORDERS OF THE CIRCULATORY SYSTEM,2,Moderate,Moderate,Surgical,Medicaid,Medicaid,Self-Pay,,,N,149815.22,36650.04
New York City,Manhattan,7002054,001464,New York-Presbyterian Hospital - Columbia Presbyterian Center,50 to 69,100,M,Black/African American,Not Span/Hispanic,11,Elective,Home or Self Care,2020,CIR011,CORONARY ATHEROSCLEROSIS AND OTHER HEART DISEASE,CAR003,CORONARY ARTERY BYPASS GRAFTS (CABG),166,CORONARY BYPASS W/O AMI OR COMPLEX PDX,05,DISEASES AND DISORDERS OF THE CIRCULATORY SYSTEM,3,Major,Major,Surgical,Medicaid,Medicaid,Self-Pay,,,N,338594.35,147506
New York City,Manhattan,7002054,001464,New York-Presbyterian Hospital - Columbia Presbyterian Center,70 or Older,106,M,Multi-racial,Not Span/Hispanic,8,Elective,Home w/ Home Health Services,2020,CIR011,CORONARY ATHEROSCLEROSIS AND OTHER HEART DISEASE,CAR003,CORONARY ARTERY BYPASS GRAFTS (CABG),166,CORONARY BYPASS W/O AMI OR COMPLEX PDX,05,DISEASES AND DISORDERS OF THE CIRCULATORY SYSTEM,3,Major,Major,Surgical,Medicare,Medicare,Self-Pay,,,N,271019.52,106389.81
New York City,Manhattan,7002054,001464,New York-Presbyterian Hospital - Columbia Presbyterian Center,50 to 69,100,M,White,Not Span/Hispanic,9,Urgent,Home or Self Care,2020,CIR011,CORONARY ATHEROSCLEROSIS AND OTHER HEART DISEASE,CAR003,CORONARY ARTERY BYPASS GRAFTS (CABG),166,CORONARY BYPASS W/O AMI OR COMPLEX PDX,05,DISEASES AND DISORDERS OF THE CIRCULATORY SYSTEM,3,Major,Moderate,Surgical,Blue Cross/Blue Shield,Self-Pay,,,,N,240006.61,82212.46
New York City,Manhattan,7002054,001464,New York-Presbyterian Hospital - Columbia Presbyterian Center,70 or Older,OOS,M,White,Not Span/Hispanic,6,Elective,Home or Self Care,2020,CIR011,CORONARY ATHEROSCLEROSIS AND OTHER HEART DISEASE,CAR003,CORONARY ARTERY BYPASS GRAFTS (CABG),166,CORONARY BYPASS W/O AMI OR COMPLEX PDX,05,DISEASES AND DISORDERS OF THE CIRCULATORY SYSTEM,2,Moderate,Minor,Surgical,Medicare,Private Health Insurance,Self-Pay,,,N,237920.09,71154.07
New York City,Manhattan,7002054,001464,New York-Presbyterian Hospital - Columbia Presbyterian Center,50 to 69,OOS,M,Other Race,Not Span/Hispanic,18,Emergency,Home or Self Care,2020,CIR011,CORONARY ATHEROSCLEROSIS AND OTHER HEART DISEASE,CAR003,CORONARY ARTERY BYPASS GRAFTS (CABG),166,CORONARY BYPASS W/O AMI OR COMPLEX PDX,05,DISEASES AND DISORDERS OF THE CIRCULATORY SYSTEM,4,Extreme,Extreme,Surgical,Blue Cross/Blue Shield,Self-Pay,,,,N,433670.82,154985.16
New York City,Manhattan,7002054,001464,New York-Presbyterian Hospital - Columbia Presbyterian Center,70 or Older,OOS,M,White,Not Span/Hispanic,41,Emergency,Home or Self Care,2020,CIR011,CORONARY ATHEROSCLEROSIS AND OTHER HEART DISEASE,CAR003,CORONARY ARTERY BYPASS GRAFTS (CABG),166,CORONARY BYPASS W/O AMI OR COMPLEX PDX,05,DISEASES AND DISORDERS OF THE CIRCULATORY SYSTEM,3,Major,Major,Surgical,Medicare,Blue Cross/Blue Shield,Self-Pay,,,N,546827.14,134963.65
New York City,Manhattan,7002054,001464,New York-Presbyterian Hospital - Columbia Presbyterian Center,50 to 69,109,M,White,Spanish/Hispanic,4,Elective,Home or Self Care,2020,CIR011,CORONARY ATHEROSCLEROSIS AND OTHER HEART DISEASE,CAR003,CORONARY ARTERY BYPASS GRAFTS (CABG),166,CORONARY BYPASS W/O AMI OR COMPLEX PDX,05,DISEASES AND DISORDERS OF THE CIRCULATORY SYSTEM,2,Moderate,Minor,Surgical,Medicare,Medicare,Self-Pay,,,N,153206.57,50952.59
New York City,Manhattan,7002054,001464,New York-Presbyterian Hospital - Columbia Presbyterian Center,50 to 69,109,M,Other Race,Not Span/Hispanic,16,Urgent,Home or Self Care,2020,CIR011,CORONARY ATHEROSCLEROSIS AND OTHER HEART DISEASE,CAR003,CORONARY ARTERY BYPASS GRAFTS (CABG),166,CORONARY BYPASS W/O AMI OR COMPLEX PDX,05,DISEASES AND DISORDERS OF THE CIRCULATORY SYSTEM,4,Extreme,Extreme,Surgical,Medicare,Medicare,Self-Pay,,,N,397012.68,134838.84
New York City,Manhattan,7002054,001464,New York-Presbyterian Hospital - Columbia Presbyterian Center,50 to 69,107,M,White,Not Span/Hispanic,8,Elective,Home w/ Home Health Services,2020,CIR011,CORONARY ATHEROSCLEROSIS AND OTHER HEART DISEASE,CAR003,CORONARY ARTERY BYPASS GRAFTS (CABG),166,CORONARY BYPASS W/O AMI OR COMPLEX PDX,05,DISEASES AND DISORDERS OF THE CIRCULATORY SYSTEM,4,Extreme,Extreme,Surgical,Private Health Insurance,Self-Pay,,,,N,334129.61,126025.41
New York City,Manhattan,7002054,001464,New York-Presbyterian Hospital - Columbia Presbyterian Center,50 to 69,,M,Other Race,Not Span/Hispanic,8,Elective,Home w/ Home Health Services,2020,CIR011,CORONARY ATHEROSCLEROSIS AND OTHER HEART DISEASE,CAR003,CORONARY ARTERY BYPASS GRAFTS (CABG),166,CORONARY BYPASS W/O AMI OR COMPLEX PDX,05,DISEASES AND DISORDERS OF THE CIRCULATORY SYSTEM,3,Major,Major,Surgical,Blue Cross/Blue Shield,Medicare,Self-Pay,,,N,306873.73,120956.95
New York City,Manhattan,7002054,001464,New York-Presbyterian Hospital - Columbia Presbyterian Center,50 to 69,OOS,F,Black/African American,Not Span/Hispanic,8,Elective,Home w/ Home Health Services,2020,CIR011,CORONARY ATHEROSCLEROSIS AND OTHER HEART DISEASE,CAR003,CORONARY ARTERY BYPASS GRAFTS (CABG),166,CORONARY BYPASS W/O AMI OR COMPLEX PDX,05,DISEASES AND DISORDERS OF THE CIRCULATORY SYSTEM,2,Moderate,Moderate,Surgical,Blue Cross/Blue Shield,Self-Pay,,,,N,231675.51,101093.96
New York City,Manhattan,7002054,001464,New York-Presbyterian Hospital - Columbia Presbyterian Center,50 to 69,105,M,White,Not Span/Hispanic,6,Urgent,Home w/ Home Health Services,2020,CIR011,CORONARY ATHEROSCLEROSIS AND OTHER HEART DISEASE,CAR003,CORONARY ARTERY BYPASS GRAFTS (CABG),166,CORONARY BYPASS W/O AMI OR COMPLEX PDX,05,DISEASES AND DISORDERS OF THE CIRCULATORY SYSTEM,2,Moderate,Moderate,Surgical,Blue Cross/Blue Shield,Self-Pay,,,,N,199058.27,52937.17
New York City,Manhattan,7002054,001464,New York-Presbyterian Hospital - Columbia Presbyterian Center,50 to 69,112,M,White,Not Span/Hispanic,7,Elective,Home or Self Care,2020,CIR011,CORONARY ATHEROSCLEROSIS AND OTHER HEART DISEASE,CAR003,CORONARY ARTERY BYPASS GRAFTS (CABG),166,CORONARY BYPASS W/O AMI OR COMPLEX PDX,05,DISEASES AND DISORDERS OF THE CIRCULATORY SYSTEM,2,Moderate,Moderate,Surgical,Medicaid,Medicaid,Self-Pay,,,N,259628.14,104180.24
New York City,Manhattan,7002054,001464,New York-Presbyterian Hospital - Columbia Presbyterian Center,70 or Older,105,M,White,Spanish/Hispanic,6,Emergency,Home or Self Care,2020,CIR011,CORONARY ATHEROSCLEROSIS AND OTHER HEART DISEASE,CAR003,CORONARY ARTERY BYPASS GRAFTS (CABG),166,CORONARY BYPASS W/O AMI OR COMPLEX PDX,05,DISEASES AND DISORDERS OF THE CIRCULATORY SYSTEM,3,Major,Minor,Surgical,Medicare,Self-Pay,,,,Y,194470.37,72920.97
New York City,Manhattan,7002054,001464,New York-Presbyterian Hospital - Columbia Presbyterian Center,70 or Older,OOS,M,Other Race,Spanish/Hispanic,9,Urgent,Home or Self Care,2020,CIR011,CORONARY ATHEROSCLEROSIS AND OTHER HEART DISEASE,CAR003,CORONARY ARTERY BYPASS GRAFTS (CABG),166,CORONARY BYPASS W/O AMI OR COMPLEX PDX,05,DISEASES AND DISORDERS OF THE CIRCULATORY SYSTEM,3,Major,Major,Surgical,Medicare,Private Health Insurance,Self-Pay,,,N,317484.03,112651.39
New York City,Manhattan,7002054,001464,New York-Presbyterian Hospital - Columbia Presbyterian Center,50 to 69,OOS,M,White,Multi-ethnic,6,Elective,Home or Self Care,2020,CIR011,CORONARY ATHEROSCLEROSIS AND OTHER HEART DISEASE,CAR003,CORONARY ARTERY BYPASS GRAFTS (CABG),166,CORONARY BYPASS W/O AMI OR COMPLEX PDX,05,DISEASES AND DISORDERS OF THE CIRCULATORY SYSTEM,3,Major,Moderate,Surgical,Private Health Insurance,Self-Pay,,,,N,240054.6,92514.08
New York City,Manhattan,7002054,001464,New York-Presbyterian Hospital - Columbia Presbyterian Center,50 to 69,105,M,White,Not Span/Hispanic,5,Urgent,Home or Self Care,2020,CIR011,CORONARY ATHEROSCLEROSIS AND OTHER HEART DISEASE,CAR003,CORONARY ARTERY BYPASS GRAFTS (CABG),166,CORONARY BYPASS W/O AMI OR COMPLEX PDX,05,DISEASES AND DISORDERS OF THE CIRCULATORY SYSTEM,3,Major,Moderate,Surgical,Private Health Insurance,Self-Pay,,,,N,114716.14,31955.92
New York City,Manhattan,7002054,001464,New York-Presbyterian Hospital - Columbia Presbyterian Center,70 or Older,109,M,White,Not Span/Hispanic,6,Urgent,Home w/ Home Health Services,2020,CIR011,CORONARY ATHEROSCLEROSIS AND OTHER HEART DISEASE,CAR003,CORONARY ARTERY BYPASS GRAFTS (CABG),166,CORONARY BYPASS W/O AMI OR COMPLEX PDX,05,DISEASES AND DISORDERS OF THE CIRCULATORY SYSTEM,3,Major,Moderate,Surgical,Medicare,Medicare,Self-Pay,,,N,246114.47,97820.34
New York City,Manhattan,7002054,001464,New York-Presbyterian Hospital - Columbia Presbyterian Center,30 to 49,127,F,White,Not Span/Hispanic,16,Urgent,Home w/ Home Health Services,2020,CIR011,CORONARY ATHEROSCLEROSIS AND OTHER HEART DISEASE,CAR003,CORONARY ARTERY BYPASS GRAFTS (CABG),166,CORONARY BYPASS W/O AMI OR COMPLEX PDX,05,DISEASES AND DISORDERS OF THE CIRCULATORY SYSTEM,4,Extreme,Extreme,Surgical,Blue Cross/Blue Shield,Self-Pay,,,,N,519231.55,208961.6
New York City,Manhattan,7002024,001456,Mount Sinai Hospital,50 to 69,100,F,Black/African American,Not Span/Hispanic,16,Urgent,Home or Self Care,2020,CIR011,CORONARY ATHEROSCLEROSIS AND OTHER HEART DISEASE,CAR003,CORONARY ARTERY BYPASS GRAFTS (CABG),166,CORONARY BYPASS W/O AMI OR COMPLEX PDX,05,DISEASES AND DISORDERS OF THE CIRCULATORY SYSTEM,4,Extreme,Major,Surgical,Medicaid,Medicaid,Self-Pay,,,N,294357.51,58173.67
New York City,Manhattan,7002024,001456,Mount Sinai Hospital,50 to 69,109,M,White,Unknown,9,Elective,Home or Self Care,2020,CIR011,CORONARY ATHEROSCLEROSIS AND OTHER HEART DISEASE,CAR003,CORONARY ARTERY BYPASS GRAFTS (CABG),166,CORONARY BYPASS W/O AMI OR COMPLEX PDX,05,DISEASES AND DISORDERS OF THE CIRCULATORY SYSTEM,2,Moderate,Moderate,Surgical,Blue Cross/Blue Shield,Self-Pay,,,,N,174435.22,43709.51
New York City,Manhattan,7002053,001463,NYU Langone Hospitals,70 or Older,119,M,White,Not Span/Hispanic,6,Emergency,Home w/ Home Health Services,2020,CIR011,CORONARY ATHEROSCLEROSIS AND OTHER HEART DISEASE,CAR003,CORONARY ARTERY BYPASS GRAFTS (CABG),166,CORONARY BYPASS W/O AMI OR COMPLEX PDX,05,DISEASES AND DISORDERS OF THE CIRCULATORY SYSTEM,2,Moderate,Major,Surgical,Medicare,Medicare,,,,Y,370812.22,60064.2
New York City,Manhattan,7002054,001458,New York-Presbyterian Hospital - New York Weill Cornell Center,50 to 69,112,M,Other Race,Not Span/Hispanic,8,Emergency,Home or Self Care,2020,CIR011,CORONARY ATHEROSCLEROSIS AND OTHER HEART DISEASE,CAR003,CORONARY ARTERY BYPASS GRAFTS (CABG),166,CORONARY BYPASS W/O AMI OR COMPLEX PDX,05,DISEASES AND DISORDERS OF THE CIRCULATORY SYSTEM,2,Moderate,Moderate,Surgical,Medicare,Self-Pay,,,,N,284064.21,109943.9
New York City,Manhattan,7002054,001458,New York-Presbyterian Hospital - New York Weill Cornell Center,50 to 69,114,M,Other Race,Not Span/Hispanic,9,Elective,Home w/ Home Health Services,2020,CIR011,CORONARY ATHEROSCLEROSIS AND OTHER HEART DISEASE,CAR003,CORONARY ARTERY BYPASS GRAFTS (CABG),166,CORONARY BYPASS W/O AMI OR COMPLEX PDX,05,DISEASES AND DISORDERS OF THE CIRCULATORY SYSTEM,3,Major,Major,Surgical,Medicare,Private Health Insurance,Self-Pay,,,N,302108.3,120405.65
New York City,Manhattan,7002054,001458,New York-Presbyterian Hospital - New York Weill Cornell Center,50 to 69,103,M,Black/African American,Not Span/Hispanic,6,Elective,Home or Self Care,2020,CIR011,CORONARY ATHEROSCLEROSIS AND OTHER HEART DISEASE,CAR003,CORONARY ARTERY BYPASS GRAFTS (CABG),166,CORONARY BYPASS W/O AMI OR COMPLEX PDX,05,DISEASES AND DISORDERS OF THE CIRCULATORY SYSTEM,3,Major,Major,Surgical,Blue Cross/Blue Shield,Self-Pay,,,,N,252970.92,86399.1
New York City,Manhattan,7002054,001458,New York-Presbyterian Hospital - New York Weill Cornell Center,70 or Older,OOS,M,White,Not Span/Hispanic,12,Emergency,Home w/ Home Health Services,2020,CIR029,AORTIC; PERIPHERAL; AND VISCERAL ARTERY ANEURYSMS,CAR012,VESSEL REPAIR AND REPLACEMENT,166,CORONARY BYPASS W/O AMI OR COMPLEX PDX,05,DISEASES AND DISORDERS OF THE CIRCULATORY SYSTEM,4,Extreme,Extreme,Surgical,Medicare,Private Health Insurance,Self-Pay,,,N,449377.73,168866.02
New York City,Manhattan,7002054,001458,New York-Presbyterian Hospital - New York Weill Cornell Center,50 to 69,111,M,White,Not Span/Hispanic,7,Elective,Home or Self Care,2020,CIR011,CORONARY ATHEROSCLEROSIS AND OTHER HEART DISEASE,CAR003,CORONARY ARTERY BYPASS GRAFTS (CABG),166,CORONARY BYPASS W/O AMI OR COMPLEX PDX,05,DISEASES AND DISORDERS OF THE CIRCULATORY SYSTEM,4,Extreme,Extreme,Surgical,Private Health Insurance,Self-Pay,,,,N,268964.64,100688.32
New York City,Manhattan,7002054,001458,New York-Presbyterian Hospital - New York Weill Cornell Center,50 to 69,OOS,M,Other Race,Not Span/Hispanic,6,Emergency,Home or Self Care,2020,CIR011,CORONARY ATHEROSCLEROSIS AND OTHER HEART DISEASE,CAR003,CORONARY ARTERY BYPASS GRAFTS (CABG),166,CORONARY BYPASS W/O AMI OR COMPLEX PDX,05,DISEASES AND DISORDERS OF THE CIRCULATORY SYSTEM,3,Major,Major,Surgical,Private Health Insurance,,,,,N,242008.37,92576.57
New York City,Manhattan,7002054,001458,New York-Presbyterian Hospital - New York Weill Cornell Center,70 or Older,113,M,White,Not Span/Hispanic,11,Emergency,Home w/ Home Health Services,2020,CIR011,CORONARY ATHEROSCLEROSIS AND OTHER HEART DISEASE,CAR003,CORONARY ARTERY BYPASS GRAFTS (CABG),166,CORONARY BYPASS W/O AMI OR COMPLEX PDX,05,DISEASES AND DISORDERS OF THE CIRCULATORY SYSTEM,3,Major,Major,Surgical,Medicare,Blue Cross/Blue Shield,Self-Pay,,,N,355241.61,139027.86
New York City,Manhattan,7002054,001458,New York-Presbyterian Hospital - New York Weill Cornell Center,70 or Older,101,M,Other Race,Not Span/Hispanic,11,Emergency,Home or Self Care,2020,CIR011,CORONARY ATHEROSCLEROSIS AND OTHER HEART DISEASE,CAR003,CORONARY ARTERY BYPASS GRAFTS (CABG),166,CORONARY BYPASS W/O AMI OR COMPLEX PDX,05,DISEASES AND DISORDERS OF THE CIRCULATORY SYSTEM,4,Extreme,Extreme,Surgical,Blue Cross/Blue Shield,Medicare,Self-Pay,,,Y,320457.5,124344.97
New York City,Kings,7001021,001306,New York - Presbyterian Brooklyn Methodist Hospital,70 or Older,112,F,Other Race,Spanish/Hispanic,13,Emergency,Inpatient Rehabilitation Facility,2020,CIR011,CORONARY ATHEROSCLEROSIS AND OTHER HEART DISEASE,CAR003,CORONARY ARTERY BYPASS GRAFTS (CABG),166,CORONARY BYPASS W/O AMI OR COMPLEX PDX,05,DISEASES AND DISORDERS OF THE CIRCULATORY SYSTEM,3,Major,Moderate,Surgical,Medicare,Medicaid,Self-Pay,,,N,217991.56,77785.78
New York City,Manhattan,7002024,001456,Mount Sinai Hospital,70 or Older,OOS,M,White,Not Span/Hispanic,11,Elective,Home w/ Home Health Services,2020,CIR011,CORONARY ATHEROSCLEROSIS AND OTHER HEART DISEASE,CAR003,CORONARY ARTERY BYPASS GRAFTS (CABG),166,CORONARY BYPASS W/O AMI OR COMPLEX PDX,05,DISEASES AND DISORDERS OF THE CIRCULATORY SYSTEM,2,Moderate,Moderate,Surgical,Medicare,Blue Cross/Blue Shield,Self-Pay,,,N,203431.33,47320.68
New York City,Manhattan,7002024,001456,Mount Sinai Hospital,50 to 69,101,M,White,Not Span/Hispanic,9,Elective,Home or Self Care,2020,CIR011,CORONARY ATHEROSCLEROSIS AND OTHER HEART DISEASE,CAR003,CORONARY ARTERY BYPASS GRAFTS (CABG),166,CORONARY BYPASS W/O AMI OR COMPLEX PDX,05,DISEASES AND DISORDERS OF THE CIRCULATORY SYSTEM,2,Moderate,Moderate,Surgical,Medicare,Private Health Insurance,Self-Pay,,,N,212132.62,46667.2
New York City,Bronx,7000006,003058,Montefiore Med Center - Jack D Weiler Hosp of A Einstein College Div,50 to 69,104,M,Other Race,Spanish/Hispanic,5,Elective,Home w/ Home Health Services,2020,CIR011,CORONARY ATHEROSCLEROSIS AND OTHER HEART DISEASE,CAR003,CORONARY ARTERY BYPASS GRAFTS (CABG),166,CORONARY BYPASS W/O AMI OR COMPLEX PDX,05,DISEASES AND DISORDERS OF THE CIRCULATORY SYSTEM,2,Moderate,Moderate,Surgical,Private Health Insurance,,,,,N,188137.15,32640.89