Hospital Service Area,Hospital County,Operating Certificate Number,Permanent Facility Id,Facility Name,Age Group,Zip Code - 3 digits,Gender,Race,Ethnicity,Length of Stay,Type of Admission,Patient Disposition,Discharge Year,CCS Diagnosis Code,CCS Diagnosis Description,CCS Procedure Code,CCS Procedure Description,APR DRG Code,APR DRG Description,APR MDC Code,APR MDC Description,APR Severity of Illness Code,APR Severity of Illness Description,APR Risk of Mortality,APR Medical Surgical Description,Payment Typology 1,Payment Typology 2,Payment Typology 3,Birth Weight,Abortion Edit Indicator,Emergency Department Indicator,Total Charges,Total Costs
New York City,Manhattan,7002053,001463,NYU Langone Hospitals,30 to 49,100,M,Other Race,Unknown,5,Emergency,Home or Self Care,2020,CIR009,ACUTE MYOCARDIAL INFARCTION,CAR004,PERCUTANEOUS CORONARY INTERVENTIONS (PCI),167,OTHER CARDIOTHORACIC & THORACIC VASCULAR PROCEDURES,05,DISEASES AND DISORDERS OF THE CIRCULATORY SYSTEM,4,Extreme,Extreme,Surgical,Medicaid,,,,,Y,225394.97,49047.28
New York City,Manhattan,7002053,001463,NYU Langone Hospitals,50 to 69,103,M,Other Race,Spanish/Hispanic,2,Elective,Home or Self Care,2020,NEO073,BENIGN NEOPLASMS,CAR022,HEART VALVE REPLACEMENT AND OTHER VALVE PROCEDURES (NON-ENDOVASCULAR),167,OTHER CARDIOTHORACIC & THORACIC VASCULAR PROCEDURES,05,DISEASES AND DISORDERS OF THE CIRCULATORY SYSTEM,2,Moderate,Minor,Surgical,Blue Cross/Blue Shield,,,,,N,135461.14,25104.8
New York City,Manhattan,7002053,001463,NYU Langone Hospitals,50 to 69,OOS,M,White,Not Span/Hispanic,3,Elective,Home or Self Care,2020,CIR029,AORTIC; PERIPHERAL; AND VISCERAL ARTERY ANEURYSMS,CAR012,VESSEL REPAIR AND REPLACEMENT,167,OTHER CARDIOTHORACIC & THORACIC VASCULAR PROCEDURES,05,DISEASES AND DISORDERS OF THE CIRCULATORY SYSTEM,3,Major,Major,Surgical,Private Health Insurance,,,,,N,261734.83,41345.68
New York City,Manhattan,7002053,001463,NYU Langone Hospitals,30 to 49,115,M,White,Not Span/Hispanic,4,Elective,Home w/ Home Health Services,2020,CIR005,MYOCARDITIS AND CARDIOMYOPATHY,CAR019,SEPTAL REPAIR AND OTHER THERAPEUTIC HEART PROCEDURES,167,OTHER CARDIOTHORACIC & THORACIC VASCULAR PROCEDURES,05,DISEASES AND DISORDERS OF THE CIRCULATORY SYSTEM,1,Minor,Moderate,Surgical,Private Health Insurance,,,,,N,294300.02,49122.21
New York City,Manhattan,7002053,001463,NYU Langone Hospitals,50 to 69,112,M,Black/African American,Not Span/Hispanic,8,Elective,Skilled Nursing Home,2020,CIR005,MYOCARDITIS AND CARDIOMYOPATHY,CAR019,SEPTAL REPAIR AND OTHER THERAPEUTIC HEART PROCEDURES,167,OTHER CARDIOTHORACIC & THORACIC VASCULAR PROCEDURES,05,DISEASES AND DISORDERS OF THE CIRCULATORY SYSTEM,1,Minor,Moderate,Surgical,Medicaid,,,,,N,273041.76,55610.56
New York City,Manhattan,7002053,001463,NYU Langone Hospitals,0 to 17,,M,Multi-racial,Spanish/Hispanic,20,Elective,Short-term Hospital,2020,INJ033,"COMPLICATION OF CARDIOVASCULAR DEVICE, IMPLANT OR GRAFT, INITIAL ENCOUNTER",CAR029,"CARDIOVASCULAR DEVICE PROCEDURES, NEC",167,OTHER CARDIOTHORACIC & THORACIC VASCULAR PROCEDURES,05,DISEASES AND DISORDERS OF THE CIRCULATORY SYSTEM,4,Extreme,Major,Surgical,Medicaid,,,,,N,807365.59,146363.22
New York City,Manhattan,7002053,001463,NYU Langone Hospitals,70 or Older,100,M,White,Not Span/Hispanic,5,Emergency,Home or Self Care,2020,CIR009,ACUTE MYOCARDIAL INFARCTION,CAR005,OTHER CORONARY ARTERY PROCEDURES (EXCLUDING CABG AND PCI),167,OTHER CARDIOTHORACIC & THORACIC VASCULAR PROCEDURES,05,DISEASES AND DISORDERS OF THE CIRCULATORY SYSTEM,2,Moderate,Moderate,Surgical,Medicare,Medicare,,,,Y,203776.81,38936.76
New York City,Manhattan,7002053,001463,NYU Langone Hospitals,0 to 17,115,M,White,Not Span/Hispanic,3,Elective,Home or Self Care,2020,MAL001,CARDIAC AND CIRCULATORY CONGENITAL ANOMALIES,CAR019,SEPTAL REPAIR AND OTHER THERAPEUTIC HEART PROCEDURES,167,OTHER CARDIOTHORACIC & THORACIC VASCULAR PROCEDURES,05,DISEASES AND DISORDERS OF THE CIRCULATORY SYSTEM,1,Minor,Minor,Surgical,Blue Cross/Blue Shield,,,,,N,124357.53,24351.2
New York City,Manhattan,7002053,001463,NYU Langone Hospitals,50 to 69,112,M,White,Not Span/Hispanic,4,Elective,Home or Self Care,2020,MAL001,CARDIAC AND CIRCULATORY CONGENITAL ANOMALIES,CAR019,SEPTAL REPAIR AND OTHER THERAPEUTIC HEART PROCEDURES,167,OTHER CARDIOTHORACIC & THORACIC VASCULAR PROCEDURES,05,DISEASES AND DISORDERS OF THE CIRCULATORY SYSTEM,1,Minor,Minor,Surgical,Private Health Insurance,,,,,N,190130.45,33845.2
New York City,Manhattan,7002053,001463,NYU Langone Hospitals,50 to 69,100,M,White,Not Span/Hispanic,19,Emergency,Skilled Nursing Home,2020,INJ033,"COMPLICATION OF CARDIOVASCULAR DEVICE, IMPLANT OR GRAFT, INITIAL ENCOUNTER",CAR022,HEART VALVE REPLACEMENT AND OTHER VALVE PROCEDURES (NON-ENDOVASCULAR),167,OTHER CARDIOTHORACIC & THORACIC VASCULAR PROCEDURES,05,DISEASES AND DISORDERS OF THE CIRCULATORY SYSTEM,4,Extreme,Extreme,Surgical,Medicare,Medicare,,,,Y,725520.17,144244.68
New York City,Manhattan,7002053,001463,NYU Langone Hospitals,0 to 17,111,M,White,Not Span/Hispanic,7,Emergency,Home or Self Care,2020,MAL001,CARDIAC AND CIRCULATORY CONGENITAL ANOMALIES,CAR022,HEART VALVE REPLACEMENT AND OTHER VALVE PROCEDURES (NON-ENDOVASCULAR),167,OTHER CARDIOTHORACIC & THORACIC VASCULAR PROCEDURES,05,DISEASES AND DISORDERS OF THE CIRCULATORY SYSTEM,1,Minor,Minor,Surgical,Medicaid,,,,,N,226834.61,47174.69
New York City,Manhattan,7002053,001463,NYU Langone Hospitals,50 to 69,110,F,Other Race,Spanish/Hispanic,3,Elective,Home w/ Home Health Services,2020,MAL001,CARDIAC AND CIRCULATORY CONGENITAL ANOMALIES,CAR019,SEPTAL REPAIR AND OTHER THERAPEUTIC HEART PROCEDURES,167,OTHER CARDIOTHORACIC & THORACIC VASCULAR PROCEDURES,05,DISEASES AND DISORDERS OF THE CIRCULATORY SYSTEM,1,Minor,Moderate,Surgical,Blue Cross/Blue Shield,,,,,N,285586.63,46545.27
New York City,Manhattan,7002053,001463,NYU Langone Hospitals,70 or Older,117,M,White,Not Span/Hispanic,4,Elective,Home w/ Home Health Services,2020,CIR005,MYOCARDITIS AND CARDIOMYOPATHY,CAR019,SEPTAL REPAIR AND OTHER THERAPEUTIC HEART PROCEDURES,167,OTHER CARDIOTHORACIC & THORACIC VASCULAR PROCEDURES,05,DISEASES AND DISORDERS OF THE CIRCULATORY SYSTEM,3,Major,Major,Surgical,Blue Cross/Blue Shield,Medicare,,,,N,215273.33,39217.56
New York City,Manhattan,7002053,001463,NYU Langone Hospitals,50 to 69,113,F,White,Not Span/Hispanic,15,Elective,Home or Self Care,2020,CIR005,MYOCARDITIS AND CARDIOMYOPATHY,CAR019,SEPTAL REPAIR AND OTHER THERAPEUTIC HEART PROCEDURES,167,OTHER CARDIOTHORACIC & THORACIC VASCULAR PROCEDURES,05,DISEASES AND DISORDERS OF THE CIRCULATORY SYSTEM,3,Major,Major,Surgical,Medicaid,,,,,N,599338.16,132563.6
New York City,Manhattan,7002053,001463,NYU Langone Hospitals,0 to 17,113,M,Other Race,Not Span/Hispanic,4,Elective,Home or Self Care,2020,MAL001,CARDIAC AND CIRCULATORY CONGENITAL ANOMALIES,CAR012,VESSEL REPAIR AND REPLACEMENT,167,OTHER CARDIOTHORACIC & THORACIC VASCULAR PROCEDURES,05,DISEASES AND DISORDERS OF THE CIRCULATORY SYSTEM,2,Moderate,Minor,Surgical,Private Health Insurance,Private Health Insurance,,,,N,114018.72,35998.9
New York City,Manhattan,7002053,001463,NYU Langone Hospitals,50 to 69,100,M,Other Race,Spanish/Hispanic,14,Elective,Inpatient Rehabilitation Facility,2020,CIR014,PULMONARY HEART DISEASE,CAR007,"EMBOLECTOMY, ENDARTERECTOMY, AND RELATED VESSEL PROCEDURES (NON-ENDOVASCULAR; EXCLUDING CAROTID)",167,OTHER CARDIOTHORACIC & THORACIC VASCULAR PROCEDURES,05,DISEASES AND DISORDERS OF THE CIRCULATORY SYSTEM,4,Extreme,Major,Surgical,Private Health Insurance,Medicaid,,,,N,711450.8,149243.46
New York City,Manhattan,7002053,001463,NYU Langone Hospitals,50 to 69,100,F,White,Not Span/Hispanic,3,Elective,Home or Self Care,2020,NEO073,BENIGN NEOPLASMS,CAR019,SEPTAL REPAIR AND OTHER THERAPEUTIC HEART PROCEDURES,167,OTHER CARDIOTHORACIC & THORACIC VASCULAR PROCEDURES,05,DISEASES AND DISORDERS OF THE CIRCULATORY SYSTEM,1,Minor,Minor,Surgical,Private Health Insurance,,,,,N,163768.78,30805.21
New York City,Manhattan,7002053,001463,NYU Langone Hospitals,18 to 29,112,M,Other Race,Not Span/Hispanic,10,Elective,Home or Self Care,2020,CIR005,MYOCARDITIS AND CARDIOMYOPATHY,CAR022,HEART VALVE REPLACEMENT AND OTHER VALVE PROCEDURES (NON-ENDOVASCULAR),167,OTHER CARDIOTHORACIC & THORACIC VASCULAR PROCEDURES,05,DISEASES AND DISORDERS OF THE CIRCULATORY SYSTEM,3,Major,Moderate,Surgical,Private Health Insurance,,,,,N,264192.67,60399.99
New York City,Manhattan,7002053,001463,NYU Langone Hospitals,50 to 69,115,M,White,Not Span/Hispanic,7,Elective,Home or Self Care,2020,INJ033,"COMPLICATION OF CARDIOVASCULAR DEVICE, IMPLANT OR GRAFT, INITIAL ENCOUNTER",CAR011,ANEURYSM REPAIR PROCEDURES,167,OTHER CARDIOTHORACIC & THORACIC VASCULAR PROCEDURES,05,DISEASES AND DISORDERS OF THE CIRCULATORY SYSTEM,3,Major,Major,Surgical,Blue Cross/Blue Shield,,,,,N,316226.57,75606.45
New York City,Manhattan,7002053,001463,NYU Langone Hospitals,50 to 69,OOS,M,White,Not Span/Hispanic,8,Elective,Home or Self Care,2020,CIR029,AORTIC; PERIPHERAL; AND VISCERAL ARTERY ANEURYSMS,CAR012,VESSEL REPAIR AND REPLACEMENT,167,OTHER CARDIOTHORACIC & THORACIC VASCULAR PROCEDURES,05,DISEASES AND DISORDERS OF THE CIRCULATORY SYSTEM,3,Major,Major,Surgical,Private Health Insurance,,,,,N,642115.87,130861.75
New York City,Manhattan,7002053,001463,NYU Langone Hospitals,50 to 69,117,F,Other Race,Not Span/Hispanic,8,Elective,Home or Self Care,2020,CIR005,MYOCARDITIS AND CARDIOMYOPATHY,CAR019,SEPTAL REPAIR AND OTHER THERAPEUTIC HEART PROCEDURES,167,OTHER CARDIOTHORACIC & THORACIC VASCULAR PROCEDURES,05,DISEASES AND DISORDERS OF THE CIRCULATORY SYSTEM,3,Major,Major,Surgical,Medicaid,,,,,N,400728.53,88640.34
New York City,Manhattan,7002053,001463,NYU Langone Hospitals,0 to 17,113,F,Other Race,Not Span/Hispanic,2,Elective,Home or Self Care,2020,MAL001,CARDIAC AND CIRCULATORY CONGENITAL ANOMALIES,CAR019,SEPTAL REPAIR AND OTHER THERAPEUTIC HEART PROCEDURES,167,OTHER CARDIOTHORACIC & THORACIC VASCULAR PROCEDURES,05,DISEASES AND DISORDERS OF THE CIRCULATORY SYSTEM,3,Major,Major,Surgical,Medicaid,,,,,N,129251.72,27524.16
New York City,Manhattan,7002053,001463,NYU Langone Hospitals,70 or Older,112,F,White,Not Span/Hispanic,20,Emergency,Inpatient Rehabilitation Facility,2020,NEO011,CARDIAC CANCERS,CAR001,HEART BIOPSY,167,OTHER CARDIOTHORACIC & THORACIC VASCULAR PROCEDURES,05,DISEASES AND DISORDERS OF THE CIRCULATORY SYSTEM,3,Major,Major,Surgical,Medicare,Medicare,,,,Y,622447.11,127738.02
New York City,Manhattan,7002053,001463,NYU Langone Hospitals,0 to 17,104,F,Other Race,Spanish/Hispanic,3,Elective,Home or Self Care,2020,MAL001,CARDIAC AND CIRCULATORY CONGENITAL ANOMALIES,CAR019,SEPTAL REPAIR AND OTHER THERAPEUTIC HEART PROCEDURES,167,OTHER CARDIOTHORACIC & THORACIC VASCULAR PROCEDURES,05,DISEASES AND DISORDERS OF THE CIRCULATORY SYSTEM,3,Major,Moderate,Surgical,Medicaid,,,,,N,160608.84,37273.72
New York City,Manhattan,7002053,001463,NYU Langone Hospitals,70 or Older,113,F,Other Race,Not Span/Hispanic,21,Elective,Inpatient Rehabilitation Facility,2020,CIR029,AORTIC; PERIPHERAL; AND VISCERAL ARTERY ANEURYSMS,CAR011,ANEURYSM REPAIR PROCEDURES,167,OTHER CARDIOTHORACIC & THORACIC VASCULAR PROCEDURES,05,DISEASES AND DISORDERS OF THE CIRCULATORY SYSTEM,4,Extreme,Extreme,Surgical,Medicare,,,,,N,1683626.66,285859.17
New York City,Manhattan,7002053,001463,NYU Langone Hospitals,0 to 17,112,F,Other Race,Not Span/Hispanic,3,Elective,Home or Self Care,2020,MAL001,CARDIAC AND CIRCULATORY CONGENITAL ANOMALIES,CAR013,HEART AND GREAT VESSEL BYPASS PROCEDURES,167,OTHER CARDIOTHORACIC & THORACIC VASCULAR PROCEDURES,05,DISEASES AND DISORDERS OF THE CIRCULATORY SYSTEM,1,Minor,Moderate,Surgical,Medicaid,,,,,N,153507.64,36003.42
New York City,Manhattan,7002053,001463,NYU Langone Hospitals,50 to 69,101,M,White,Not Span/Hispanic,5,Elective,Inpatient Rehabilitation Facility,2020,CIR014,PULMONARY HEART DISEASE,CAR007,"EMBOLECTOMY, ENDARTERECTOMY, AND RELATED VESSEL PROCEDURES (NON-ENDOVASCULAR; EXCLUDING CAROTID)",167,OTHER CARDIOTHORACIC & THORACIC VASCULAR PROCEDURES,05,DISEASES AND DISORDERS OF THE CIRCULATORY SYSTEM,3,Major,Extreme,Surgical,Medicaid,,,,,N,292193.07,54240.78
New York City,Manhattan,7002053,001463,NYU Langone Hospitals,0 to 17,104,M,Other Race,Spanish/Hispanic,5,Elective,Home or Self Care,2020,MAL001,CARDIAC AND CIRCULATORY CONGENITAL ANOMALIES,CAR011,ANEURYSM REPAIR PROCEDURES,167,OTHER CARDIOTHORACIC & THORACIC VASCULAR PROCEDURES,05,DISEASES AND DISORDERS OF THE CIRCULATORY SYSTEM,3,Major,Moderate,Surgical,Medicaid,,,,,N,139194.41,44388.89
New York City,Manhattan,7002053,001463,NYU Langone Hospitals,50 to 69,112,M,Other Race,Not Span/Hispanic,43,Elective,Skilled Nursing Home,2020,CIR029,AORTIC; PERIPHERAL; AND VISCERAL ARTERY ANEURYSMS,CAR012,VESSEL REPAIR AND REPLACEMENT,167,OTHER CARDIOTHORACIC & THORACIC VASCULAR PROCEDURES,05,DISEASES AND DISORDERS OF THE CIRCULATORY SYSTEM,4,Extreme,Extreme,Surgical,Medicaid,,,,,N,1113187.11,286782.37
New York City,Manhattan,7002053,001463,NYU Langone Hospitals,0 to 17,104,M,Other Race,Not Span/Hispanic,4,Elective,Home or Self Care,2020,MAL001,CARDIAC AND CIRCULATORY CONGENITAL ANOMALIES,CAR019,SEPTAL REPAIR AND OTHER THERAPEUTIC HEART PROCEDURES,167,OTHER CARDIOTHORACIC & THORACIC VASCULAR PROCEDURES,05,DISEASES AND DISORDERS OF THE CIRCULATORY SYSTEM,2,Moderate,Minor,Surgical,Medicaid,,,,,N,162237.34,42137.6
New York City,Manhattan,7002053,001463,NYU Langone Hospitals,0 to 17,113,M,Other Race,Spanish/Hispanic,5,Elective,Home or Self Care,2020,MAL001,CARDIAC AND CIRCULATORY CONGENITAL ANOMALIES,CAR019,SEPTAL REPAIR AND OTHER THERAPEUTIC HEART PROCEDURES,167,OTHER CARDIOTHORACIC & THORACIC VASCULAR PROCEDURES,05,DISEASES AND DISORDERS OF THE CIRCULATORY SYSTEM,3,Major,Major,Surgical,Medicaid,,,,,N,375539.47,74972.84
New York City,Manhattan,7002053,001463,NYU Langone Hospitals,50 to 69,113,F,Other Race,Not Span/Hispanic,3,Elective,Home or Self Care,2020,NEO073,BENIGN NEOPLASMS,CAR019,SEPTAL REPAIR AND OTHER THERAPEUTIC HEART PROCEDURES,167,OTHER CARDIOTHORACIC & THORACIC VASCULAR PROCEDURES,05,DISEASES AND DISORDERS OF THE CIRCULATORY SYSTEM,1,Minor,Moderate,Surgical,Medicare,,,,,N,196091.92,31842.61
New York City,Manhattan,7002053,001463,NYU Langone Hospitals,70 or Older,100,F,Other Race,Spanish/Hispanic,2,Emergency,Home or Self Care,2020,CIR009,ACUTE MYOCARDIAL INFARCTION,MAM005,MEASUREMENT DURING CARDIAC CATHETERIZATION,167,OTHER CARDIOTHORACIC & THORACIC VASCULAR PROCEDURES,05,DISEASES AND DISORDERS OF THE CIRCULATORY SYSTEM,2,Moderate,Minor,Surgical,Medicare,Blue Cross/Blue Shield,,,,Y,193257.61,34293.29
New York City,Manhattan,7002053,001463,NYU Langone Hospitals,0 to 17,103,F,White,Not Span/Hispanic,3,Elective,Home or Self Care,2020,MAL001,CARDIAC AND CIRCULATORY CONGENITAL ANOMALIES,CAR019,SEPTAL REPAIR AND OTHER THERAPEUTIC HEART PROCEDURES,167,OTHER CARDIOTHORACIC & THORACIC VASCULAR PROCEDURES,05,DISEASES AND DISORDERS OF THE CIRCULATORY SYSTEM,3,Major,Moderate,Surgical,Private Health Insurance,,,,,N,410666.51,62963.69
New York City,Manhattan,7002053,001463,NYU Langone Hospitals,50 to 69,112,M,Other Race,Spanish/Hispanic,8,Elective,Inpatient Rehabilitation Facility,2020,CIR029,AORTIC; PERIPHERAL; AND VISCERAL ARTERY ANEURYSMS,CAR012,VESSEL REPAIR AND REPLACEMENT,167,OTHER CARDIOTHORACIC & THORACIC VASCULAR PROCEDURES,05,DISEASES AND DISORDERS OF THE CIRCULATORY SYSTEM,4,Extreme,Extreme,Surgical,Medicare,,,,,N,393922.63,74000.43
New York City,Manhattan,7002053,001463,NYU Langone Hospitals,50 to 69,105,F,Other Race,Unknown,9,Emergency,Home or Self Care,2020,CIR014,PULMONARY HEART DISEASE,CAR007,"EMBOLECTOMY, ENDARTERECTOMY, AND RELATED VESSEL PROCEDURES (NON-ENDOVASCULAR; EXCLUDING CAROTID)",167,OTHER CARDIOTHORACIC & THORACIC VASCULAR PROCEDURES,05,DISEASES AND DISORDERS OF THE CIRCULATORY SYSTEM,3,Major,Moderate,Surgical,Medicaid,,,,,N,456221.87,92629.15
New York City,Manhattan,7002053,001463,NYU Langone Hospitals,50 to 69,124,F,White,Not Span/Hispanic,6,Elective,Home w/ Home Health Services,2020,CIR005,MYOCARDITIS AND CARDIOMYOPATHY,CAR019,SEPTAL REPAIR AND OTHER THERAPEUTIC HEART PROCEDURES,167,OTHER CARDIOTHORACIC & THORACIC VASCULAR PROCEDURES,05,DISEASES AND DISORDERS OF THE CIRCULATORY SYSTEM,1,Minor,Major,Surgical,Blue Cross/Blue Shield,,,,,N,229225.26,45366.15
New York City,Manhattan,7002053,001463,NYU Langone Hospitals,0 to 17,112,F,White,Not Span/Hispanic,38,Emergency,Home w/ Home Health Services,2020,MAL001,CARDIAC AND CIRCULATORY CONGENITAL ANOMALIES,CAR012,VESSEL REPAIR AND REPLACEMENT,167,OTHER CARDIOTHORACIC & THORACIC VASCULAR PROCEDURES,05,DISEASES AND DISORDERS OF THE CIRCULATORY SYSTEM,4,Extreme,Extreme,Surgical,Private Health Insurance,Private Health Insurance,,,,Y,909930.32,287410.42
New York City,Manhattan,7002053,001463,NYU Langone Hospitals,0 to 17,104,F,Other Race,Unknown,5,Emergency,Home or Self Care,2020,INJ033,"COMPLICATION OF CARDIOVASCULAR DEVICE, IMPLANT OR GRAFT, INITIAL ENCOUNTER",CAR029,"CARDIOVASCULAR DEVICE PROCEDURES, NEC",167,OTHER CARDIOTHORACIC & THORACIC VASCULAR PROCEDURES,05,DISEASES AND DISORDERS OF THE CIRCULATORY SYSTEM,4,Extreme,Extreme,Surgical,Medicaid,,,,,Y,264800.15,47547.08
New York City,Manhattan,7002053,001463,NYU Langone Hospitals,0 to 17,104,F,Other Race,Unknown,5,Emergency,Home or Self Care,2020,MAL001,CARDIAC AND CIRCULATORY CONGENITAL ANOMALIES,CAR019,SEPTAL REPAIR AND OTHER THERAPEUTIC HEART PROCEDURES,167,OTHER CARDIOTHORACIC & THORACIC VASCULAR PROCEDURES,05,DISEASES AND DISORDERS OF THE CIRCULATORY SYSTEM,2,Moderate,Moderate,Surgical,Medicaid,,,,,N,198680.51,49220.56
New York City,Manhattan,7002053,001463,NYU Langone Hospitals,0 to 17,100,F,Other Race,Unknown,3,Emergency,Home or Self Care,2020,MAL001,CARDIAC AND CIRCULATORY CONGENITAL ANOMALIES,CAR012,VESSEL REPAIR AND REPLACEMENT,167,OTHER CARDIOTHORACIC & THORACIC VASCULAR PROCEDURES,05,DISEASES AND DISORDERS OF THE CIRCULATORY SYSTEM,1,Minor,Minor,Surgical,Medicaid,,,,,N,89271.43,19513.1
New York City,Manhattan,7002053,001463,NYU Langone Hospitals,0 to 17,104,F,Other Race,Not Span/Hispanic,7,Emergency,Home or Self Care,2020,MAL001,CARDIAC AND CIRCULATORY CONGENITAL ANOMALIES,CAR012,VESSEL REPAIR AND REPLACEMENT,167,OTHER CARDIOTHORACIC & THORACIC VASCULAR PROCEDURES,05,DISEASES AND DISORDERS OF THE CIRCULATORY SYSTEM,1,Minor,Moderate,Surgical,Medicaid,,,,,N,302995.24,76728.54
New York City,Manhattan,7002053,001463,NYU Langone Hospitals,0 to 17,100,M,Other Race,Not Span/Hispanic,4,Emergency,Home or Self Care,2020,MAL001,CARDIAC AND CIRCULATORY CONGENITAL ANOMALIES,CAR019,SEPTAL REPAIR AND OTHER THERAPEUTIC HEART PROCEDURES,167,OTHER CARDIOTHORACIC & THORACIC VASCULAR PROCEDURES,05,DISEASES AND DISORDERS OF THE CIRCULATORY SYSTEM,3,Major,Major,Surgical,Private Health Insurance,,,,,N,190552.39,34104.05
New York City,Manhattan,7002053,001463,NYU Langone Hospitals,30 to 49,111,F,White,Not Span/Hispanic,6,Elective,Home or Self Care,2020,CIR005,MYOCARDITIS AND CARDIOMYOPATHY,CAR019,SEPTAL REPAIR AND OTHER THERAPEUTIC HEART PROCEDURES,167,OTHER CARDIOTHORACIC & THORACIC VASCULAR PROCEDURES,05,DISEASES AND DISORDERS OF THE CIRCULATORY SYSTEM,1,Minor,Moderate,Surgical,Blue Cross/Blue Shield,,,,,N,246875.05,47013.47
New York City,Manhattan,7002053,001463,NYU Langone Hospitals,70 or Older,113,M,White,Not Span/Hispanic,9,Emergency,Home or Self Care,2020,INJ033,"COMPLICATION OF CARDIOVASCULAR DEVICE, IMPLANT OR GRAFT, INITIAL ENCOUNTER",CAR026,PACEMAKER AND DEFIBRILLATOR PROCEDURES,167,OTHER CARDIOTHORACIC & THORACIC VASCULAR PROCEDURES,05,DISEASES AND DISORDERS OF THE CIRCULATORY SYSTEM,2,Moderate,Major,Surgical,Medicare,,,,,Y,667410.35,129307.98
New York City,Manhattan,7002053,001463,NYU Langone Hospitals,0 to 17,104,M,Black/African American,Not Span/Hispanic,5,Elective,Home or Self Care,2020,MAL001,CARDIAC AND CIRCULATORY CONGENITAL ANOMALIES,CAR019,SEPTAL REPAIR AND OTHER THERAPEUTIC HEART PROCEDURES,167,OTHER CARDIOTHORACIC & THORACIC VASCULAR PROCEDURES,05,DISEASES AND DISORDERS OF THE CIRCULATORY SYSTEM,3,Major,Moderate,Surgical,Medicaid,,,,,N,302283.93,65019.21
New York City,Manhattan,7002053,001463,NYU Langone Hospitals,30 to 49,OOS,M,White,Not Span/Hispanic,5,Elective,Home or Self Care,2020,CIR005,MYOCARDITIS AND CARDIOMYOPATHY,CAR019,SEPTAL REPAIR AND OTHER THERAPEUTIC HEART PROCEDURES,167,OTHER CARDIOTHORACIC & THORACIC VASCULAR PROCEDURES,05,DISEASES AND DISORDERS OF THE CIRCULATORY SYSTEM,1,Minor,Moderate,Surgical,Private Health Insurance,,,,,N,248810.98,45656.29
New York City,Manhattan,7002053,001463,NYU Langone Hospitals,70 or Older,100,M,White,Not Span/Hispanic,1,Emergency,Expired,2020,CIR027,ARTERIAL DISSECTIONS,CAR012,VESSEL REPAIR AND REPLACEMENT,167,OTHER CARDIOTHORACIC & THORACIC VASCULAR PROCEDURES,05,DISEASES AND DISORDERS OF THE CIRCULATORY SYSTEM,3,Major,Extreme,Surgical,Medicare,Blue Cross/Blue Shield,,,,Y,475116.02,55427.53
New York City,Manhattan,7002053,001463,NYU Langone Hospitals,0 to 17,112,M,White,Not Span/Hispanic,5,Elective,Home or Self Care,2020,MAL001,CARDIAC AND CIRCULATORY CONGENITAL ANOMALIES,CAR012,VESSEL REPAIR AND REPLACEMENT,167,OTHER CARDIOTHORACIC & THORACIC VASCULAR PROCEDURES,05,DISEASES AND DISORDERS OF THE CIRCULATORY SYSTEM,2,Moderate,Minor,Surgical,Private Health Insurance,,,,,N,110371.48,28291.15
New York City,Manhattan,7002053,001463,NYU Langone Hospitals,0 to 17,112,F,White,Unknown,8,Emergency,Home or Self Care,2020,INJ033,"COMPLICATION OF CARDIOVASCULAR DEVICE, IMPLANT OR GRAFT, INITIAL ENCOUNTER",CAR022,HEART VALVE REPLACEMENT AND OTHER VALVE PROCEDURES (NON-ENDOVASCULAR),167,OTHER CARDIOTHORACIC & THORACIC VASCULAR PROCEDURES,05,DISEASES AND DISORDERS OF THE CIRCULATORY SYSTEM,1,Minor,Minor,Surgical,Blue Cross/Blue Shield,,,,,Y,324389.69,62979.25
New York City,Manhattan,7002053,001463,NYU Langone Hospitals,18 to 29,112,M,Black/African American,Not Span/Hispanic,5,Elective,Home or Self Care,2020,CIR005,MYOCARDITIS AND CARDIOMYOPATHY,CAR022,HEART VALVE REPLACEMENT AND OTHER VALVE PROCEDURES (NON-ENDOVASCULAR),167,OTHER CARDIOTHORACIC & THORACIC VASCULAR PROCEDURES,05,DISEASES AND DISORDERS OF THE CIRCULATORY SYSTEM,1,Minor,Moderate,Surgical,Private Health Insurance,,,,,N,248010.57,51263.77
New York City,Manhattan,7002053,001463,NYU Langone Hospitals,0 to 17,OOS,M,White,Not Span/Hispanic,5,Elective,Home or Self Care,2020,MAL001,CARDIAC AND CIRCULATORY CONGENITAL ANOMALIES,CAR022,HEART VALVE REPLACEMENT AND OTHER VALVE PROCEDURES (NON-ENDOVASCULAR),167,OTHER CARDIOTHORACIC & THORACIC VASCULAR PROCEDURES,05,DISEASES AND DISORDERS OF THE CIRCULATORY SYSTEM,1,Minor,Minor,Surgical,Private Health Insurance,,,,,N,202801.93,54092.57
New York City,Manhattan,7002053,001463,NYU Langone Hospitals,0 to 17,112,M,Multi-racial,Spanish/Hispanic,3,Elective,Home or Self Care,2020,MAL001,CARDIAC AND CIRCULATORY CONGENITAL ANOMALIES,CAR019,SEPTAL REPAIR AND OTHER THERAPEUTIC HEART PROCEDURES,167,OTHER CARDIOTHORACIC & THORACIC VASCULAR PROCEDURES,05,DISEASES AND DISORDERS OF THE CIRCULATORY SYSTEM,2,Moderate,Minor,Surgical,Medicaid,,,,,N,165824.33,37946.11
New York City,Manhattan,7002053,001463,NYU Langone Hospitals,0 to 17,103,F,Other Race,Not Span/Hispanic,17,Emergency,Home or Self Care,2020,MAL001,CARDIAC AND CIRCULATORY CONGENITAL ANOMALIES,CAR019,SEPTAL REPAIR AND OTHER THERAPEUTIC HEART PROCEDURES,167,OTHER CARDIOTHORACIC & THORACIC VASCULAR PROCEDURES,05,DISEASES AND DISORDERS OF THE CIRCULATORY SYSTEM,3,Major,Moderate,Surgical,Medicaid,,,,,N,455486.26,104588.14
New York City,Manhattan,7002053,001463,NYU Langone Hospitals,0 to 17,112,F,White,Not Span/Hispanic,3,Elective,Home or Self Care,2020,MAL001,CARDIAC AND CIRCULATORY CONGENITAL ANOMALIES,CAR019,SEPTAL REPAIR AND OTHER THERAPEUTIC HEART PROCEDURES,167,OTHER CARDIOTHORACIC & THORACIC VASCULAR PROCEDURES,05,DISEASES AND DISORDERS OF THE CIRCULATORY SYSTEM,1,Minor,Moderate,Surgical,Blue Cross/Blue Shield,,,,,N,152956.28,36851.91