Hospital Service Area,Hospital County,Operating Certificate Number,Permanent Facility Id,Facility Name,Age Group,Zip Code - 3 digits,Gender,Race,Ethnicity,Length of Stay,Type of Admission,Patient Disposition,Discharge Year,CCS Diagnosis Code,CCS Diagnosis Description,CCS Procedure Code,CCS Procedure Description,APR DRG Code,APR DRG Description,APR MDC Code,APR MDC Description,APR Severity of Illness Code,APR Severity of Illness Description,APR Risk of Mortality,APR Medical Surgical Description,Payment Typology 1,Payment Typology 2,Payment Typology 3,Birth Weight,Abortion Edit Indicator,Emergency Department Indicator,Total Charges,Total Costs
New York City,Manhattan,7002024,001456,Mount Sinai Hospital,70 or Older,113,M,Other Race,Not Span/Hispanic,5,Urgent,Home w/ Home Health Services,2017,118,Phlebitis; thrombophlebitis and thromboembolism,060,EMBOL-/ENDARTER-ECTOMY,169,Major abdominal vascular procedures,05,Diseases and Disorders of the Circulatory System,1,Minor,Minor,Surgical,Medicaid,Medicaid,Self-Pay,,N,N,73252.19,31293.55
New York City,Manhattan,7002002,001439,Mount Sinai Beth Israel,70 or Older,112,F,Other Race,Not Span/Hispanic,23,Emergency,Home w/ Home Health Services,2017,237,Complication of device; implant or graft,056,OT VASCULAR BYP/SHUNT,169,Major abdominal vascular procedures,05,Diseases and Disorders of the Circulatory System,4,Extreme,Major,Surgical,Medicaid,Medicaid,Self-Pay,,N,N,642.00,12.74
New York City,Manhattan,7002002,001439,Mount Sinai Beth Israel,70 or Older,112,M,Other Race,Not Span/Hispanic,1,Urgent,Home or Self Care,2017,101,Coronary atherosclerosis and other heart disease,045,PERC TRANSLUM COR ANGIO,169,Major abdominal vascular procedures,05,Diseases and Disorders of the Circulatory System,1,Minor,Moderate,Surgical,Medicare,Miscellaneous/Other,Self-Pay,,N,N,278132.63,72240.17
New York City,Manhattan,7002024,001456,Mount Sinai Hospital,50 to 69,100,F,Other Race,Not Span/Hispanic,13,Urgent,Skilled Nursing Home,2017,237,Complication of device; implant or graft,191,ARTERIO/VENOGRAM-NOT HH,169,Major abdominal vascular procedures,05,Diseases and Disorders of the Circulatory System,3,Major,Moderate,Surgical,Medicaid,Medicaid,Self-Pay,,N,N,133597.40,53711.48
New York City,Manhattan,7002024,001456,Mount Sinai Hospital,30 to 49,107,F,Other Race,Not Span/Hispanic,5,Emergency,Home w/ Home Health Services,2017,118,Phlebitis; thrombophlebitis and thromboembolism,061,OT OR PRCS VES NOT HEAD,169,Major abdominal vascular procedures,05,Diseases and Disorders of the Circulatory System,3,Major,Minor,Surgical,Blue Cross/Blue Shield,Self-Pay,,,N,Y,64705.84,27522.10
New York City,Manhattan,7002032,001466,Mount Sinai West,70 or Older,100,M,Black/African American,Spanish/Hispanic,3,Elective,Home w/ Home Health Services,2017,114,Peripheral and visceral atherosclerosis,060,EMBOL-/ENDARTER-ECTOMY,169,Major abdominal vascular procedures,05,Diseases and Disorders of the Circulatory System,1,Minor,Moderate,Surgical,Medicare,Medicaid,Self-Pay,,N,N,63754.53,25382.03
New York City,Bronx,7000006,001169,Montefiore Medical Center - Henry & Lucy Moses Div,70 or Older,104,M,Other Race,Not Span/Hispanic,1,Emergency,Expired,2017,115,Aortic; peripheral; and visceral artery aneurysms,061,OT OR PRCS VES NOT HEAD,169,Major abdominal vascular procedures,05,Diseases and Disorders of the Circulatory System,3,Major,Major,Surgical,Medicare,,,,N,Y,159122.42,33338.03
New York City,Manhattan,7002024,001456,Mount Sinai Hospital,70 or Older,111,M,Other Race,Not Span/Hispanic,5,Elective,Home or Self Care,2017,115,Aortic; peripheral; and visceral artery aneurysms,055,PERIPH VASCULAR BYPASS,169,Major abdominal vascular procedures,05,Diseases and Disorders of the Circulatory System,3,Major,Major,Surgical,Medicare,Medicare,Self-Pay,,N,N,101852.46,34248.44
New York City,Manhattan,7002024,001456,Mount Sinai Hospital,70 or Older,101,M,White,Not Span/Hispanic,8,Elective,Home or Self Care,2017,248,Gangrene,055,PERIPH VASCULAR BYPASS,169,Major abdominal vascular procedures,05,Diseases and Disorders of the Circulatory System,3,Major,Major,Surgical,Medicare,Private Health Insurance,Self-Pay,,N,N,99984.14,39720.53
New York City,Manhattan,7002024,001456,Mount Sinai Hospital,70 or Older,113,M,White,Not Span/Hispanic,3,Emergency,Home or Self Care,2017,118,Phlebitis; thrombophlebitis and thromboembolism,061,OT OR PRCS VES NOT HEAD,169,Major abdominal vascular procedures,05,Diseases and Disorders of the Circulatory System,3,Major,Major,Surgical,Medicare,Private Health Insurance,Self-Pay,,N,Y,71354.36,30799.86
New York City,Manhattan,7002032,001469,Mount Sinai St. Luke's,70 or Older,100,M,White,Spanish/Hispanic,55,Emergency,Skilled Nursing Home,2017,050,Diabetes mellitus with complications,060,EMBOL-/ENDARTER-ECTOMY,169,Major abdominal vascular procedures,05,Diseases and Disorders of the Circulatory System,4,Extreme,Major,Surgical,Medicare,Medicaid,Self-Pay,,N,Y,530632.58,186814.17
,,,,Redacted for Confidentiality,30 to 49,,M,Multi-racial,Not Span/Hispanic,11,Emergency,Court/Law Enforcement,2017,118,Phlebitis; thrombophlebitis and thromboembolism,191,ARTERIO/VENOGRAM-NOT HH,169,Major abdominal vascular procedures,05,Diseases and Disorders of the Circulatory System,3,Major,Major,Surgical,Medicaid,Self-Pay,,,N,N,102449.97,41073.13
New York City,Bronx,7000006,001169,Montefiore Medical Center - Henry & Lucy Moses Div,50 to 69,100,M,Other Race,Spanish/Hispanic,14,Emergency,Skilled Nursing Home,2017,116,Aortic and peripheral arterial embolism or thrombosis,055,PERIPH VASCULAR BYPASS,169,Major abdominal vascular procedures,05,Diseases and Disorders of the Circulatory System,3,Major,Major,Surgical,Medicaid,,,,N,Y,269545.76,63489.33
New York City,Bronx,7000006,001169,Montefiore Medical Center - Henry & Lucy Moses Div,50 to 69,104,M,White,Spanish/Hispanic,2,Emergency,Home or Self Care,2017,101,Coronary atherosclerosis and other heart disease,047,DX CARDIAC CATHETERIZTN,169,Major abdominal vascular procedures,05,Diseases and Disorders of the Circulatory System,2,Moderate,Moderate,Surgical,Medicaid,,,,N,N,124596.63,47673.81
New York City,Manhattan,7002024,001456,Mount Sinai Hospital,50 to 69,112,M,Black/African American,Not Span/Hispanic,10,Elective,Skilled Nursing Home,2017,248,Gangrene,061,OT OR PRCS VES NOT HEAD,169,Major abdominal vascular procedures,05,Diseases and Disorders of the Circulatory System,4,Extreme,Moderate,Surgical,Medicaid,Medicaid,Self-Pay,,N,N,106355.38,39736.51
New York City,Manhattan,7002024,001456,Mount Sinai Hospital,70 or Older,117,M,White,Not Span/Hispanic,15,Urgent,Expired,2017,237,Complication of device; implant or graft,061,OT OR PRCS VES NOT HEAD,169,Major abdominal vascular procedures,05,Diseases and Disorders of the Circulatory System,3,Major,Extreme,Surgical,Medicare,Blue Cross/Blue Shield,Self-Pay,,N,N,316513.93,128271.07
New York City,Manhattan,7002024,001456,Mount Sinai Hospital,70 or Older,113,M,White,Not Span/Hispanic,1,Elective,Home w/ Home Health Services,2017,237,Complication of device; implant or graft,045,PERC TRANSLUM COR ANGIO,169,Major abdominal vascular procedures,05,Diseases and Disorders of the Circulatory System,1,Minor,Moderate,Surgical,Medicare,Private Health Insurance,Self-Pay,,N,N,103882.96,43509.30
New York City,Manhattan,7002024,001456,Mount Sinai Hospital,70 or Older,111,F,Other Race,Not Span/Hispanic,4,Elective,Home or Self Care,2017,114,Peripheral and visceral atherosclerosis,055,PERIPH VASCULAR BYPASS,169,Major abdominal vascular procedures,05,Diseases and Disorders of the Circulatory System,1,Minor,Minor,Surgical,Medicare,Medicare,Self-Pay,,N,N,63740.14,27005.64
New York City,Manhattan,7002024,001456,Mount Sinai Hospital,50 to 69,113,F,Other Race,Not Span/Hispanic,8,Elective,Home w/ Home Health Services,2017,237,Complication of device; implant or graft,061,OT OR PRCS VES NOT HEAD,169,Major abdominal vascular procedures,05,Diseases and Disorders of the Circulatory System,3,Major,Major,Surgical,Medicare,Medicaid,Self-Pay,,N,N,94081.15,33167.34
New York City,Manhattan,7002024,001456,Mount Sinai Hospital,30 to 49,104,M,Black/African American,Not Span/Hispanic,10,Emergency,Home or Self Care,2017,116,Aortic and peripheral arterial embolism or thrombosis,061,OT OR PRCS VES NOT HEAD,169,Major abdominal vascular procedures,05,Diseases and Disorders of the Circulatory System,3,Major,Moderate,Surgical,Medicaid,Medicaid,Self-Pay,,N,Y,100798.60,33119.59
New York City,Manhattan,7002032,001469,Mount Sinai St. Luke's,50 to 69,100,M,Black/African American,Spanish/Hispanic,11,Emergency,Home or Self Care,2017,237,Complication of device; implant or graft,045,PERC TRANSLUM COR ANGIO,169,Major abdominal vascular procedures,05,Diseases and Disorders of the Circulatory System,3,Major,Major,Surgical,Medicaid,Medicaid,Self-Pay,,N,Y,255408.62,99718.56
New York City,Manhattan,7002032,001469,Mount Sinai St. Luke's,50 to 69,104,F,Black/African American,Not Span/Hispanic,2,Urgent,Home or Self Care,2017,101,Coronary atherosclerosis and other heart disease,061,OT OR PRCS VES NOT HEAD,169,Major abdominal vascular procedures,05,Diseases and Disorders of the Circulatory System,1,Minor,Moderate,Surgical,Medicare,Medicare,Medicaid,,N,N,28276.63,8752.58
New York City,Kings,7001021,001306,New York - Presbyterian Brooklyn Methodist Hospital,70 or Older,112,F,White,Not Span/Hispanic,11,Emergency,Home w/ Home Health Services,2017,248,Gangrene,061,OT OR PRCS VES NOT HEAD,169,Major abdominal vascular procedures,05,Diseases and Disorders of the Circulatory System,4,Extreme,Extreme,Surgical,Medicare,Medicaid,Self-Pay,,N,Y,100138.03,38300.23
New York City,Kings,7001021,001306,New York - Presbyterian Brooklyn Methodist Hospital,70 or Older,112,F,White,Not Span/Hispanic,12,Emergency,Home w/ Home Health Services,2017,114,Peripheral and visceral atherosclerosis,061,OT OR PRCS VES NOT HEAD,169,Major abdominal vascular procedures,05,Diseases and Disorders of the Circulatory System,3,Major,Major,Surgical,Medicare,Medicaid,Self-Pay,,N,Y,88035.47,29224.02
New York City,Manhattan,7002002,001439,Mount Sinai Beth Israel,50 to 69,100,M,White,Not Span/Hispanic,23,Emergency,Home or Self Care,2017,237,Complication of device; implant or graft,061,OT OR PRCS VES NOT HEAD,169,Major abdominal vascular procedures,05,Diseases and Disorders of the Circulatory System,3,Major,Moderate,Surgical,Medicaid,Self-Pay,,,N,Y,201655.68,65576.43
New York City,Manhattan,7002024,001456,Mount Sinai Hospital,50 to 69,112,F,Black/African American,Not Span/Hispanic,1,Urgent,Home or Self Care,2017,118,Phlebitis; thrombophlebitis and thromboembolism,060,EMBOL-/ENDARTER-ECTOMY,169,Major abdominal vascular procedures,05,Diseases and Disorders of the Circulatory System,3,Major,Minor,Surgical,Blue Cross/Blue Shield,Self-Pay,,,N,N,31840.65,10551.46
New York City,Manhattan,7002024,001456,Mount Sinai Hospital,70 or Older,106,F,White,Not Span/Hispanic,5,Urgent,Home w/ Home Health Services,2017,100,Acute myocardial infarction,045,PERC TRANSLUM COR ANGIO,169,Major abdominal vascular procedures,05,Diseases and Disorders of the Circulatory System,2,Moderate,Moderate,Surgical,Medicare,Medicare,Self-Pay,,N,N,179853.33,67285.35
New York City,Manhattan,7002024,001456,Mount Sinai Hospital,50 to 69,113,M,White,Not Span/Hispanic,21,Emergency,Skilled Nursing Home,2017,116,Aortic and peripheral arterial embolism or thrombosis,219,ALCO/DRUG REHAB/DETOX,169,Major abdominal vascular procedures,05,Diseases and Disorders of the Circulatory System,4,Extreme,Major,Surgical,Medicare,Medicare,Self-Pay,,N,Y,234251.98,70980.72
New York City,Manhattan,7002024,001456,Mount Sinai Hospital,70 or Older,OOS,M,White,Not Span/Hispanic,13,Urgent,Home w/ Home Health Services,2017,106,Cardiac dysrhythmias,009,OTHER OR THER NERV SYS,169,Major abdominal vascular procedures,05,Diseases and Disorders of the Circulatory System,3,Major,Major,Surgical,Medicare,Private Health Insurance,Self-Pay,,N,N,272501.23,102312.36
New York City,Manhattan,7002024,001456,Mount Sinai Hospital,50 to 69,112,M,Other Race,Not Span/Hispanic,1,Urgent,Home or Self Care,2017,101,Coronary atherosclerosis and other heart disease,045,PERC TRANSLUM COR ANGIO,169,Major abdominal vascular procedures,05,Diseases and Disorders of the Circulatory System,1,Minor,Moderate,Surgical,Medicare,Medicaid,Self-Pay,,N,N,128620.30,54565.94
New York City,Manhattan,7002024,001456,Mount Sinai Hospital,70 or Older,101,M,Other Race,Not Span/Hispanic,1,Urgent,Home or Self Care,2017,050,Diabetes mellitus with complications,060,EMBOL-/ENDARTER-ECTOMY,169,Major abdominal vascular procedures,05,Diseases and Disorders of the Circulatory System,2,Moderate,Moderate,Surgical,Medicare,Medicare,Self-Pay,,N,N,35246.06,15523.46
New York City,Manhattan,7002054,001464,New York Presbyterian Hospital - Columbia Presbyterian Center,50 to 69,105,M,White,Not Span/Hispanic,6,Elective,Home w/ Home Health Services,2017,115,Aortic; peripheral; and visceral artery aneurysms,052,AORTIC RESECTION; REPL,169,Major abdominal vascular procedures,05,Diseases and Disorders of the Circulatory System,2,Moderate,Moderate,Surgical,Medicare,Blue Cross/Blue Shield,Self-Pay,,N,N,88081.70,36722.14
New York City,Manhattan,7002054,001464,New York Presbyterian Hospital - Columbia Presbyterian Center,70 or Older,100,F,Black/African American,Not Span/Hispanic,42,Emergency,Home w/ Home Health Services,2017,100,Acute myocardial infarction,061,OT OR PRCS VES NOT HEAD,169,Major abdominal vascular procedures,05,Diseases and Disorders of the Circulatory System,4,Extreme,Extreme,Surgical,Medicare,Medicare,Medicaid,,N,Y,676332.40,309009.54
New York City,Manhattan,7002054,001464,New York Presbyterian Hospital - Columbia Presbyterian Center,70 or Older,100,M,White,Spanish/Hispanic,10,Emergency,Home w/ Home Health Services,2017,116,Aortic and peripheral arterial embolism or thrombosis,060,EMBOL-/ENDARTER-ECTOMY,169,Major abdominal vascular procedures,05,Diseases and Disorders of the Circulatory System,4,Extreme,Major,Surgical,Medicare,Medicare,Self-Pay,,N,Y,108682.37,27991.89
New York City,Manhattan,7002054,001464,New York Presbyterian Hospital - Columbia Presbyterian Center,70 or Older,113,M,Other Race,Not Span/Hispanic,18,Emergency,Expired,2017,237,Complication of device; implant or graft,061,OT OR PRCS VES NOT HEAD,169,Major abdominal vascular procedures,05,Diseases and Disorders of the Circulatory System,3,Major,Major,Surgical,Medicare,Blue Cross/Blue Shield,Self-Pay,,N,Y,522833.85,259246.71
New York City,Manhattan,7002054,001464,New York Presbyterian Hospital - Columbia Presbyterian Center,70 or Older,100,F,White,Spanish/Hispanic,11,Emergency,Home w/ Home Health Services,2017,115,Aortic; peripheral; and visceral artery aneurysms,052,AORTIC RESECTION; REPL,169,Major abdominal vascular procedures,05,Diseases and Disorders of the Circulatory System,3,Major,Moderate,Surgical,Medicare,Medicare,Medicaid,,N,Y,163435.38,73250.22
New York City,Manhattan,7002032,001469,Mount Sinai St. Luke's,70 or Older,100,F,White,Spanish/Hispanic,22,Emergency,Home or Self Care,2017,100,Acute myocardial infarction,061,OT OR PRCS VES NOT HEAD,169,Major abdominal vascular procedures,05,Diseases and Disorders of the Circulatory System,3,Major,Major,Surgical,Medicare,Medicare,Medicaid,,N,Y,474643.84,199345.73
New York City,Manhattan,7002032,001469,Mount Sinai St. Luke's,70 or Older,100,M,White,Not Span/Hispanic,7,Emergency,Skilled Nursing Home,2017,100,Acute myocardial infarction,061,OT OR PRCS VES NOT HEAD,169,Major abdominal vascular procedures,05,Diseases and Disorders of the Circulatory System,1,Minor,Moderate,Surgical,Medicare,Blue Cross/Blue Shield,Medicaid,,N,Y,70975.62,25880.62
New York City,Manhattan,7002032,001469,Mount Sinai St. Luke's,30 to 49,100,M,White,Spanish/Hispanic,3,Emergency,Home or Self Care,2017,100,Acute myocardial infarction,045,PERC TRANSLUM COR ANGIO,169,Major abdominal vascular procedures,05,Diseases and Disorders of the Circulatory System,3,Major,Major,Surgical,Medicaid,Medicaid,Self-Pay,,N,Y,51267.54,16632.19
New York City,Queens,7003010,001637,New York - Presbyterian/Queens,70 or Older,113,M,White,Not Span/Hispanic,10,Emergency,Skilled Nursing Home,2017,116,Aortic and peripheral arterial embolism or thrombosis,061,OT OR PRCS VES NOT HEAD,169,Major abdominal vascular procedures,05,Diseases and Disorders of the Circulatory System,3,Major,Major,Surgical,Medicare,Blue Cross/Blue Shield,Self-Pay,,N,Y,133492.55,50367.54
Hudson Valley,Rockland,4329000,000779,Good Samaritan Hospital of Suffern,30 to 49,OOS,F,White,Not Span/Hispanic,6,Elective,Home or Self Care,2017,114,Peripheral and visceral atherosclerosis,055,PERIPH VASCULAR BYPASS,169,Major abdominal vascular procedures,05,Diseases and Disorders of the Circulatory System,2,Moderate,Minor,Surgical,Private Health Insurance,,,,N,N,141103.57,33835.75
Hudson Valley,Westchester,5907001,001097,SJRH - St Johns Division,70 or Older,105,F,White,Not Span/Hispanic,9,Elective,Skilled Nursing Home,2017,118,Phlebitis; thrombophlebitis and thromboembolism,061,OT OR PRCS VES NOT HEAD,169,Major abdominal vascular procedures,05,Diseases and Disorders of the Circulatory System,3,Major,Extreme,Surgical,Medicare,Blue Cross/Blue Shield,Self-Pay,,N,N,95284.25,47145.68
New York City,Kings,7002053,001304,NYU Langone Hospital-Brooklyn,50 to 69,112,M,Other Race,Spanish/Hispanic,7,Emergency,Home w/ Home Health Services,2017,118,Phlebitis; thrombophlebitis and thromboembolism,061,OT OR PRCS VES NOT HEAD,169,Major abdominal vascular procedures,05,Diseases and Disorders of the Circulatory System,2,Moderate,Minor,Surgical,Medicaid,,,,N,Y,148759.31,79407.18
New York City,Manhattan,7002002,001439,Mount Sinai Beth Israel,70 or Older,100,F,White,Not Span/Hispanic,1,Emergency,Expired,2017,116,Aortic and peripheral arterial embolism or thrombosis,061,OT OR PRCS VES NOT HEAD,169,Major abdominal vascular procedures,05,Diseases and Disorders of the Circulatory System,3,Major,Major,Surgical,Medicare,Miscellaneous/Other,Medicaid,,N,Y,45808.31,15641.25
New York City,Manhattan,7002024,001456,Mount Sinai Hospital,30 to 49,109,M,White,Not Span/Hispanic,9,Urgent,Home or Self Care,2017,237,Complication of device; implant or graft,061,OT OR PRCS VES NOT HEAD,169,Major abdominal vascular procedures,05,Diseases and Disorders of the Circulatory System,3,Major,Moderate,Surgical,Private Health Insurance,Self-Pay,,,N,N,110373.33,41886.81
New York City,Manhattan,7002024,001456,Mount Sinai Hospital,70 or Older,126,M,White,Not Span/Hispanic,1,Urgent,Home or Self Care,2017,101,Coronary atherosclerosis and other heart disease,045,PERC TRANSLUM COR ANGIO,169,Major abdominal vascular procedures,05,Diseases and Disorders of the Circulatory System,1,Minor,Moderate,Surgical,Medicare,Self-Pay,,,N,N,165373.24,55385.65
New York City,Manhattan,7002024,001456,Mount Sinai Hospital,70 or Older,112,F,White,Not Span/Hispanic,3,Urgent,Home w/ Home Health Services,2017,101,Coronary atherosclerosis and other heart disease,047,DX CARDIAC CATHETERIZTN,169,Major abdominal vascular procedures,05,Diseases and Disorders of the Circulatory System,3,Major,Major,Surgical,Medicare,Blue Cross/Blue Shield,Self-Pay,,N,N,120261.21,49130.88
New York City,Manhattan,7002024,001456,Mount Sinai Hospital,30 to 49,109,M,White,Not Span/Hispanic,4,Emergency,Home or Self Care,2017,237,Complication of device; implant or graft,061,OT OR PRCS VES NOT HEAD,169,Major abdominal vascular procedures,05,Diseases and Disorders of the Circulatory System,2,Moderate,Minor,Surgical,Private Health Insurance,Self-Pay,,,N,Y,73589.72,31014.76
New York City,Manhattan,7002053,001463,NYU Langone Hospitals,70 or Older,OOS,M,White,Not Span/Hispanic,1,Elective,Home or Self Care,2017,237,Complication of device; implant or graft,189,CONTRAST AORTOGRAM,169,Major abdominal vascular procedures,05,Diseases and Disorders of the Circulatory System,1,Minor,Moderate,Surgical,Medicare,,,,N,N,130457.92,27967.23
New York City,Manhattan,7002032,001469,Mount Sinai St. Luke's,70 or Older,113,M,White,Not Span/Hispanic,1,Urgent,Home or Self Care,2017,101,Coronary atherosclerosis and other heart disease,061,OT OR PRCS VES NOT HEAD,169,Major abdominal vascular procedures,05,Diseases and Disorders of the Circulatory System,1,Minor,Major,Surgical,Medicare,Blue Cross/Blue Shield,Self-Pay,,N,N,13213.51,5627.33
Long Island,Suffolk,5123000,000885,Brookhaven Memorial Hospital Medical Center Inc,50 to 69,119,M,White,Not Span/Hispanic,7,Emergency,Home or Self Care,2017,114,Peripheral and visceral atherosclerosis,061,OT OR PRCS VES NOT HEAD,169,Major abdominal vascular procedures,05,Diseases and Disorders of the Circulatory System,3,Major,Moderate,Surgical,Medicare,,,,N,Y,132748.10,27487.71
Western NY,Erie,1401014,000207,Buffalo General Medical Center,50 to 69,142,F,Black/African American,Not Span/Hispanic,3,Elective,Home w/ Home Health Services,2017,114,Peripheral and visceral atherosclerosis,060,EMBOL-/ENDARTER-ECTOMY,169,Major abdominal vascular procedures,05,Diseases and Disorders of the Circulatory System,2,Moderate,Minor,Surgical,Medicaid,Self-Pay,,,N,N,46262.57,16552.80
Western NY,Erie,1401014,000207,Buffalo General Medical Center,70 or Older,141,M,White,Not Span/Hispanic,2,Emergency,Home w/ Home Health Services,2017,116,Aortic and peripheral arterial embolism or thrombosis,060,EMBOL-/ENDARTER-ECTOMY,169,Major abdominal vascular procedures,05,Diseases and Disorders of the Circulatory System,2,Moderate,Moderate,Surgical,Medicare,Self-Pay,,,N,Y,37550.69,12920.58
Western NY,Erie,1401014,000207,Buffalo General Medical Center,50 to 69,142,F,White,Not Span/Hispanic,2,Elective,Home or Self Care,2017,118,Phlebitis; thrombophlebitis and thromboembolism,061,OT OR PRCS VES NOT HEAD,169,Major abdominal vascular procedures,05,Diseases and Disorders of the Circulatory System,3,Major,Major,Surgical,Private Health Insurance,Self-Pay,,,N,N,20149.04,10082.25
Western NY,Erie,1401014,000207,Buffalo General Medical Center,50 to 69,140,M,White,Not Span/Hispanic,3,Emergency,Home or Self Care,2017,237,Complication of device; implant or graft,061,OT OR PRCS VES NOT HEAD,169,Major abdominal vascular procedures,05,Diseases and Disorders of the Circulatory System,3,Major,Major,Surgical,Medicare,Self-Pay,,,N,Y,79740.66,25454.48
Capital/Adirond,Rensselaer,4102002,000756,Samaritan Hospital,50 to 69,120,F,White,Not Span/Hispanic,2,Elective,Home or Self Care,2017,114,Peripheral and visceral atherosclerosis,061,OT OR PRCS VES NOT HEAD,169,Major abdominal vascular procedures,05,Diseases and Disorders of the Circulatory System,2,Moderate,Minor,Surgical,Medicare,Private Health Insurance,Self-Pay,,N,N,17661.42,7987.90
Hudson Valley,Orange,3523000,000699,Orange Regional Medical Center,50 to 69,109,M,Black/African American,Not Span/Hispanic,2,Elective,Home or Self Care,2017,114,Peripheral and visceral atherosclerosis,061,OT OR PRCS VES NOT HEAD,169,Major abdominal vascular procedures,05,Diseases and Disorders of the Circulatory System,2,Moderate,Minor,Surgical,Blue Cross/Blue Shield,,,,N,N,49388.64,20270.97
Hudson Valley,Orange,3523000,000699,Orange Regional Medical Center,70 or Older,109,M,White,Not Span/Hispanic,9,Emergency,Expired,2017,115,Aortic; peripheral; and visceral artery aneurysms,052,AORTIC RESECTION; REPL,169,Major abdominal vascular procedures,05,Diseases and Disorders of the Circulatory System,3,Major,Major,Surgical,Medicare,Blue Cross/Blue Shield,,,N,Y,204755.57,80455.82
Hudson Valley,Westchester,5901000,001039,NewYork-Presbyterian/Hudson Valley Hospital,50 to 69,105,F,White,Not Span/Hispanic,2,Emergency,Home or Self Care,2017,118,Phlebitis; thrombophlebitis and thromboembolism,061,OT OR PRCS VES NOT HEAD,169,Major abdominal vascular procedures,05,Diseases and Disorders of the Circulatory System,2,Moderate,Minor,Surgical,Medicaid,,,,N,Y,44439.95,16239.62