Hospital Service Area,Hospital County,Operating Certificate Number,Permanent Facility Id,Facility Name,Age Group,Zip Code - 3 digits,Gender,Race,Ethnicity,Length of Stay,Type of Admission,Patient Disposition,Discharge Year,CCS Diagnosis Code,CCS Diagnosis Description,CCS Procedure Code,CCS Procedure Description,APR DRG Code,APR DRG Description,APR MDC Code,APR MDC Description,APR Severity of Illness Code,APR Severity of Illness Description,APR Risk of Mortality,APR Medical Surgical Description,Payment Typology 1,Payment Typology 2,Payment Typology 3,Birth Weight,Abortion Edit Indicator,Emergency Department Indicator,Total Charges,Total Costs
Long Island,Nassau,2908000,000511,NYU Winthrop Hospital,30 to 49,110,F,White,Not Span/Hispanic,1,Elective,Home or Self Care,2017,115,Aortic; peripheral; and visceral artery aneurysms,066,PRCS ON SPLEEN,169,Major abdominal vascular procedures,05,Diseases and Disorders of the Circulatory System,1,Minor,Minor,Surgical,Blue Cross/Blue Shield,,,,N,N,39405.28,11083.59
Long Island,Nassau,2908000,000511,NYU Winthrop Hospital,50 to 69,115,M,Black/African American,Not Span/Hispanic,4,Emergency,Home or Self Care,2017,118,Phlebitis; thrombophlebitis and thromboembolism,060,EMBOL-/ENDARTER-ECTOMY,169,Major abdominal vascular procedures,05,Diseases and Disorders of the Circulatory System,3,Major,Minor,Surgical,Blue Cross/Blue Shield,,,,N,Y,183384.35,45987.79
Long Island,Nassau,2908000,000511,NYU Winthrop Hospital,50 to 69,115,M,White,Not Span/Hispanic,1,Elective,Home or Self Care,2017,114,Peripheral and visceral atherosclerosis,055,PERIPH VASCULAR BYPASS,169,Major abdominal vascular procedures,05,Diseases and Disorders of the Circulatory System,1,Minor,Minor,Surgical,Medicaid,Medicaid,,,N,N,62270.38,17894.27
Long Island,Nassau,2908000,000511,NYU Winthrop Hospital,30 to 49,115,F,Black/African American,Not Span/Hispanic,9,Emergency,Home w/ Home Health Services,2017,118,Phlebitis; thrombophlebitis and thromboembolism,060,EMBOL-/ENDARTER-ECTOMY,169,Major abdominal vascular procedures,05,Diseases and Disorders of the Circulatory System,3,Major,Major,Surgical,Medicaid,Medicaid,,,N,Y,181544.25,44508.67
Long Island,Nassau,2908000,000511,NYU Winthrop Hospital,70 or Older,115,F,White,Not Span/Hispanic,3,Emergency,Home or Self Care,2017,101,Coronary atherosclerosis and other heart disease,047,DX CARDIAC CATHETERIZTN,169,Major abdominal vascular procedures,05,Diseases and Disorders of the Circulatory System,1,Minor,Moderate,Surgical,Medicare,Medicare,,,N,Y,226790.68,57191.81
Long Island,Nassau,2908000,000511,NYU Winthrop Hospital,70 or Older,115,F,Black/African American,Not Span/Hispanic,9,Elective,Home w/ Home Health Services,2017,118,Phlebitis; thrombophlebitis and thromboembolism,060,EMBOL-/ENDARTER-ECTOMY,169,Major abdominal vascular procedures,05,Diseases and Disorders of the Circulatory System,3,Major,Major,Surgical,Medicare,Medicare,Private Health Insurance,,N,N,256715.50,61450.88
Long Island,Nassau,2908000,000511,NYU Winthrop Hospital,70 or Older,115,M,Black/African American,Not Span/Hispanic,23,Emergency,Skilled Nursing Home,2017,237,Complication of device; implant or graft,055,PERIPH VASCULAR BYPASS,169,Major abdominal vascular procedures,05,Diseases and Disorders of the Circulatory System,4,Extreme,Major,Surgical,Medicare,Medicare,,,N,Y,243924.51,64910.62
Long Island,Nassau,2908000,000511,NYU Winthrop Hospital,70 or Older,119,M,White,Not Span/Hispanic,18,Emergency,Home w/ Home Health Services,2017,096,Heart valve disorders,043,HEART VALVE PRCS,169,Major abdominal vascular procedures,05,Diseases and Disorders of the Circulatory System,4,Extreme,Major,Surgical,Medicare,Medicare,Private Health Insurance,,N,Y,858510.92,197856.57
Long Island,Nassau,2908000,000511,NYU Winthrop Hospital,70 or Older,113,M,White,Not Span/Hispanic,5,Elective,Home or Self Care,2017,115,Aortic; peripheral; and visceral artery aneurysms,052,AORTIC RESECTION; REPL,169,Major abdominal vascular procedures,05,Diseases and Disorders of the Circulatory System,2,Moderate,Minor,Surgical,Medicare,Medicare,,,N,N,87662.04,25103.69
Long Island,Nassau,2908000,000511,NYU Winthrop Hospital,70 or Older,OOS,F,White,Not Span/Hispanic,1,Elective,Expired,2017,096,Heart valve disorders,043,HEART VALVE PRCS,169,Major abdominal vascular procedures,05,Diseases and Disorders of the Circulatory System,4,Extreme,Extreme,Surgical,Medicare,Medicare,Blue Cross/Blue Shield,,N,N,430553.72,112534.10
Long Island,Nassau,2908000,000511,NYU Winthrop Hospital,70 or Older,112,F,White,Spanish/Hispanic,25,Urgent,Home or Self Care,2017,115,Aortic; peripheral; and visceral artery aneurysms,052,AORTIC RESECTION; REPL,169,Major abdominal vascular procedures,05,Diseases and Disorders of the Circulatory System,3,Major,Major,Surgical,Medicare,Medicare,Medicaid,,N,N,475663.00,109218.93
Long Island,Nassau,2908000,000511,NYU Winthrop Hospital,50 to 69,115,F,White,Spanish/Hispanic,8,Emergency,Home or Self Care,2017,118,Phlebitis; thrombophlebitis and thromboembolism,060,EMBOL-/ENDARTER-ECTOMY,169,Major abdominal vascular procedures,05,Diseases and Disorders of the Circulatory System,3,Major,Major,Surgical,Medicaid,,,,N,Y,133282.21,35300.67
Long Island,Nassau,2908000,000511,NYU Winthrop Hospital,70 or Older,115,M,White,Not Span/Hispanic,3,Elective,Home or Self Care,2017,115,Aortic; peripheral; and visceral artery aneurysms,061,OT OR PRCS VES NOT HEAD,169,Major abdominal vascular procedures,05,Diseases and Disorders of the Circulatory System,2,Moderate,Minor,Surgical,Medicare,Medicare,Blue Cross/Blue Shield,,N,N,79186.53,24891.27
Long Island,Nassau,2908000,000511,NYU Winthrop Hospital,70 or Older,110,F,White,Not Span/Hispanic,15,Emergency,Home w/ Home Health Services,2017,118,Phlebitis; thrombophlebitis and thromboembolism,060,EMBOL-/ENDARTER-ECTOMY,169,Major abdominal vascular procedures,05,Diseases and Disorders of the Circulatory System,3,Major,Major,Surgical,Medicare,Medicare,Medicaid,,N,Y,189970.46,49368.19
Long Island,Nassau,2908000,000511,NYU Winthrop Hospital,70 or Older,110,M,White,Not Span/Hispanic,9,Emergency,Home w/ Home Health Services,2017,118,Phlebitis; thrombophlebitis and thromboembolism,061,OT OR PRCS VES NOT HEAD,169,Major abdominal vascular procedures,05,Diseases and Disorders of the Circulatory System,3,Major,Extreme,Surgical,Medicare,Medicare,Medicare,,N,Y,237733.77,59079.54
Long Island,Nassau,2908000,000511,NYU Winthrop Hospital,70 or Older,117,M,White,Not Span/Hispanic,14,Elective,Home w/ Home Health Services,2017,115,Aortic; peripheral; and visceral artery aneurysms,052,AORTIC RESECTION; REPL,169,Major abdominal vascular procedures,05,Diseases and Disorders of the Circulatory System,4,Extreme,Extreme,Surgical,Medicare,Medicare,Blue Cross/Blue Shield,,N,N,481958.69,97651.37
Long Island,Nassau,2908000,000511,NYU Winthrop Hospital,50 to 69,117,M,White,Not Span/Hispanic,25,Emergency,Skilled Nursing Home,2017,248,Gangrene,061,OT OR PRCS VES NOT HEAD,169,Major abdominal vascular procedures,05,Diseases and Disorders of the Circulatory System,4,Extreme,Major,Surgical,Private Health Insurance,,,,N,Y,845946.97,190259.40
Long Island,Nassau,2908000,000511,NYU Winthrop Hospital,70 or Older,119,F,White,Not Span/Hispanic,8,Urgent,Home or Self Care,2017,096,Heart valve disorders,043,HEART VALVE PRCS,169,Major abdominal vascular procedures,05,Diseases and Disorders of the Circulatory System,2,Moderate,Major,Surgical,Medicare,Medicare,Private Health Insurance,,N,N,526575.10,129954.63
Long Island,Nassau,2908000,000511,NYU Winthrop Hospital,30 to 49,115,F,White,Not Span/Hispanic,5,Emergency,Home or Self Care,2017,118,Phlebitis; thrombophlebitis and thromboembolism,061,OT OR PRCS VES NOT HEAD,169,Major abdominal vascular procedures,05,Diseases and Disorders of the Circulatory System,3,Major,Major,Surgical,Medicaid,Medicaid,,,N,Y,222105.99,54708.98
Long Island,Nassau,2908000,000511,NYU Winthrop Hospital,70 or Older,115,F,White,Not Span/Hispanic,3,Elective,Home w/ Home Health Services,2017,114,Peripheral and visceral atherosclerosis,055,PERIPH VASCULAR BYPASS,169,Major abdominal vascular procedures,05,Diseases and Disorders of the Circulatory System,2,Moderate,Moderate,Surgical,Medicare,Medicare,Private Health Insurance,,N,N,178205.69,51653.94
Long Island,Nassau,2908000,000511,NYU Winthrop Hospital,70 or Older,115,F,Black/African American,Not Span/Hispanic,2,Elective,Home w/ Home Health Services,2017,115,Aortic; peripheral; and visceral artery aneurysms,061,OT OR PRCS VES NOT HEAD,169,Major abdominal vascular procedures,05,Diseases and Disorders of the Circulatory System,3,Major,Major,Surgical,Medicare,Medicare,,,N,N,287872.08,79218.24
Long Island,Nassau,2908000,000511,NYU Winthrop Hospital,30 to 49,115,F,White,Not Span/Hispanic,13,Emergency,Skilled Nursing Home,2017,118,Phlebitis; thrombophlebitis and thromboembolism,060,EMBOL-/ENDARTER-ECTOMY,169,Major abdominal vascular procedures,05,Diseases and Disorders of the Circulatory System,4,Extreme,Minor,Surgical,Medicaid,Medicaid,,,N,Y,335734.97,86355.20
Long Island,Nassau,2908000,000511,NYU Winthrop Hospital,70 or Older,OOS,F,Black/African American,Not Span/Hispanic,12,Emergency,Home w/ Home Health Services,2017,116,Aortic and peripheral arterial embolism or thrombosis,060,EMBOL-/ENDARTER-ECTOMY,169,Major abdominal vascular procedures,05,Diseases and Disorders of the Circulatory System,3,Major,Major,Surgical,Medicare,Medicare,Private Health Insurance,,N,Y,271791.73,72092.10
Long Island,Nassau,2908000,000511,NYU Winthrop Hospital,70 or Older,110,F,White,Not Span/Hispanic,7,Elective,Skilled Nursing Home,2017,114,Peripheral and visceral atherosclerosis,055,PERIPH VASCULAR BYPASS,169,Major abdominal vascular procedures,05,Diseases and Disorders of the Circulatory System,4,Extreme,Extreme,Surgical,Medicare,Medicare,Self-Pay,,N,N,281111.94,78338.08
Long Island,Nassau,2908000,000511,NYU Winthrop Hospital,50 to 69,115,M,White,Not Span/Hispanic,1,Elective,Home or Self Care,2017,114,Peripheral and visceral atherosclerosis,055,PERIPH VASCULAR BYPASS,169,Major abdominal vascular procedures,05,Diseases and Disorders of the Circulatory System,2,Moderate,Minor,Surgical,Medicare,Medicare,Private Health Insurance,,N,N,160526.36,48256.09
Long Island,Nassau,2908000,000511,NYU Winthrop Hospital,50 to 69,115,F,White,Not Span/Hispanic,3,Elective,Home w/ Home Health Services,2017,248,Gangrene,055,PERIPH VASCULAR BYPASS,169,Major abdominal vascular procedures,05,Diseases and Disorders of the Circulatory System,2,Moderate,Moderate,Surgical,Medicare,Medicare,Blue Cross/Blue Shield,,N,N,231421.50,68990.43
Long Island,Nassau,2908000,000511,NYU Winthrop Hospital,30 to 49,117,F,White,Not Span/Hispanic,7,Emergency,Home w/ Home Health Services,2017,116,Aortic and peripheral arterial embolism or thrombosis,061,OT OR PRCS VES NOT HEAD,169,Major abdominal vascular procedures,05,Diseases and Disorders of the Circulatory System,2,Moderate,Minor,Surgical,Blue Cross/Blue Shield,,,,N,Y,140120.40,32432.62
Long Island,Nassau,2908000,000511,NYU Winthrop Hospital,50 to 69,115,M,White,Not Span/Hispanic,8,Emergency,Home or Self Care,2017,118,Phlebitis; thrombophlebitis and thromboembolism,061,OT OR PRCS VES NOT HEAD,169,Major abdominal vascular procedures,05,Diseases and Disorders of the Circulatory System,3,Major,Moderate,Surgical,Private Health Insurance,,,,N,Y,261051.28,57289.53
Long Island,Nassau,2908000,000511,NYU Winthrop Hospital,70 or Older,117,M,White,Not Span/Hispanic,1,Elective,Home or Self Care,2017,115,Aortic; peripheral; and visceral artery aneurysms,061,OT OR PRCS VES NOT HEAD,169,Major abdominal vascular procedures,05,Diseases and Disorders of the Circulatory System,1,Minor,Moderate,Surgical,Private Health Insurance,,,,N,N,259875.60,73205.77
Long Island,Nassau,2908000,000511,NYU Winthrop Hospital,50 to 69,115,M,Black/African American,Not Span/Hispanic,7,Elective,Home w/ Home Health Services,2017,114,Peripheral and visceral atherosclerosis,055,PERIPH VASCULAR BYPASS,169,Major abdominal vascular procedures,05,Diseases and Disorders of the Circulatory System,4,Extreme,Extreme,Surgical,Medicare,Medicare,Private Health Insurance,,N,N,224729.67,57936.89
