Hospital Service Area,Hospital County,Operating Certificate Number,Permanent Facility Id,Facility Name,Age Group,Zip Code - 3 digits,Gender,Race,Ethnicity,Length of Stay,Type of Admission,Patient Disposition,Discharge Year,CCS Diagnosis Code,CCS Diagnosis Description,CCS Procedure Code,CCS Procedure Description,APR DRG Code,APR DRG Description,APR MDC Code,APR MDC Description,APR Severity of Illness Code,APR Severity of Illness Description,APR Risk of Mortality,APR Medical Surgical Description,Payment Typology 1,Payment Typology 2,Payment Typology 3,Birth Weight,Abortion Edit Indicator,Emergency Department Indicator,Total Charges,Total Costs
New York City,Bronx,7000006,001169,Montefiore Medical Center - Henry & Lucy Moses Div,70 or Older,104,F,Other Race,Not Span/Hispanic,4,Emergency,Home w/ Home Health Services,2017,106,Cardiac dysrhythmias,048,CARDIAC PACEMAKER/DEFIB,171,"Perm cardiac pacemaker implant w/o AMI, heart failure or shock",05,Diseases and Disorders of the Circulatory System,2,Moderate,Moderate,Surgical,Medicare,Private Health Insurance,,,N,Y,114034.90,35763.48
New York City,Kings,7002002,001324,Mount Sinai Brooklyn,50 to 69,112,M,Black/African American,Not Span/Hispanic,8,Emergency,Home or Self Care,2017,106,Cardiac dysrhythmias,048,CARDIAC PACEMAKER/DEFIB,171,"Perm cardiac pacemaker implant w/o AMI, heart failure or shock",05,Diseases and Disorders of the Circulatory System,1,Minor,Minor,Surgical,Private Health Insurance,Self-Pay,,,N,Y,91034.19,19738.60
New York City,Manhattan,7002002,001439,Mount Sinai Beth Israel,70 or Older,100,M,Other Race,Not Span/Hispanic,7,Emergency,Skilled Nursing Home,2017,105,Conduction disorders,048,CARDIAC PACEMAKER/DEFIB,171,"Perm cardiac pacemaker implant w/o AMI, heart failure or shock",05,Diseases and Disorders of the Circulatory System,3,Major,Major,Surgical,Medicare,Private Health Insurance,Self-Pay,,N,Y,87092.20,28939.06
New York City,Manhattan,7002002,001439,Mount Sinai Beth Israel,70 or Older,112,M,Other Race,Not Span/Hispanic,1,Urgent,Home or Self Care,2017,106,Cardiac dysrhythmias,048,CARDIAC PACEMAKER/DEFIB,171,"Perm cardiac pacemaker implant w/o AMI, heart failure or shock",05,Diseases and Disorders of the Circulatory System,2,Moderate,Major,Surgical,Medicare,Medicaid,Self-Pay,,N,N,45671.57,14173.99
New York City,Manhattan,7002024,001456,Mount Sinai Hospital,50 to 69,112,F,White,Not Span/Hispanic,17,Urgent,Skilled Nursing Home,2017,106,Cardiac dysrhythmias,048,CARDIAC PACEMAKER/DEFIB,171,"Perm cardiac pacemaker implant w/o AMI, heart failure or shock",05,Diseases and Disorders of the Circulatory System,3,Major,Major,Surgical,Medicare,Medicaid,Self-Pay,,N,N,167515.29,56614.13
Hudson Valley,Orange,3523000,000699,Orange Regional Medical Center,70 or Older,109,F,White,Not Span/Hispanic,4,Emergency,Home or Self Care,2017,106,Cardiac dysrhythmias,048,CARDIAC PACEMAKER/DEFIB,171,"Perm cardiac pacemaker implant w/o AMI, heart failure or shock",05,Diseases and Disorders of the Circulatory System,2,Moderate,Moderate,Surgical,Medicare,Private Health Insurance,,,N,Y,79612.91,36777.80
Hudson Valley,Orange,3523000,000699,Orange Regional Medical Center,70 or Older,124,F,White,Not Span/Hispanic,2,Emergency,Home w/ Home Health Services,2017,105,Conduction disorders,048,CARDIAC PACEMAKER/DEFIB,171,"Perm cardiac pacemaker implant w/o AMI, heart failure or shock",05,Diseases and Disorders of the Circulatory System,2,Moderate,Moderate,Surgical,Medicare,,,,N,Y,63157.98,27177.88
Hudson Valley,Orange,3523000,000699,Orange Regional Medical Center,70 or Older,109,M,White,Not Span/Hispanic,8,Emergency,Home w/ Home Health Services,2017,238,Complications of surgical procedures or medical care,048,CARDIAC PACEMAKER/DEFIB,171,"Perm cardiac pacemaker implant w/o AMI, heart failure or shock",05,Diseases and Disorders of the Circulatory System,3,Major,Major,Surgical,Medicare,,,,N,Y,110173.01,50784.32
Hudson Valley,Rockland,4329000,000779,Good Samaritan Hospital of Suffern,70 or Older,109,F,White,Not Span/Hispanic,8,Emergency,Inpatient Rehabilitation Facility,2017,106,Cardiac dysrhythmias,048,CARDIAC PACEMAKER/DEFIB,171,"Perm cardiac pacemaker implant w/o AMI, heart failure or shock",05,Diseases and Disorders of the Circulatory System,3,Major,Major,Surgical,Medicare,Private Health Insurance,,,N,Y,172415.25,28593.81
Hudson Valley,Rockland,4329000,000779,Good Samaritan Hospital of Suffern,70 or Older,109,F,Other Race,Unknown,4,Emergency,Inpatient Rehabilitation Facility,2017,106,Cardiac dysrhythmias,048,CARDIAC PACEMAKER/DEFIB,171,"Perm cardiac pacemaker implant w/o AMI, heart failure or shock",05,Diseases and Disorders of the Circulatory System,2,Moderate,Major,Surgical,Medicare,Medicaid,,,N,Y,108350.35,17315.36
New York City,Bronx,7000006,001169,Montefiore Medical Center - Henry & Lucy Moses Div,70 or Older,104,F,Black/African American,Not Span/Hispanic,1,Emergency,Home or Self Care,2017,106,Cardiac dysrhythmias,048,CARDIAC PACEMAKER/DEFIB,171,"Perm cardiac pacemaker implant w/o AMI, heart failure or shock",05,Diseases and Disorders of the Circulatory System,2,Moderate,Moderate,Surgical,Medicare,Medicaid,,,N,N,55934.74,20131.07
New York City,Bronx,7000006,001169,Montefiore Medical Center - Henry & Lucy Moses Div,70 or Older,104,F,Black/African American,Not Span/Hispanic,7,Emergency,Skilled Nursing Home,2017,106,Cardiac dysrhythmias,048,CARDIAC PACEMAKER/DEFIB,171,"Perm cardiac pacemaker implant w/o AMI, heart failure or shock",05,Diseases and Disorders of the Circulatory System,2,Moderate,Moderate,Surgical,Medicare,Medicaid,,,N,Y,144281.72,47127.98
New York City,Bronx,7000006,001169,Montefiore Medical Center - Henry & Lucy Moses Div,70 or Older,104,M,Other Race,Spanish/Hispanic,1,Emergency,Home or Self Care,2017,105,Conduction disorders,174,OT NON-OR THER PRC SKIN,171,"Perm cardiac pacemaker implant w/o AMI, heart failure or shock",05,Diseases and Disorders of the Circulatory System,1,Minor,Moderate,Surgical,Medicare,Medicaid,,,N,N,59217.08,21423.60
New York City,Manhattan,7002024,001456,Mount Sinai Hospital,70 or Older,112,M,White,Not Span/Hispanic,9,Emergency,Skilled Nursing Home,2017,105,Conduction disorders,048,CARDIAC PACEMAKER/DEFIB,171,"Perm cardiac pacemaker implant w/o AMI, heart failure or shock",05,Diseases and Disorders of the Circulatory System,3,Major,Major,Surgical,Medicare,Medicare,Self-Pay,,N,Y,103999.35,34563.95
New York City,Manhattan,7002032,001469,Mount Sinai St. Luke's,70 or Older,100,F,Other Race,Not Span/Hispanic,2,Emergency,Home or Self Care,2017,105,Conduction disorders,048,CARDIAC PACEMAKER/DEFIB,171,"Perm cardiac pacemaker implant w/o AMI, heart failure or shock",05,Diseases and Disorders of the Circulatory System,2,Moderate,Moderate,Surgical,Medicare,Private Health Insurance,Self-Pay,,N,Y,52875.29,25644.79
New York City,Manhattan,7002032,001469,Mount Sinai St. Luke's,70 or Older,100,F,Black/African American,Not Span/Hispanic,2,Emergency,Skilled Nursing Home,2017,106,Cardiac dysrhythmias,048,CARDIAC PACEMAKER/DEFIB,171,"Perm cardiac pacemaker implant w/o AMI, heart failure or shock",05,Diseases and Disorders of the Circulatory System,1,Minor,Moderate,Surgical,Medicare,Private Health Insurance,Self-Pay,,N,Y,54632.22,25828.81
Hudson Valley,Westchester,5904001,001072,Montefiore New Rochelle Hospital,70 or Older,108,F,Black/African American,Not Span/Hispanic,12,Emergency,Skilled Nursing Home,2017,105,Conduction disorders,048,CARDIAC PACEMAKER/DEFIB,171,"Perm cardiac pacemaker implant w/o AMI, heart failure or shock",05,Diseases and Disorders of the Circulatory System,3,Major,Major,Surgical,Medicare,Medicare,Self-Pay,,N,N,110874.48,52662.07
Hudson Valley,Westchester,5904001,001072,Montefiore New Rochelle Hospital,70 or Older,108,F,Black/African American,Not Span/Hispanic,4,Emergency,Home or Self Care,2017,105,Conduction disorders,048,CARDIAC PACEMAKER/DEFIB,171,"Perm cardiac pacemaker implant w/o AMI, heart failure or shock",05,Diseases and Disorders of the Circulatory System,3,Major,Major,Surgical,Medicare,Medicare,Private Health Insurance,,N,N,65998.11,20980.79
New York City,Bronx,7000006,001169,Montefiore Medical Center - Henry & Lucy Moses Div,0 to 17,127,M,White,Not Span/Hispanic,1,Emergency,Home or Self Care,2017,106,Cardiac dysrhythmias,048,CARDIAC PACEMAKER/DEFIB,171,"Perm cardiac pacemaker implant w/o AMI, heart failure or shock",05,Diseases and Disorders of the Circulatory System,2,Moderate,Minor,Surgical,Medicaid,,,,N,N,59812.99,21717.16
New York City,Bronx,7000006,003058,Montefiore Med Center - Jack D Weiler Hosp of A Einstein College Div,70 or Older,104,F,White,Not Span/Hispanic,8,Emergency,Skilled Nursing Home,2017,107,Cardiac arrest and ventricular fibrillation,048,CARDIAC PACEMAKER/DEFIB,171,"Perm cardiac pacemaker implant w/o AMI, heart failure or shock",05,Diseases and Disorders of the Circulatory System,3,Major,Extreme,Surgical,Medicare,,,,N,Y,191573.41,60042.25
New York City,Bronx,7000006,003058,Montefiore Med Center - Jack D Weiler Hosp of A Einstein College Div,50 to 69,104,F,Other Race,Not Span/Hispanic,2,Emergency,Home or Self Care,2017,106,Cardiac dysrhythmias,048,CARDIAC PACEMAKER/DEFIB,171,"Perm cardiac pacemaker implant w/o AMI, heart failure or shock",05,Diseases and Disorders of the Circulatory System,2,Moderate,Minor,Surgical,Medicaid,,,,N,Y,59581.73,20075.98
New York City,Kings,7001037,001320,University Hospital of Brooklyn,50 to 69,112,M,Black/African American,Not Span/Hispanic,9,Emergency,Home or Self Care,2017,106,Cardiac dysrhythmias,048,CARDIAC PACEMAKER/DEFIB,171,"Perm cardiac pacemaker implant w/o AMI, heart failure or shock",05,Diseases and Disorders of the Circulatory System,2,Moderate,Minor,Surgical,Medicare,Blue Cross/Blue Shield,Self-Pay,,N,Y,73121.18,42417.27
New York City,Manhattan,7002002,001439,Mount Sinai Beth Israel,70 or Older,100,F,Black/African American,Spanish/Hispanic,3,Emergency,Home or Self Care,2017,105,Conduction disorders,048,CARDIAC PACEMAKER/DEFIB,171,"Perm cardiac pacemaker implant w/o AMI, heart failure or shock",05,Diseases and Disorders of the Circulatory System,2,Moderate,Moderate,Surgical,Medicare,Miscellaneous/Other,Self-Pay,,N,Y,32973.43,13443.96
New York City,Manhattan,7002053,001463,NYU Langone Hospitals,70 or Older,100,F,White,Not Span/Hispanic,8,Emergency,Home w/ Home Health Services,2017,237,Complication of device; implant or graft,048,CARDIAC PACEMAKER/DEFIB,171,"Perm cardiac pacemaker implant w/o AMI, heart failure or shock",05,Diseases and Disorders of the Circulatory System,3,Major,Major,Surgical,Medicare,,,,N,Y,265982.91,73645.04
New York City,Manhattan,7002032,001469,Mount Sinai St. Luke's,70 or Older,100,M,White,Not Span/Hispanic,1,Emergency,Home or Self Care,2017,105,Conduction disorders,048,CARDIAC PACEMAKER/DEFIB,171,"Perm cardiac pacemaker implant w/o AMI, heart failure or shock",05,Diseases and Disorders of the Circulatory System,2,Moderate,Major,Surgical,Medicare,Blue Cross/Blue Shield,Self-Pay,,N,Y,48084.94,24404.88
New York City,Kings,7001008,001293,"New York Community Hospital of Brooklyn, Inc",70 or Older,112,M,White,Not Span/Hispanic,23,Emergency,Skilled Nursing Home,2017,106,Cardiac dysrhythmias,048,CARDIAC PACEMAKER/DEFIB,171,"Perm cardiac pacemaker implant w/o AMI, heart failure or shock",05,Diseases and Disorders of the Circulatory System,4,Extreme,Extreme,Surgical,Medicare,Blue Cross/Blue Shield,Self-Pay,,N,Y,133503.62,60930.95
New York City,Kings,7001008,001293,"New York Community Hospital of Brooklyn, Inc",70 or Older,112,F,White,Not Span/Hispanic,8,Emergency,Home w/ Home Health Services,2017,106,Cardiac dysrhythmias,048,CARDIAC PACEMAKER/DEFIB,171,"Perm cardiac pacemaker implant w/o AMI, heart failure or shock",05,Diseases and Disorders of the Circulatory System,2,Moderate,Moderate,Surgical,Medicare,Medicaid,Self-Pay,,N,Y,39506.44,24868.76
New York City,Kings,7001008,001293,"New York Community Hospital of Brooklyn, Inc",70 or Older,112,M,White,Not Span/Hispanic,6,Emergency,Inpatient Rehabilitation Facility,2017,105,Conduction disorders,048,CARDIAC PACEMAKER/DEFIB,171,"Perm cardiac pacemaker implant w/o AMI, heart failure or shock",05,Diseases and Disorders of the Circulatory System,2,Moderate,Minor,Surgical,Medicare,Medicaid,Self-Pay,,N,Y,43674.04,23181.31
New York City,Kings,7001021,001306,New York - Presbyterian Brooklyn Methodist Hospital,70 or Older,112,M,White,Not Span/Hispanic,13,Emergency,Inpatient Rehabilitation Facility,2017,096,Heart valve disorders,048,CARDIAC PACEMAKER/DEFIB,171,"Perm cardiac pacemaker implant w/o AMI, heart failure or shock",05,Diseases and Disorders of the Circulatory System,4,Extreme,Major,Surgical,Medicare,Blue Cross/Blue Shield,Self-Pay,,N,N,143230.71,49384.40
New York City,Kings,7001021,001306,New York - Presbyterian Brooklyn Methodist Hospital,70 or Older,112,F,Black/African American,Not Span/Hispanic,6,Emergency,Home or Self Care,2017,105,Conduction disorders,048,CARDIAC PACEMAKER/DEFIB,171,"Perm cardiac pacemaker implant w/o AMI, heart failure or shock",05,Diseases and Disorders of the Circulatory System,3,Major,Major,Surgical,Medicare,Medicare,Self-Pay,,N,Y,81344.77,29688.49
New York City,Kings,7001021,001306,New York - Presbyterian Brooklyn Methodist Hospital,50 to 69,112,F,Black/African American,Not Span/Hispanic,5,Emergency,Skilled Nursing Home,2017,106,Cardiac dysrhythmias,048,CARDIAC PACEMAKER/DEFIB,171,"Perm cardiac pacemaker implant w/o AMI, heart failure or shock",05,Diseases and Disorders of the Circulatory System,3,Major,Major,Surgical,Private Health Insurance,Medicare,Self-Pay,,N,Y,57832.48,18719.55
New York City,Kings,7001021,001306,New York - Presbyterian Brooklyn Methodist Hospital,70 or Older,112,M,Black/African American,Not Span/Hispanic,6,Emergency,Home w/ Home Health Services,2017,105,Conduction disorders,048,CARDIAC PACEMAKER/DEFIB,171,"Perm cardiac pacemaker implant w/o AMI, heart failure or shock",05,Diseases and Disorders of the Circulatory System,3,Major,Moderate,Surgical,Medicare,Blue Cross/Blue Shield,Self-Pay,,N,Y,55938.24,17763.02
New York City,Kings,7001021,001306,New York - Presbyterian Brooklyn Methodist Hospital,50 to 69,112,F,Black/African American,Not Span/Hispanic,2,Emergency,Home w/ Home Health Services,2017,105,Conduction disorders,048,CARDIAC PACEMAKER/DEFIB,171,"Perm cardiac pacemaker implant w/o AMI, heart failure or shock",05,Diseases and Disorders of the Circulatory System,2,Moderate,Moderate,Surgical,Federal/State/Local/VA,Medicaid,Self-Pay,,N,Y,35606.36,14246.49
New York City,Kings,7002002,001324,Mount Sinai Brooklyn,70 or Older,112,M,White,Not Span/Hispanic,2,Urgent,Home w/ Home Health Services,2017,106,Cardiac dysrhythmias,048,CARDIAC PACEMAKER/DEFIB,171,"Perm cardiac pacemaker implant w/o AMI, heart failure or shock",05,Diseases and Disorders of the Circulatory System,3,Major,Major,Surgical,Medicare,Medicaid,Self-Pay,,N,N,44832.64,12327.05
New York City,Manhattan,7002002,001439,Mount Sinai Beth Israel,70 or Older,100,M,Black/African American,Not Span/Hispanic,4,Emergency,Home w/ Home Health Services,2017,105,Conduction disorders,048,CARDIAC PACEMAKER/DEFIB,171,"Perm cardiac pacemaker implant w/o AMI, heart failure or shock",05,Diseases and Disorders of the Circulatory System,2,Moderate,Major,Surgical,Medicare,Miscellaneous/Other,Self-Pay,,N,Y,76370.10,24248.23
New York City,Manhattan,7002002,001439,Mount Sinai Beth Israel,70 or Older,112,F,Black/African American,Not Span/Hispanic,6,Urgent,Skilled Nursing Home,2017,106,Cardiac dysrhythmias,048,CARDIAC PACEMAKER/DEFIB,171,"Perm cardiac pacemaker implant w/o AMI, heart failure or shock",05,Diseases and Disorders of the Circulatory System,3,Major,Major,Surgical,Medicare,Blue Cross/Blue Shield,Self-Pay,,N,N,47069.89,16014.31
New York City,Manhattan,7002002,001439,Mount Sinai Beth Israel,70 or Older,113,F,Other Race,Not Span/Hispanic,2,Emergency,Home or Self Care,2017,105,Conduction disorders,048,CARDIAC PACEMAKER/DEFIB,171,"Perm cardiac pacemaker implant w/o AMI, heart failure or shock",05,Diseases and Disorders of the Circulatory System,1,Minor,Minor,Surgical,Medicare,Private Health Insurance,Self-Pay,,N,Y,58315.02,18849.20
New York City,Manhattan,7002024,001456,Mount Sinai Hospital,70 or Older,100,M,White,Not Span/Hispanic,1,Urgent,Home or Self Care,2017,106,Cardiac dysrhythmias,048,CARDIAC PACEMAKER/DEFIB,171,"Perm cardiac pacemaker implant w/o AMI, heart failure or shock",05,Diseases and Disorders of the Circulatory System,2,Moderate,Major,Surgical,Medicare,Private Health Insurance,Self-Pay,,N,N,32734.85,12718.67
New York City,Manhattan,7002024,001456,Mount Sinai Hospital,0 to 17,114,F,Other Race,Not Span/Hispanic,12,Elective,Home or Self Care,2017,237,Complication of device; implant or graft,048,CARDIAC PACEMAKER/DEFIB,171,"Perm cardiac pacemaker implant w/o AMI, heart failure or shock",05,Diseases and Disorders of the Circulatory System,4,Extreme,Major,Surgical,Medicaid,Medicaid,Self-Pay,,N,N,171806.73,65841.66
New York City,Manhattan,7002054,001464,New York Presbyterian Hospital - Columbia Presbyterian Center,50 to 69,117,F,White,Not Span/Hispanic,25,Urgent,Home or Self Care,2017,237,Complication of device; implant or graft,161,OT OR THER PRCS ON BONE,171,"Perm cardiac pacemaker implant w/o AMI, heart failure or shock",05,Diseases and Disorders of the Circulatory System,3,Major,Moderate,Surgical,Blue Cross/Blue Shield,Medicare,Self-Pay,,N,N,349819.02,108475.78
New York City,Manhattan,7002054,001464,New York Presbyterian Hospital - Columbia Presbyterian Center,50 to 69,109,M,White,Not Span/Hispanic,2,Urgent,Home or Self Care,2017,106,Cardiac dysrhythmias,048,CARDIAC PACEMAKER/DEFIB,171,"Perm cardiac pacemaker implant w/o AMI, heart failure or shock",05,Diseases and Disorders of the Circulatory System,3,Major,Major,Surgical,Medicaid,Self-Pay,,,N,N,89609.34,44298.11
New York City,Manhattan,7002054,001464,New York Presbyterian Hospital - Columbia Presbyterian Center,70 or Older,105,F,Multi-racial,Not Span/Hispanic,4,Urgent,Home or Self Care,2017,106,Cardiac dysrhythmias,048,CARDIAC PACEMAKER/DEFIB,171,"Perm cardiac pacemaker implant w/o AMI, heart failure or shock",05,Diseases and Disorders of the Circulatory System,3,Major,Major,Surgical,Medicare,Medicare,Self-Pay,,N,N,93080.29,50673.70
New York City,Manhattan,7002054,001464,New York Presbyterian Hospital - Columbia Presbyterian Center,70 or Older,100,M,Multi-racial,Not Span/Hispanic,4,Emergency,Home or Self Care,2017,106,Cardiac dysrhythmias,048,CARDIAC PACEMAKER/DEFIB,171,"Perm cardiac pacemaker implant w/o AMI, heart failure or shock",05,Diseases and Disorders of the Circulatory System,1,Minor,Minor,Surgical,Private Health Insurance,Blue Cross/Blue Shield,Medicare,,N,Y,61371.30,20135.30
New York City,Manhattan,7002054,001464,New York Presbyterian Hospital - Columbia Presbyterian Center,70 or Older,100,M,White,Not Span/Hispanic,2,Emergency,Home or Self Care,2017,106,Cardiac dysrhythmias,048,CARDIAC PACEMAKER/DEFIB,171,"Perm cardiac pacemaker implant w/o AMI, heart failure or shock",05,Diseases and Disorders of the Circulatory System,1,Minor,Minor,Surgical,Private Health Insurance,Self-Pay,,,N,Y,41716.36,15326.06
New York City,Manhattan,7002054,001464,New York Presbyterian Hospital - Columbia Presbyterian Center,50 to 69,112,F,Other Race,Not Span/Hispanic,4,Emergency,Home or Self Care,2017,106,Cardiac dysrhythmias,048,CARDIAC PACEMAKER/DEFIB,171,"Perm cardiac pacemaker implant w/o AMI, heart failure or shock",05,Diseases and Disorders of the Circulatory System,2,Moderate,Moderate,Surgical,Medicaid,Medicaid,Self-Pay,,N,Y,63001.55,21072.23
New York City,Manhattan,7002054,001464,New York Presbyterian Hospital - Columbia Presbyterian Center,70 or Older,100,F,Other Race,Not Span/Hispanic,6,Emergency,Home w/ Home Health Services,2017,106,Cardiac dysrhythmias,048,CARDIAC PACEMAKER/DEFIB,171,"Perm cardiac pacemaker implant w/o AMI, heart failure or shock",05,Diseases and Disorders of the Circulatory System,3,Major,Major,Surgical,Medicare,Medicare,Medicaid,,N,Y,148296.12,77381.56
New York City,Manhattan,7002032,001469,Mount Sinai St. Luke's,70 or Older,100,M,Black/African American,Spanish/Hispanic,8,Emergency,Home w/ Home Health Services,2017,105,Conduction disorders,048,CARDIAC PACEMAKER/DEFIB,171,"Perm cardiac pacemaker implant w/o AMI, heart failure or shock",05,Diseases and Disorders of the Circulatory System,2,Moderate,Moderate,Surgical,Medicare,Medicaid,Self-Pay,,N,Y,66507.06,19535.54
New York City,Manhattan,7002054,003975,New York Presbyterian Hospital - Allen Hospital,18 to 29,104,M,Other Race,Not Span/Hispanic,2,Emergency,Home or Self Care,2017,105,Conduction disorders,048,CARDIAC PACEMAKER/DEFIB,171,"Perm cardiac pacemaker implant w/o AMI, heart failure or shock",05,Diseases and Disorders of the Circulatory System,2,Moderate,Moderate,Surgical,Medicaid,Medicaid,Self-Pay,,N,Y,23009.80,5671.00
New York City,Queens,7003010,001637,New York - Presbyterian/Queens,70 or Older,113,F,Other Race,Not Span/Hispanic,20,Emergency,Skilled Nursing Home,2017,106,Cardiac dysrhythmias,165,BREAST BIOPSY & DX PRCS,171,"Perm cardiac pacemaker implant w/o AMI, heart failure or shock",05,Diseases and Disorders of the Circulatory System,3,Major,Major,Surgical,Medicare,Medicaid,Self-Pay,,N,Y,143027.64,50334.84
New York City,Queens,7003010,001637,New York - Presbyterian/Queens,50 to 69,113,M,Other Race,Not Span/Hispanic,9,Emergency,Home w/ Home Health Services,2017,106,Cardiac dysrhythmias,048,CARDIAC PACEMAKER/DEFIB,171,"Perm cardiac pacemaker implant w/o AMI, heart failure or shock",05,Diseases and Disorders of the Circulatory System,3,Major,Major,Surgical,Medicaid,Self-Pay,,,N,Y,88324.08,33566.18
New York City,Queens,7003010,001637,New York - Presbyterian/Queens,70 or Older,113,F,Black/African American,Not Span/Hispanic,13,Emergency,Home w/ Home Health Services,2017,106,Cardiac dysrhythmias,048,CARDIAC PACEMAKER/DEFIB,171,"Perm cardiac pacemaker implant w/o AMI, heart failure or shock",05,Diseases and Disorders of the Circulatory System,2,Moderate,Major,Surgical,Medicare,Medicare,Medicaid,,N,Y,91025.68,32729.95
New York City,Queens,7003010,001637,New York - Presbyterian/Queens,70 or Older,113,F,Other Race,Not Span/Hispanic,6,Emergency,Home or Self Care,2017,106,Cardiac dysrhythmias,048,CARDIAC PACEMAKER/DEFIB,171,"Perm cardiac pacemaker implant w/o AMI, heart failure or shock",05,Diseases and Disorders of the Circulatory System,2,Moderate,Moderate,Surgical,Medicare,Medicaid,Self-Pay,,N,Y,65241.36,26872.36
New York City,Queens,7003010,001637,New York - Presbyterian/Queens,70 or Older,113,M,Other Race,Not Span/Hispanic,4,Emergency,Home w/ Home Health Services,2017,105,Conduction disorders,048,CARDIAC PACEMAKER/DEFIB,171,"Perm cardiac pacemaker implant w/o AMI, heart failure or shock",05,Diseases and Disorders of the Circulatory System,2,Moderate,Major,Surgical,Medicare,Private Health Insurance,Self-Pay,,N,Y,46122.37,19686.57
New York City,Queens,7003010,001637,New York - Presbyterian/Queens,70 or Older,113,F,Other Race,Not Span/Hispanic,4,Emergency,Home w/ Home Health Services,2017,106,Cardiac dysrhythmias,048,CARDIAC PACEMAKER/DEFIB,171,"Perm cardiac pacemaker implant w/o AMI, heart failure or shock",05,Diseases and Disorders of the Circulatory System,2,Moderate,Moderate,Surgical,Medicare,Medicare,Medicaid,,N,Y,46084.64,19393.93
New York City,Queens,7003010,001637,New York - Presbyterian/Queens,50 to 69,112,F,Other Race,Spanish/Hispanic,3,Emergency,Home or Self Care,2017,105,Conduction disorders,048,CARDIAC PACEMAKER/DEFIB,171,"Perm cardiac pacemaker implant w/o AMI, heart failure or shock",05,Diseases and Disorders of the Circulatory System,2,Moderate,Minor,Surgical,Medicaid,Blue Cross/Blue Shield,Self-Pay,,N,Y,42015.70,18770.81