Hospital Service Area,Hospital County,Operating Certificate Number,Permanent Facility Id,Facility Name,Age Group,Zip Code - 3 digits,Gender,Race,Ethnicity,Length of Stay,Type of Admission,Patient Disposition,Discharge Year,CCS Diagnosis Code,CCS Diagnosis Description,CCS Procedure Code,CCS Procedure Description,APR DRG Code,APR DRG Description,APR MDC Code,APR MDC Description,APR Severity of Illness Code,APR Severity of Illness Description,APR Risk of Mortality,APR Medical Surgical Description,Payment Typology 1,Payment Typology 2,Payment Typology 3,Birth Weight,Abortion Edit Indicator,Emergency Department Indicator,Total Charges,Total Costs
New York City,Manhattan,7002053,001463,NYU Langone Hospitals,50 to 69,112,F,Black/African American,Not Span/Hispanic,2,Emergency,Home or Self Care,2019,CIR009,ACUTE MYOCARDIAL INFARCTION,CAR004,PERCUTANEOUS CORONARY INTERVENTIONS (PCI),174,PERCUTANEOUS CORONARY INTERVENTION W AMI,05,DISEASES AND DISORDERS OF THE CIRCULATORY SYSTEM,1,Minor,Minor,Surgical,Private Health Insurance,,,,,true,132458.74,25756.94
New York City,Manhattan,7002001,001438,Bellevue Hospital Center,70 or Older,114,F,Other Race,Not Span/Hispanic,9,Emergency,Home w/ Home Health Services,2019,CIR009,ACUTE MYOCARDIAL INFARCTION,CAR004,PERCUTANEOUS CORONARY INTERVENTIONS (PCI),174,PERCUTANEOUS CORONARY INTERVENTION W AMI,05,DISEASES AND DISORDERS OF THE CIRCULATORY SYSTEM,3,Major,Major,Surgical,Medicare,Medicare,Medicaid,,,false,69829.65,46408.79
New York City,Manhattan,7002001,001438,Bellevue Hospital Center,50 to 69,100,M,Other Race,Spanish/Hispanic,18,Emergency,Home or Self Care,2019,CIR009,ACUTE MYOCARDIAL INFARCTION,CAR004,PERCUTANEOUS CORONARY INTERVENTIONS (PCI),174,PERCUTANEOUS CORONARY INTERVENTION W AMI,05,DISEASES AND DISORDERS OF THE CIRCULATORY SYSTEM,4,Extreme,Extreme,Surgical,Medicare,Medicare,,,,false,119201.94,79221.61
New York City,Manhattan,7002001,001438,Bellevue Hospital Center,30 to 49,100,M,Other Race,Not Span/Hispanic,3,Emergency,Home or Self Care,2019,CIR009,ACUTE MYOCARDIAL INFARCTION,CAR004,PERCUTANEOUS CORONARY INTERVENTIONS (PCI),174,PERCUTANEOUS CORONARY INTERVENTION W AMI,05,DISEASES AND DISORDERS OF THE CIRCULATORY SYSTEM,1,Minor,Minor,Surgical,Blue Cross/Blue Shield,,,,,true,19548.61,12992.01
Hudson Valley,Rockland,4329000,000779,Good Samaritan Hospital of Suffern,50 to 69,109,M,White,Not Span/Hispanic,7,Elective,Inpatient Rehabilitation Facility,2019,CIR009,ACUTE MYOCARDIAL INFARCTION,MAM005,MEASUREMENT DURING CARDIAC CATHETERIZATION,174,PERCUTANEOUS CORONARY INTERVENTION W AMI,05,DISEASES AND DISORDERS OF THE CIRCULATORY SYSTEM,4,Extreme,Extreme,Surgical,Private Health Insurance,,,,,false,268335.44,42498.96
New York City,Manhattan,7002001,001438,Bellevue Hospital Center,30 to 49,104,M,Black/African American,Not Span/Hispanic,4,Emergency,Home or Self Care,2019,CIR009,ACUTE MYOCARDIAL INFARCTION,CAR004,PERCUTANEOUS CORONARY INTERVENTIONS (PCI),174,PERCUTANEOUS CORONARY INTERVENTION W AMI,05,DISEASES AND DISORDERS OF THE CIRCULATORY SYSTEM,3,Major,Major,Surgical,Private Health Insurance,Medicaid,,,,true,29487.81,19597.6
New York City,Manhattan,7002017,001450,Lenox Hill Hospital,30 to 49,100,M,Other Race,Not Span/Hispanic,2,Emergency,Home or Self Care,2019,CIR009,ACUTE MYOCARDIAL INFARCTION,CAR004,PERCUTANEOUS CORONARY INTERVENTIONS (PCI),174,PERCUTANEOUS CORONARY INTERVENTION W AMI,05,DISEASES AND DISORDERS OF THE CIRCULATORY SYSTEM,2,Moderate,Moderate,Surgical,Blue Cross/Blue Shield,,,,,true,83330.1,22916.41
Southern Tier,Broome,0303001,000058,United Health Services Hospitals Inc. - Wilson Medical Center,30 to 49,137,M,White,Not Span/Hispanic,2,Emergency,Left Against Medical Advice,2019,CIR009,ACUTE MYOCARDIAL INFARCTION,ESA004,NON-INVASIVE VENTILATION,174,PERCUTANEOUS CORONARY INTERVENTION W AMI,05,DISEASES AND DISORDERS OF THE CIRCULATORY SYSTEM,2,Moderate,Minor,Surgical,Medicaid,Medicaid,,,,true,43510.8,15520.46
Southern Tier,Broome,0303001,000058,United Health Services Hospitals Inc. - Wilson Medical Center,50 to 69,138,F,White,Not Span/Hispanic,4,Emergency,Home or Self Care,2019,CIR009,ACUTE MYOCARDIAL INFARCTION,MAM005,MEASUREMENT DURING CARDIAC CATHETERIZATION,174,PERCUTANEOUS CORONARY INTERVENTION W AMI,05,DISEASES AND DISORDERS OF THE CIRCULATORY SYSTEM,4,Extreme,Major,Surgical,Blue Cross/Blue Shield,,,,,true,38959.9,13145.4
New York City,Kings,7002053,001304,NYU Langone Hospital-Brooklyn,50 to 69,112,M,Black/African American,Not Span/Hispanic,2,Emergency,Home or Self Care,2019,CIR009,ACUTE MYOCARDIAL INFARCTION,CAR004,PERCUTANEOUS CORONARY INTERVENTIONS (PCI),174,PERCUTANEOUS CORONARY INTERVENTION W AMI,05,DISEASES AND DISORDERS OF THE CIRCULATORY SYSTEM,3,Major,Moderate,Surgical,Medicaid,,,,,true,123497.34,24911.69
New York City,Kings,7002053,001304,NYU Langone Hospital-Brooklyn,50 to 69,112,M,Other Race,Not Span/Hispanic,3,Emergency,Home or Self Care,2019,CIR009,ACUTE MYOCARDIAL INFARCTION,CAR004,PERCUTANEOUS CORONARY INTERVENTIONS (PCI),174,PERCUTANEOUS CORONARY INTERVENTION W AMI,05,DISEASES AND DISORDERS OF THE CIRCULATORY SYSTEM,2,Moderate,Moderate,Surgical,Blue Cross/Blue Shield,,,,,true,252583.89,43063.03
New York City,Kings,7002053,001304,NYU Langone Hospital-Brooklyn,50 to 69,112,F,White,Not Span/Hispanic,2,Emergency,Home or Self Care,2019,CIR009,ACUTE MYOCARDIAL INFARCTION,CAR004,PERCUTANEOUS CORONARY INTERVENTIONS (PCI),174,PERCUTANEOUS CORONARY INTERVENTION W AMI,05,DISEASES AND DISORDERS OF THE CIRCULATORY SYSTEM,2,Moderate,Minor,Surgical,Blue Cross/Blue Shield,Medicare,,,,true,153576.87,29586.62
New York City,Manhattan,7002054,001458,New York-Presbyterian Hospital - New York Weill Cornell Center,50 to 69,OOS,M,White,Not Span/Hispanic,3,Emergency,Home or Self Care,2019,CIR009,ACUTE MYOCARDIAL INFARCTION,ESA009,CARDIAC ASSISTANCE WITH BALLOON PUMP,174,PERCUTANEOUS CORONARY INTERVENTION W AMI,05,DISEASES AND DISORDERS OF THE CIRCULATORY SYSTEM,4,Extreme,Extreme,Surgical,Private Health Insurance,Self-Pay,,,,true,98728.72,43098.53
New York City,Bronx,7000006,001169,Montefiore Medical Center - Henry & Lucy Moses Div,50 to 69,104,M,Other Race,Spanish/Hispanic,2,Emergency,Home or Self Care,2019,CIR009,ACUTE MYOCARDIAL INFARCTION,CAR004,PERCUTANEOUS CORONARY INTERVENTIONS (PCI),174,PERCUTANEOUS CORONARY INTERVENTION W AMI,05,DISEASES AND DISORDERS OF THE CIRCULATORY SYSTEM,3,Major,Major,Surgical,Medicaid,,,,,true,110892.15,25228.3
Hudson Valley,Orange,3522000,000694,St Luke's Cornwall Hospital/Newburgh,50 to 69,125,M,White,Not Span/Hispanic,1,Emergency,Home or Self Care,2019,CIR009,ACUTE MYOCARDIAL INFARCTION,CAR004,PERCUTANEOUS CORONARY INTERVENTIONS (PCI),174,PERCUTANEOUS CORONARY INTERVENTION W AMI,05,DISEASES AND DISORDERS OF THE CIRCULATORY SYSTEM,2,Moderate,Moderate,Surgical,Blue Cross/Blue Shield,,,,,true,75269.2,17223.44
Hudson Valley,Orange,3522000,000694,St Luke's Cornwall Hospital/Newburgh,50 to 69,125,M,Other Race,Unknown,4,Emergency,Court/Law Enforcement,2019,CIR009,ACUTE MYOCARDIAL INFARCTION,CAR004,PERCUTANEOUS CORONARY INTERVENTIONS (PCI),174,PERCUTANEOUS CORONARY INTERVENTION W AMI,05,DISEASES AND DISORDERS OF THE CIRCULATORY SYSTEM,3,Major,Moderate,Surgical,Medicaid,,,,,true,150139.75,38143.16
Finger Lakes,Monroe,2701003,000411,Rochester General Hospital,70 or Older,145,F,White,Not Span/Hispanic,2,Emergency,Home or Self Care,2019,CIR009,ACUTE MYOCARDIAL INFARCTION,CAR004,PERCUTANEOUS CORONARY INTERVENTIONS (PCI),174,PERCUTANEOUS CORONARY INTERVENTION W AMI,05,DISEASES AND DISORDERS OF THE CIRCULATORY SYSTEM,2,Moderate,Minor,Surgical,Medicare,,,,,true,43581.74,13630.76
Finger Lakes,Monroe,2701003,000411,Rochester General Hospital,50 to 69,146,F,White,Not Span/Hispanic,4,Emergency,Home or Self Care,2019,CIR009,ACUTE MYOCARDIAL INFARCTION,CAR004,PERCUTANEOUS CORONARY INTERVENTIONS (PCI),174,PERCUTANEOUS CORONARY INTERVENTION W AMI,05,DISEASES AND DISORDERS OF THE CIRCULATORY SYSTEM,2,Moderate,Moderate,Surgical,Medicare,,,,,true,59398.18,19068.54
Finger Lakes,Monroe,2701003,000411,Rochester General Hospital,30 to 49,,M,Other Race,Spanish/Hispanic,3,Urgent,Home or Self Care,2019,CIR009,ACUTE MYOCARDIAL INFARCTION,ESA009,CARDIAC ASSISTANCE WITH BALLOON PUMP,174,PERCUTANEOUS CORONARY INTERVENTION W AMI,05,DISEASES AND DISORDERS OF THE CIRCULATORY SYSTEM,4,Extreme,Major,Surgical,Medicaid,,,,,false,69264.94,24068.15
Finger Lakes,Monroe,2701003,000411,Rochester General Hospital,30 to 49,146,M,White,Not Span/Hispanic,3,Emergency,Home or Self Care,2019,CIR009,ACUTE MYOCARDIAL INFARCTION,CAR004,PERCUTANEOUS CORONARY INTERVENTIONS (PCI),174,PERCUTANEOUS CORONARY INTERVENTION W AMI,05,DISEASES AND DISORDERS OF THE CIRCULATORY SYSTEM,2,Moderate,Moderate,Surgical,Medicaid,,,,,true,59148.75,19212.83
Finger Lakes,Monroe,2701003,000411,Rochester General Hospital,70 or Older,145,M,White,Not Span/Hispanic,1,Emergency,Home or Self Care,2019,CIR009,ACUTE MYOCARDIAL INFARCTION,MAM005,MEASUREMENT DURING CARDIAC CATHETERIZATION,174,PERCUTANEOUS CORONARY INTERVENTION W AMI,05,DISEASES AND DISORDERS OF THE CIRCULATORY SYSTEM,1,Minor,Minor,Surgical,Federal/State/Local/VA,,,,,true,54758.62,16541.4
Finger Lakes,Monroe,2701003,000411,Rochester General Hospital,70 or Older,144,M,White,Not Span/Hispanic,2,Emergency,Home or Self Care,2019,CIR009,ACUTE MYOCARDIAL INFARCTION,CAR004,PERCUTANEOUS CORONARY INTERVENTIONS (PCI),174,PERCUTANEOUS CORONARY INTERVENTION W AMI,05,DISEASES AND DISORDERS OF THE CIRCULATORY SYSTEM,1,Minor,Minor,Surgical,Medicare,,,,,true,47660.05,14602.55
New York City,Manhattan,7002054,001458,New York-Presbyterian Hospital - New York Weill Cornell Center,30 to 49,112,M,White,Not Span/Hispanic,2,Emergency,Home or Self Care,2019,CIR009,ACUTE MYOCARDIAL INFARCTION,CAR004,PERCUTANEOUS CORONARY INTERVENTIONS (PCI),174,PERCUTANEOUS CORONARY INTERVENTION W AMI,05,DISEASES AND DISORDERS OF THE CIRCULATORY SYSTEM,2,Moderate,Minor,Surgical,Blue Cross/Blue Shield,Self-Pay,,,,true,68746.13,29323.18
New York City,Richmond,7004003,001740,Staten Island University Hosp-North,30 to 49,103,M,White,Not Span/Hispanic,2,Emergency,Home or Self Care,2019,CIR009,ACUTE MYOCARDIAL INFARCTION,CAR004,PERCUTANEOUS CORONARY INTERVENTIONS (PCI),174,PERCUTANEOUS CORONARY INTERVENTION W AMI,05,DISEASES AND DISORDERS OF THE CIRCULATORY SYSTEM,2,Moderate,Moderate,Surgical,Blue Cross/Blue Shield,,,,,true,88433.86,17358.31
New York City,Richmond,7004003,001740,Staten Island University Hosp-North,70 or Older,103,M,White,Not Span/Hispanic,4,Emergency,Home or Self Care,2019,CIR009,ACUTE MYOCARDIAL INFARCTION,CAR004,PERCUTANEOUS CORONARY INTERVENTIONS (PCI),174,PERCUTANEOUS CORONARY INTERVENTION W AMI,05,DISEASES AND DISORDERS OF THE CIRCULATORY SYSTEM,2,Moderate,Moderate,Surgical,Medicare,Medicare,,,,true,113794.41,22358.68
New York City,Bronx,7000001,001178,BronxCare Hospital Center,30 to 49,104,M,Other Race,Spanish/Hispanic,1,Emergency,Home or Self Care,2019,CIR009,ACUTE MYOCARDIAL INFARCTION,CAR004,PERCUTANEOUS CORONARY INTERVENTIONS (PCI),174,PERCUTANEOUS CORONARY INTERVENTION W AMI,05,DISEASES AND DISORDERS OF THE CIRCULATORY SYSTEM,1,Minor,Minor,Surgical,Medicaid,Medicaid,,,,true,20816.02,20625.89
Capital/Adirond,Albany,0101004,000005,St. Peter's Hospital,70 or Older,121,F,Other Race,Not Span/Hispanic,1,Emergency,Home or Self Care,2019,CIR009,ACUTE MYOCARDIAL INFARCTION,CAR004,PERCUTANEOUS CORONARY INTERVENTIONS (PCI),174,PERCUTANEOUS CORONARY INTERVENTION W AMI,05,DISEASES AND DISORDERS OF THE CIRCULATORY SYSTEM,1,Minor,Minor,Surgical,Medicare,Blue Cross/Blue Shield,,,,true,65681.05,11199.91
Hudson Valley,Westchester,5922000,001122,New York - Presbyterian Hospital,50 to 69,105,M,Other Race,Not Span/Hispanic,1,Elective,Home or Self Care,2019,CIR009,ACUTE MYOCARDIAL INFARCTION,CAR004,PERCUTANEOUS CORONARY INTERVENTIONS (PCI),174,PERCUTANEOUS CORONARY INTERVENTION W AMI,05,DISEASES AND DISORDERS OF THE CIRCULATORY SYSTEM,1,Minor,Minor,Surgical,Blue Cross/Blue Shield,,,,,false,39180.21,18999.51
Capital/Adirond,Albany,0101000,000001,Albany Medical Center Hospital,70 or Older,122,F,Black/African American,Not Span/Hispanic,7,Emergency,Home w/ Home Health Services,2019,CIR009,ACUTE MYOCARDIAL INFARCTION,CAR004,PERCUTANEOUS CORONARY INTERVENTIONS (PCI),174,PERCUTANEOUS CORONARY INTERVENTION W AMI,05,DISEASES AND DISORDERS OF THE CIRCULATORY SYSTEM,3,Major,Moderate,Surgical,Medicare,Blue Cross/Blue Shield,,,,true,96484.94,18758.21
New York City,Manhattan,7002001,001438,Bellevue Hospital Center,50 to 69,112,M,Other Race,Not Span/Hispanic,1,Emergency,Home or Self Care,2019,CIR009,ACUTE MYOCARDIAL INFARCTION,CAR004,PERCUTANEOUS CORONARY INTERVENTIONS (PCI),174,PERCUTANEOUS CORONARY INTERVENTION W AMI,05,DISEASES AND DISORDERS OF THE CIRCULATORY SYSTEM,1,Minor,Moderate,Surgical,Medicaid,Medicaid,,,,false,7870.04,5230.43
New York City,Queens,7003010,001637,New York - Presbyterian/Queens,50 to 69,113,M,White,Not Span/Hispanic,2,Emergency,Home or Self Care,2019,CIR009,ACUTE MYOCARDIAL INFARCTION,CAR004,PERCUTANEOUS CORONARY INTERVENTIONS (PCI),174,PERCUTANEOUS CORONARY INTERVENTION W AMI,05,DISEASES AND DISORDERS OF THE CIRCULATORY SYSTEM,2,Moderate,Minor,Surgical,"Managed Care, Unspecified",Medicaid,Self-Pay,,,true,66878.19,30782.69
Hudson Valley,Rockland,4329000,000779,Good Samaritan Hospital of Suffern,50 to 69,,M,Other Race,Unknown,1,Emergency,Left Against Medical Advice,2019,CIR009,ACUTE MYOCARDIAL INFARCTION,CAR004,PERCUTANEOUS CORONARY INTERVENTIONS (PCI),174,PERCUTANEOUS CORONARY INTERVENTION W AMI,05,DISEASES AND DISORDERS OF THE CIRCULATORY SYSTEM,2,Moderate,Moderate,Surgical,Private Health Insurance,,,,,true,126920.79,14416.97
Capital/Adirond,Albany,0101004,000005,St. Peter's Hospital,70 or Older,128,M,White,Not Span/Hispanic,5,Elective,Skilled Nursing Home,2019,CIR009,ACUTE MYOCARDIAL INFARCTION,CAR004,PERCUTANEOUS CORONARY INTERVENTIONS (PCI),174,PERCUTANEOUS CORONARY INTERVENTION W AMI,05,DISEASES AND DISORDERS OF THE CIRCULATORY SYSTEM,3,Major,Extreme,Surgical,Medicare,Medicare,Medicaid,,,false,97010.46,21696.73
Finger Lakes,Monroe,2701003,000411,Rochester General Hospital,50 to 69,146,M,White,Not Span/Hispanic,13,Emergency,Expired,2019,CIR009,ACUTE MYOCARDIAL INFARCTION,CAR004,PERCUTANEOUS CORONARY INTERVENTIONS (PCI),174,PERCUTANEOUS CORONARY INTERVENTION W AMI,05,DISEASES AND DISORDERS OF THE CIRCULATORY SYSTEM,4,Extreme,Extreme,Surgical,Medicaid,,,,,true,147316.55,62051.36
Finger Lakes,Monroe,2701003,000411,Rochester General Hospital,50 to 69,145,M,White,Not Span/Hispanic,4,Urgent,Home or Self Care,2019,CIR009,ACUTE MYOCARDIAL INFARCTION,CAR004,PERCUTANEOUS CORONARY INTERVENTIONS (PCI),174,PERCUTANEOUS CORONARY INTERVENTION W AMI,05,DISEASES AND DISORDERS OF THE CIRCULATORY SYSTEM,1,Minor,Minor,Surgical,Private Health Insurance,,,,,false,53131.14,18430.77
Finger Lakes,Monroe,2701003,000411,Rochester General Hospital,30 to 49,146,M,Other Race,Spanish/Hispanic,4,Emergency,Home w/ Home Health Services,2019,CIR009,ACUTE MYOCARDIAL INFARCTION,CAR004,PERCUTANEOUS CORONARY INTERVENTIONS (PCI),174,PERCUTANEOUS CORONARY INTERVENTION W AMI,05,DISEASES AND DISORDERS OF THE CIRCULATORY SYSTEM,2,Moderate,Minor,Surgical,Medicaid,,,,,true,67364.93,21950.95
Hudson Valley,Westchester,5922000,001122,New York - Presbyterian Hospital,50 to 69,,M,Other Race,Not Span/Hispanic,26,Emergency,Home or Self Care,2019,CIR009,ACUTE MYOCARDIAL INFARCTION,CAR004,PERCUTANEOUS CORONARY INTERVENTIONS (PCI),174,PERCUTANEOUS CORONARY INTERVENTION W AMI,05,DISEASES AND DISORDERS OF THE CIRCULATORY SYSTEM,2,Moderate,Moderate,Surgical,Self-Pay,,,,,true,307165.05,143164.02
Hudson Valley,Westchester,5902001,001045,White Plains Hospital Center,70 or Older,105,F,Other Race,Not Span/Hispanic,3,Emergency,Short-term Hospital,2019,CIR009,ACUTE MYOCARDIAL INFARCTION,CAR004,PERCUTANEOUS CORONARY INTERVENTIONS (PCI),174,PERCUTANEOUS CORONARY INTERVENTION W AMI,05,DISEASES AND DISORDERS OF THE CIRCULATORY SYSTEM,4,Extreme,Extreme,Surgical,Medicare,Medicaid,,,,true,140448,21654.95
Hudson Valley,Westchester,5902001,001045,White Plains Hospital Center,50 to 69,105,M,Other Race,Not Span/Hispanic,2,Emergency,Home or Self Care,2019,CIR009,ACUTE MYOCARDIAL INFARCTION,MAM005,MEASUREMENT DURING CARDIAC CATHETERIZATION,174,PERCUTANEOUS CORONARY INTERVENTION W AMI,05,DISEASES AND DISORDERS OF THE CIRCULATORY SYSTEM,1,Minor,Minor,Surgical,Private Health Insurance,,,,,true,128974.1,17467.86
New York City,Manhattan,7002001,001438,Bellevue Hospital Center,70 or Older,100,F,Other Race,Not Span/Hispanic,7,Emergency,Home or Self Care,2019,CIR009,ACUTE MYOCARDIAL INFARCTION,CAR004,PERCUTANEOUS CORONARY INTERVENTIONS (PCI),174,PERCUTANEOUS CORONARY INTERVENTION W AMI,05,DISEASES AND DISORDERS OF THE CIRCULATORY SYSTEM,2,Moderate,Moderate,Surgical,Medicaid,,,,,false,48985.63,32555.85
New York City,Queens,7003010,001637,New York - Presbyterian/Queens,70 or Older,113,M,White,Not Span/Hispanic,4,Emergency,Home w/ Home Health Services,2019,CIR009,ACUTE MYOCARDIAL INFARCTION,ESA009,CARDIAC ASSISTANCE WITH BALLOON PUMP,174,PERCUTANEOUS CORONARY INTERVENTION W AMI,05,DISEASES AND DISORDERS OF THE CIRCULATORY SYSTEM,4,Extreme,Extreme,Surgical,Blue Cross/Blue Shield,Medicare,Self-Pay,,,true,75941.19,31505.83
Finger Lakes,Monroe,2701003,000411,Rochester General Hospital,30 to 49,146,M,Black/African American,Not Span/Hispanic,4,Emergency,Home or Self Care,2019,CIR009,ACUTE MYOCARDIAL INFARCTION,CAR004,PERCUTANEOUS CORONARY INTERVENTIONS (PCI),174,PERCUTANEOUS CORONARY INTERVENTION W AMI,05,DISEASES AND DISORDERS OF THE CIRCULATORY SYSTEM,2,Moderate,Moderate,Surgical,Medicaid,,,,,true,64167.37,21261.4
Finger Lakes,Monroe,2701003,000411,Rochester General Hospital,50 to 69,146,M,White,Not Span/Hispanic,4,Emergency,Home or Self Care,2019,CIR009,ACUTE MYOCARDIAL INFARCTION,CAR004,PERCUTANEOUS CORONARY INTERVENTIONS (PCI),174,PERCUTANEOUS CORONARY INTERVENTION W AMI,05,DISEASES AND DISORDERS OF THE CIRCULATORY SYSTEM,2,Moderate,Minor,Surgical,Medicare,,,,,true,44605.04,15599.16
New York City,Kings,7001020,001305,Maimonides Medical Center,70 or Older,112,M,Other Race,Spanish/Hispanic,4,Emergency,Home w/ Home Health Services,2019,CIR009,ACUTE MYOCARDIAL INFARCTION,CAR004,PERCUTANEOUS CORONARY INTERVENTIONS (PCI),174,PERCUTANEOUS CORONARY INTERVENTION W AMI,05,DISEASES AND DISORDERS OF THE CIRCULATORY SYSTEM,2,Moderate,Moderate,Surgical,Medicare,Medicare,Medicaid,,,true,117228.05,25449.58
Long Island,Nassau,2951001,000541,North Shore University Hospital,50 to 69,117,M,White,Not Span/Hispanic,2,Emergency,Home or Self Care,2019,CIR009,ACUTE MYOCARDIAL INFARCTION,CAR004,PERCUTANEOUS CORONARY INTERVENTIONS (PCI),174,PERCUTANEOUS CORONARY INTERVENTION W AMI,05,DISEASES AND DISORDERS OF THE CIRCULATORY SYSTEM,2,Moderate,Moderate,Surgical,Private Health Insurance,,,,,true,120372.86,22083.6
Long Island,Suffolk,5154001,000925,Good Samaritan Hospital Medical Center,70 or Older,117,M,White,Not Span/Hispanic,6,Urgent,Skilled Nursing Home,2019,CIR009,ACUTE MYOCARDIAL INFARCTION,CAR004,PERCUTANEOUS CORONARY INTERVENTIONS (PCI),174,PERCUTANEOUS CORONARY INTERVENTION W AMI,05,DISEASES AND DISORDERS OF THE CIRCULATORY SYSTEM,3,Major,Major,Surgical,Medicare,Private Health Insurance,,,,false,143985,20222.51
New York City,Kings,7002053,001304,NYU Langone Hospital-Brooklyn,50 to 69,112,M,Other Race,Unknown,4,Emergency,Home or Self Care,2019,CIR009,ACUTE MYOCARDIAL INFARCTION,CAR004,PERCUTANEOUS CORONARY INTERVENTIONS (PCI),174,PERCUTANEOUS CORONARY INTERVENTION W AMI,05,DISEASES AND DISORDERS OF THE CIRCULATORY SYSTEM,1,Minor,Minor,Surgical,Medicaid,,,,,true,254943.14,45330.24
Capital/Adirond,Albany,0101000,000001,Albany Medical Center Hospital,50 to 69,120,M,White,Not Span/Hispanic,4,Urgent,Home or Self Care,2019,CIR009,ACUTE MYOCARDIAL INFARCTION,CAR004,PERCUTANEOUS CORONARY INTERVENTIONS (PCI),174,PERCUTANEOUS CORONARY INTERVENTION W AMI,05,DISEASES AND DISORDERS OF THE CIRCULATORY SYSTEM,1,Minor,Minor,Surgical,Medicare,,,,,false,78739.4,15832.56
New York City,Kings,7002053,001304,NYU Langone Hospital-Brooklyn,50 to 69,112,M,White,Not Span/Hispanic,1,Emergency,Home or Self Care,2019,CIR009,ACUTE MYOCARDIAL INFARCTION,CAR004,PERCUTANEOUS CORONARY INTERVENTIONS (PCI),174,PERCUTANEOUS CORONARY INTERVENTION W AMI,05,DISEASES AND DISORDERS OF THE CIRCULATORY SYSTEM,3,Major,Major,Surgical,Private Health Insurance,,,,,true,127883.25,20249.96
Southern Tier,Broome,0303001,000058,United Health Services Hospitals Inc. - Wilson Medical Center,70 or Older,137,M,White,Not Span/Hispanic,1,Emergency,Home or Self Care,2019,CIR009,ACUTE MYOCARDIAL INFARCTION,CAR004,PERCUTANEOUS CORONARY INTERVENTIONS (PCI),174,PERCUTANEOUS CORONARY INTERVENTION W AMI,05,DISEASES AND DISORDERS OF THE CIRCULATORY SYSTEM,2,Moderate,Moderate,Surgical,Medicare,Medicare,,,,true,39431.2,13848.61
Long Island,Suffolk,5154001,000925,Good Samaritan Hospital Medical Center,50 to 69,117,M,Other Race,Not Span/Hispanic,2,Emergency,Home w/ Home Health Services,2019,CIR009,ACUTE MYOCARDIAL INFARCTION,CAR004,PERCUTANEOUS CORONARY INTERVENTIONS (PCI),174,PERCUTANEOUS CORONARY INTERVENTION W AMI,05,DISEASES AND DISORDERS OF THE CIRCULATORY SYSTEM,3,Major,Moderate,Surgical,Medicaid,,,,,true,196161,21756.31
Hudson Valley,Dutchess,1302001,000181,Vassar Brothers Medical Center,50 to 69,125,M,Other Race,Not Span/Hispanic,2,Urgent,Court/Law Enforcement,2019,CIR009,ACUTE MYOCARDIAL INFARCTION,CAR004,PERCUTANEOUS CORONARY INTERVENTIONS (PCI),174,PERCUTANEOUS CORONARY INTERVENTION W AMI,05,DISEASES AND DISORDERS OF THE CIRCULATORY SYSTEM,1,Minor,Minor,Surgical,Department of Corrections,,,,,false,65622.08,14393.88
Hudson Valley,Dutchess,1302001,000181,Vassar Brothers Medical Center,70 or Older,124,M,White,Not Span/Hispanic,2,Urgent,Home or Self Care,2019,CIR009,ACUTE MYOCARDIAL INFARCTION,CAR004,PERCUTANEOUS CORONARY INTERVENTIONS (PCI),174,PERCUTANEOUS CORONARY INTERVENTION W AMI,05,DISEASES AND DISORDERS OF THE CIRCULATORY SYSTEM,1,Minor,Minor,Surgical,Medicare,Blue Cross/Blue Shield,,,,false,44973.94,9910.64
Hudson Valley,Dutchess,1302001,000181,Vassar Brothers Medical Center,50 to 69,124,F,White,Not Span/Hispanic,8,Urgent,Home or Self Care,2019,CIR009,ACUTE MYOCARDIAL INFARCTION,CAR004,PERCUTANEOUS CORONARY INTERVENTIONS (PCI),174,PERCUTANEOUS CORONARY INTERVENTION W AMI,05,DISEASES AND DISORDERS OF THE CIRCULATORY SYSTEM,4,Extreme,Extreme,Surgical,Medicare,Medicaid,,,,false,116891.1,33167.38
New York City,Kings,7002053,001304,NYU Langone Hospital-Brooklyn,50 to 69,112,M,Other Race,Not Span/Hispanic,3,Emergency,Home or Self Care,2019,CIR009,ACUTE MYOCARDIAL INFARCTION,CAR004,PERCUTANEOUS CORONARY INTERVENTIONS (PCI),174,PERCUTANEOUS CORONARY INTERVENTION W AMI,05,DISEASES AND DISORDERS OF THE CIRCULATORY SYSTEM,2,Moderate,Moderate,Surgical,Medicaid,,,,,true,142569.38,33067.54
Hudson Valley,Dutchess,1302001,000181,Vassar Brothers Medical Center,50 to 69,125,M,White,Not Span/Hispanic,2,Urgent,Home or Self Care,2019,CIR009,ACUTE MYOCARDIAL INFARCTION,MAM005,MEASUREMENT DURING CARDIAC CATHETERIZATION,174,PERCUTANEOUS CORONARY INTERVENTION W AMI,05,DISEASES AND DISORDERS OF THE CIRCULATORY SYSTEM,1,Minor,Minor,Surgical,Private Health Insurance,,,,,false,40228.13,8742.76
Hudson Valley,Dutchess,1302001,000181,Vassar Brothers Medical Center,30 to 49,125,F,White,Unknown,2,Emergency,Home or Self Care,2019,CIR009,ACUTE MYOCARDIAL INFARCTION,CAR004,PERCUTANEOUS CORONARY INTERVENTIONS (PCI),174,PERCUTANEOUS CORONARY INTERVENTION W AMI,05,DISEASES AND DISORDERS OF THE CIRCULATORY SYSTEM,2,Moderate,Minor,Surgical,Blue Cross/Blue Shield,,,,,true,40739.94,8604.08