Hospital Service Area,Hospital County,Operating Certificate Number,Permanent Facility Id,Facility Name,Age Group,Zip Code - 3 digits,Gender,Race,Ethnicity,Length of Stay,Type of Admission,Patient Disposition,Discharge Year,CCS Diagnosis Code,CCS Diagnosis Description,CCS Procedure Code,CCS Procedure Description,APR DRG Code,APR DRG Description,APR MDC Code,APR MDC Description,APR Severity of Illness Code,APR Severity of Illness Description,APR Risk of Mortality,APR Medical Surgical Description,Payment Typology 1,Payment Typology 2,Payment Typology 3,Birth Weight,Abortion Edit Indicator,Emergency Department Indicator,Total Charges,Total Costs
New York City,Manhattan,7002053,001463,NYU Langone Hospitals,50 to 69,113,M,White,Not Span/Hispanic,2,Emergency,Home or Self Care,2020,CIR009,ACUTE MYOCARDIAL INFARCTION,CAR004,PERCUTANEOUS CORONARY INTERVENTIONS (PCI),174,PERCUTANEOUS CARDIAC INTERVENTION W AMI,05,DISEASES AND DISORDERS OF THE CIRCULATORY SYSTEM,1,Minor,Minor,Surgical,Private Health Insurance,,,,,N,118348.14,19911.04
New York City,Manhattan,7002053,001463,NYU Langone Hospitals,50 to 69,100,M,White,Not Span/Hispanic,6,Emergency,Home or Self Care,2020,CIR009,ACUTE MYOCARDIAL INFARCTION,CAR004,PERCUTANEOUS CORONARY INTERVENTIONS (PCI),174,PERCUTANEOUS CARDIAC INTERVENTION W AMI,05,DISEASES AND DISORDERS OF THE CIRCULATORY SYSTEM,2,Moderate,Major,Surgical,Private Health Insurance,,,,,Y,195327.8,39691.69
New York City,Manhattan,7002053,001463,NYU Langone Hospitals,70 or Older,100,M,White,Not Span/Hispanic,3,Emergency,Home or Self Care,2020,CIR009,ACUTE MYOCARDIAL INFARCTION,IMG001,CARDIAC AND CORONARY FLUOROSCOPY,174,PERCUTANEOUS CARDIAC INTERVENTION W AMI,05,DISEASES AND DISORDERS OF THE CIRCULATORY SYSTEM,2,Moderate,Moderate,Surgical,Medicare,Blue Cross/Blue Shield,,,,Y,197824.47,33632.99
New York City,Manhattan,7002053,001463,NYU Langone Hospitals,70 or Older,100,M,White,Not Span/Hispanic,1,Emergency,Home or Self Care,2020,CIR009,ACUTE MYOCARDIAL INFARCTION,IMG001,CARDIAC AND CORONARY FLUOROSCOPY,174,PERCUTANEOUS CARDIAC INTERVENTION W AMI,05,DISEASES AND DISORDERS OF THE CIRCULATORY SYSTEM,1,Minor,Minor,Surgical,Medicare,Medicare,,,,Y,219892.95,33864.22
New York City,Manhattan,7002053,001463,NYU Langone Hospitals,70 or Older,100,M,White,Not Span/Hispanic,2,Emergency,Home or Self Care,2020,CIR009,ACUTE MYOCARDIAL INFARCTION,CAR004,PERCUTANEOUS CORONARY INTERVENTIONS (PCI),174,PERCUTANEOUS CARDIAC INTERVENTION W AMI,05,DISEASES AND DISORDERS OF THE CIRCULATORY SYSTEM,2,Moderate,Major,Surgical,Private Health Insurance,,,,,Y,121982.37,23946.18
New York City,Manhattan,7002053,001463,NYU Langone Hospitals,50 to 69,113,F,White,Not Span/Hispanic,2,Emergency,Home or Self Care,2020,CIR009,ACUTE MYOCARDIAL INFARCTION,CAR004,PERCUTANEOUS CORONARY INTERVENTIONS (PCI),174,PERCUTANEOUS CARDIAC INTERVENTION W AMI,05,DISEASES AND DISORDERS OF THE CIRCULATORY SYSTEM,1,Minor,Minor,Surgical,Private Health Insurance,,,,,Y,129791.52,27293.71
New York City,Manhattan,7002053,001463,NYU Langone Hospitals,50 to 69,112,M,Black/African American,Not Span/Hispanic,3,Emergency,Home or Self Care,2020,CIR009,ACUTE MYOCARDIAL INFARCTION,CAR004,PERCUTANEOUS CORONARY INTERVENTIONS (PCI),174,PERCUTANEOUS CARDIAC INTERVENTION W AMI,05,DISEASES AND DISORDERS OF THE CIRCULATORY SYSTEM,1,Minor,Minor,Surgical,Private Health Insurance,,,,,Y,121851.18,22867.08
New York City,Manhattan,7002053,001463,NYU Langone Hospitals,30 to 49,104,M,Black/African American,Not Span/Hispanic,3,Emergency,Home or Self Care,2020,CIR009,ACUTE MYOCARDIAL INFARCTION,CAR004,PERCUTANEOUS CORONARY INTERVENTIONS (PCI),174,PERCUTANEOUS CARDIAC INTERVENTION W AMI,05,DISEASES AND DISORDERS OF THE CIRCULATORY SYSTEM,2,Moderate,Moderate,Surgical,Private Health Insurance,,,,,Y,155752.26,28893.11
New York City,Manhattan,7002053,001463,NYU Langone Hospitals,70 or Older,103,F,White,Not Span/Hispanic,7,Emergency,Inpatient Rehabilitation Facility,2020,CIR009,ACUTE MYOCARDIAL INFARCTION,MAM005,MEASUREMENT DURING CARDIAC CATHETERIZATION,174,PERCUTANEOUS CARDIAC INTERVENTION W AMI,05,DISEASES AND DISORDERS OF THE CIRCULATORY SYSTEM,4,Extreme,Extreme,Surgical,Medicare,Medicare,,,,Y,386774.16,75038.12
New York City,Manhattan,7002053,001463,NYU Langone Hospitals,70 or Older,100,M,White,Not Span/Hispanic,4,Emergency,Home w/ Home Health Services,2020,CIR009,ACUTE MYOCARDIAL INFARCTION,CAR004,PERCUTANEOUS CORONARY INTERVENTIONS (PCI),174,PERCUTANEOUS CARDIAC INTERVENTION W AMI,05,DISEASES AND DISORDERS OF THE CIRCULATORY SYSTEM,1,Minor,Moderate,Surgical,Medicare,Private Health Insurance,,,,Y,135533.2,27418.95
New York City,Manhattan,7002053,001463,NYU Langone Hospitals,70 or Older,103,M,White,Not Span/Hispanic,2,Emergency,Home or Self Care,2020,CIR009,ACUTE MYOCARDIAL INFARCTION,MAM005,MEASUREMENT DURING CARDIAC CATHETERIZATION,174,PERCUTANEOUS CARDIAC INTERVENTION W AMI,05,DISEASES AND DISORDERS OF THE CIRCULATORY SYSTEM,1,Minor,Minor,Surgical,Medicaid,,,,,Y,176098.63,31053.33
New York City,Manhattan,7002053,001463,NYU Langone Hospitals,70 or Older,109,F,Other Race,Not Span/Hispanic,2,Elective,Home or Self Care,2020,CIR009,ACUTE MYOCARDIAL INFARCTION,CAR004,PERCUTANEOUS CORONARY INTERVENTIONS (PCI),174,PERCUTANEOUS CARDIAC INTERVENTION W AMI,05,DISEASES AND DISORDERS OF THE CIRCULATORY SYSTEM,4,Extreme,Major,Surgical,Medicare,Blue Cross/Blue Shield,,,,N,160318.39,25869.55
New York City,Manhattan,7002053,001463,NYU Langone Hospitals,70 or Older,105,M,White,Not Span/Hispanic,1,Emergency,Home or Self Care,2020,CIR009,ACUTE MYOCARDIAL INFARCTION,MAM005,MEASUREMENT DURING CARDIAC CATHETERIZATION,174,PERCUTANEOUS CARDIAC INTERVENTION W AMI,05,DISEASES AND DISORDERS OF THE CIRCULATORY SYSTEM,2,Moderate,Moderate,Surgical,Private Health Insurance,,,,,Y,145958.69,21607.63
New York City,Manhattan,7002053,001463,NYU Langone Hospitals,70 or Older,100,M,Other Race,Unknown,2,Emergency,Home or Self Care,2020,CIR009,ACUTE MYOCARDIAL INFARCTION,CAR004,PERCUTANEOUS CORONARY INTERVENTIONS (PCI),174,PERCUTANEOUS CARDIAC INTERVENTION W AMI,05,DISEASES AND DISORDERS OF THE CIRCULATORY SYSTEM,2,Moderate,Moderate,Surgical,Medicare,Private Health Insurance,,,,Y,103516.66,18357.9
New York City,Manhattan,7002053,001463,NYU Langone Hospitals,70 or Older,100,M,White,Not Span/Hispanic,8,Emergency,Hospice - Medical Facility,2020,CIR009,ACUTE MYOCARDIAL INFARCTION,CAR004,PERCUTANEOUS CORONARY INTERVENTIONS (PCI),174,PERCUTANEOUS CARDIAC INTERVENTION W AMI,05,DISEASES AND DISORDERS OF THE CIRCULATORY SYSTEM,4,Extreme,Extreme,Surgical,Medicare,Medicare,,,,Y,325501.47,75089.01
New York City,Manhattan,7002053,001463,NYU Langone Hospitals,30 to 49,112,M,White,Not Span/Hispanic,3,Emergency,Home or Self Care,2020,CIR009,ACUTE MYOCARDIAL INFARCTION,CAR004,PERCUTANEOUS CORONARY INTERVENTIONS (PCI),174,PERCUTANEOUS CARDIAC INTERVENTION W AMI,05,DISEASES AND DISORDERS OF THE CIRCULATORY SYSTEM,3,Major,Major,Surgical,Private Health Insurance,,,,,Y,152074.63,28551.17
New York City,Manhattan,7002053,001463,NYU Langone Hospitals,30 to 49,112,M,White,Not Span/Hispanic,3,Emergency,Home or Self Care,2020,CIR009,ACUTE MYOCARDIAL INFARCTION,CAR004,PERCUTANEOUS CORONARY INTERVENTIONS (PCI),174,PERCUTANEOUS CARDIAC INTERVENTION W AMI,05,DISEASES AND DISORDERS OF THE CIRCULATORY SYSTEM,2,Moderate,Moderate,Surgical,Private Health Insurance,,,,,Y,164730.55,31738.45
New York City,Manhattan,7002053,001463,NYU Langone Hospitals,50 to 69,100,M,White,Not Span/Hispanic,2,Emergency,Home or Self Care,2020,CIR009,ACUTE MYOCARDIAL INFARCTION,MAM005,MEASUREMENT DURING CARDIAC CATHETERIZATION,174,PERCUTANEOUS CARDIAC INTERVENTION W AMI,05,DISEASES AND DISORDERS OF THE CIRCULATORY SYSTEM,1,Minor,Minor,Surgical,Blue Cross/Blue Shield,,,,,Y,105931.67,18607.77
New York City,Manhattan,7002053,001463,NYU Langone Hospitals,70 or Older,100,M,White,Not Span/Hispanic,2,Emergency,Home w/ Home Health Services,2020,CIR009,ACUTE MYOCARDIAL INFARCTION,MAM005,MEASUREMENT DURING CARDIAC CATHETERIZATION,174,PERCUTANEOUS CARDIAC INTERVENTION W AMI,05,DISEASES AND DISORDERS OF THE CIRCULATORY SYSTEM,2,Moderate,Minor,Surgical,Medicare,Medicaid,,,,Y,140093.39,23413.5
New York City,Manhattan,7002053,001463,NYU Langone Hospitals,50 to 69,100,M,Other Race,Not Span/Hispanic,2,Emergency,Home or Self Care,2020,CIR009,ACUTE MYOCARDIAL INFARCTION,CAR004,PERCUTANEOUS CORONARY INTERVENTIONS (PCI),174,PERCUTANEOUS CARDIAC INTERVENTION W AMI,05,DISEASES AND DISORDERS OF THE CIRCULATORY SYSTEM,2,Moderate,Minor,Surgical,Medicare,Private Health Insurance,,,,Y,306195.55,46245.66
New York City,Manhattan,7002053,001463,NYU Langone Hospitals,50 to 69,112,M,White,Not Span/Hispanic,3,Emergency,Home or Self Care,2020,CIR009,ACUTE MYOCARDIAL INFARCTION,CAR004,PERCUTANEOUS CORONARY INTERVENTIONS (PCI),174,PERCUTANEOUS CARDIAC INTERVENTION W AMI,05,DISEASES AND DISORDERS OF THE CIRCULATORY SYSTEM,2,Moderate,Moderate,Surgical,Blue Cross/Blue Shield,Medicare,,,,Y,125281.66,23338.66
New York City,Manhattan,7002053,001463,NYU Langone Hospitals,50 to 69,100,M,White,Not Span/Hispanic,2,Emergency,Home or Self Care,2020,CIR009,ACUTE MYOCARDIAL INFARCTION,CAR004,PERCUTANEOUS CORONARY INTERVENTIONS (PCI),174,PERCUTANEOUS CARDIAC INTERVENTION W AMI,05,DISEASES AND DISORDERS OF THE CIRCULATORY SYSTEM,1,Minor,Minor,Surgical,Private Health Insurance,,,,,Y,176211.96,28622.02
New York City,Manhattan,7002053,001463,NYU Langone Hospitals,50 to 69,100,M,White,Spanish/Hispanic,3,Emergency,Home or Self Care,2020,CIR009,ACUTE MYOCARDIAL INFARCTION,CAR004,PERCUTANEOUS CORONARY INTERVENTIONS (PCI),174,PERCUTANEOUS CARDIAC INTERVENTION W AMI,05,DISEASES AND DISORDERS OF THE CIRCULATORY SYSTEM,2,Moderate,Major,Surgical,Medicaid,,,,,Y,201806.91,36242.69
New York City,Manhattan,7002053,001463,NYU Langone Hospitals,50 to 69,112,M,Other Race,Unknown,6,Emergency,Home or Self Care,2020,CIR009,ACUTE MYOCARDIAL INFARCTION,MAM005,MEASUREMENT DURING CARDIAC CATHETERIZATION,174,PERCUTANEOUS CARDIAC INTERVENTION W AMI,05,DISEASES AND DISORDERS OF THE CIRCULATORY SYSTEM,4,Extreme,Extreme,Surgical,Private Health Insurance,,,,,Y,285140.79,54893.47
New York City,Manhattan,7002053,001463,NYU Langone Hospitals,50 to 69,100,F,White,Not Span/Hispanic,4,Emergency,Home or Self Care,2020,CIR009,ACUTE MYOCARDIAL INFARCTION,MAM005,MEASUREMENT DURING CARDIAC CATHETERIZATION,174,PERCUTANEOUS CARDIAC INTERVENTION W AMI,05,DISEASES AND DISORDERS OF THE CIRCULATORY SYSTEM,1,Minor,Minor,Surgical,Private Health Insurance,,,,,Y,162940.85,33218.38
New York City,Manhattan,7002053,001463,NYU Langone Hospitals,70 or Older,100,M,White,Not Span/Hispanic,3,Emergency,Home or Self Care,2020,CIR009,ACUTE MYOCARDIAL INFARCTION,CAR004,PERCUTANEOUS CORONARY INTERVENTIONS (PCI),174,PERCUTANEOUS CARDIAC INTERVENTION W AMI,05,DISEASES AND DISORDERS OF THE CIRCULATORY SYSTEM,2,Moderate,Minor,Surgical,Medicare,Medicare,,,,Y,162436.79,28662.68
New York City,Manhattan,7002053,001463,NYU Langone Hospitals,50 to 69,112,F,White,Not Span/Hispanic,2,Emergency,Home or Self Care,2020,CIR009,ACUTE MYOCARDIAL INFARCTION,MAM005,MEASUREMENT DURING CARDIAC CATHETERIZATION,174,PERCUTANEOUS CARDIAC INTERVENTION W AMI,05,DISEASES AND DISORDERS OF THE CIRCULATORY SYSTEM,1,Minor,Minor,Surgical,Private Health Insurance,Medicare,,,,Y,116046.91,20306.65
New York City,Manhattan,7002053,001463,NYU Langone Hospitals,50 to 69,100,M,White,Not Span/Hispanic,2,Emergency,Home or Self Care,2020,CIR009,ACUTE MYOCARDIAL INFARCTION,MAM005,MEASUREMENT DURING CARDIAC CATHETERIZATION,174,PERCUTANEOUS CARDIAC INTERVENTION W AMI,05,DISEASES AND DISORDERS OF THE CIRCULATORY SYSTEM,1,Minor,Minor,Surgical,Private Health Insurance,,,,,Y,151176.75,25175.27
New York City,Manhattan,7002053,001463,NYU Langone Hospitals,50 to 69,OOS,F,Black/African American,Not Span/Hispanic,3,Emergency,Home or Self Care,2020,CIR009,ACUTE MYOCARDIAL INFARCTION,CAR004,PERCUTANEOUS CORONARY INTERVENTIONS (PCI),174,PERCUTANEOUS CARDIAC INTERVENTION W AMI,05,DISEASES AND DISORDERS OF THE CIRCULATORY SYSTEM,2,Moderate,Moderate,Surgical,Blue Cross/Blue Shield,,,,,Y,191746.53,32280.34
New York City,Manhattan,7002053,001463,NYU Langone Hospitals,70 or Older,105,M,White,Not Span/Hispanic,2,Emergency,Home or Self Care,2020,CIR009,ACUTE MYOCARDIAL INFARCTION,CAR004,PERCUTANEOUS CORONARY INTERVENTIONS (PCI),174,PERCUTANEOUS CARDIAC INTERVENTION W AMI,05,DISEASES AND DISORDERS OF THE CIRCULATORY SYSTEM,1,Minor,Minor,Surgical,Medicare,Private Health Insurance,,,,Y,140751.18,23430.25
New York City,Manhattan,7002053,001463,NYU Langone Hospitals,30 to 49,104,M,Black/African American,Not Span/Hispanic,1,Emergency,Home or Self Care,2020,CIR009,ACUTE MYOCARDIAL INFARCTION,CAR004,PERCUTANEOUS CORONARY INTERVENTIONS (PCI),174,PERCUTANEOUS CARDIAC INTERVENTION W AMI,05,DISEASES AND DISORDERS OF THE CIRCULATORY SYSTEM,2,Moderate,Minor,Surgical,Private Health Insurance,Private Health Insurance,,,,Y,133083.52,20668.75
New York City,Manhattan,7002053,001463,NYU Langone Hospitals,50 to 69,104,M,Black/African American,Not Span/Hispanic,2,Emergency,Home or Self Care,2020,CIR009,ACUTE MYOCARDIAL INFARCTION,CAR004,PERCUTANEOUS CORONARY INTERVENTIONS (PCI),174,PERCUTANEOUS CARDIAC INTERVENTION W AMI,05,DISEASES AND DISORDERS OF THE CIRCULATORY SYSTEM,3,Major,Moderate,Surgical,Medicaid,,,,,Y,286001.77,42971.2
New York City,Manhattan,7002053,001463,NYU Langone Hospitals,70 or Older,100,M,Other Race,Spanish/Hispanic,1,Emergency,Home or Self Care,2020,CIR009,ACUTE MYOCARDIAL INFARCTION,CAR004,PERCUTANEOUS CORONARY INTERVENTIONS (PCI),174,PERCUTANEOUS CARDIAC INTERVENTION W AMI,05,DISEASES AND DISORDERS OF THE CIRCULATORY SYSTEM,2,Moderate,Moderate,Surgical,Medicare,Medicaid,,,,Y,178271.87,29493.94
New York City,Manhattan,7002053,001463,NYU Langone Hospitals,70 or Older,111,M,White,Not Span/Hispanic,4,Emergency,Home or Self Care,2020,CIR009,ACUTE MYOCARDIAL INFARCTION,CAR004,PERCUTANEOUS CORONARY INTERVENTIONS (PCI),174,PERCUTANEOUS CARDIAC INTERVENTION W AMI,05,DISEASES AND DISORDERS OF THE CIRCULATORY SYSTEM,2,Moderate,Moderate,Surgical,Medicaid,,,,,N,241518.49,39942.3
New York City,Manhattan,7002053,001463,NYU Langone Hospitals,50 to 69,OOS,M,Other Race,Not Span/Hispanic,3,Emergency,Home or Self Care,2020,CIR009,ACUTE MYOCARDIAL INFARCTION,CAR004,PERCUTANEOUS CORONARY INTERVENTIONS (PCI),174,PERCUTANEOUS CARDIAC INTERVENTION W AMI,05,DISEASES AND DISORDERS OF THE CIRCULATORY SYSTEM,2,Moderate,Major,Surgical,Medicare,,,,,Y,230142.43,39514.71
New York City,Manhattan,7002053,001463,NYU Langone Hospitals,50 to 69,115,M,White,Not Span/Hispanic,5,Emergency,Home w/ Home Health Services,2020,CIR009,ACUTE MYOCARDIAL INFARCTION,CAR004,PERCUTANEOUS CORONARY INTERVENTIONS (PCI),174,PERCUTANEOUS CARDIAC INTERVENTION W AMI,05,DISEASES AND DISORDERS OF THE CIRCULATORY SYSTEM,2,Moderate,Moderate,Surgical,Medicare,,,,,Y,259875.99,44813.15
New York City,Manhattan,7002053,001463,NYU Langone Hospitals,30 to 49,100,M,Other Race,Not Span/Hispanic,2,Emergency,Home or Self Care,2020,CIR009,ACUTE MYOCARDIAL INFARCTION,CAR004,PERCUTANEOUS CORONARY INTERVENTIONS (PCI),174,PERCUTANEOUS CARDIAC INTERVENTION W AMI,05,DISEASES AND DISORDERS OF THE CIRCULATORY SYSTEM,1,Minor,Minor,Surgical,Blue Cross/Blue Shield,,,,,Y,149071.55,24392.28
New York City,Manhattan,7002053,001463,NYU Langone Hospitals,70 or Older,,F,Other Race,Not Span/Hispanic,3,Emergency,Home or Self Care,2020,CIR009,ACUTE MYOCARDIAL INFARCTION,CAR004,PERCUTANEOUS CORONARY INTERVENTIONS (PCI),174,PERCUTANEOUS CARDIAC INTERVENTION W AMI,05,DISEASES AND DISORDERS OF THE CIRCULATORY SYSTEM,3,Major,Major,Surgical,Medicare,Medicare,,,,Y,272510.13,45548.31
New York City,Manhattan,7002053,001463,NYU Langone Hospitals,50 to 69,112,M,Other Race,Not Span/Hispanic,2,Emergency,Home or Self Care,2020,CIR009,ACUTE MYOCARDIAL INFARCTION,CAR004,PERCUTANEOUS CORONARY INTERVENTIONS (PCI),174,PERCUTANEOUS CARDIAC INTERVENTION W AMI,05,DISEASES AND DISORDERS OF THE CIRCULATORY SYSTEM,3,Major,Minor,Surgical,Medicare,Medicaid,,,,Y,257401.85,39352.99
New York City,Manhattan,7002053,001463,NYU Langone Hospitals,30 to 49,112,M,Black/African American,Not Span/Hispanic,3,Emergency,Home or Self Care,2020,CIR009,ACUTE MYOCARDIAL INFARCTION,CAR004,PERCUTANEOUS CORONARY INTERVENTIONS (PCI),174,PERCUTANEOUS CARDIAC INTERVENTION W AMI,05,DISEASES AND DISORDERS OF THE CIRCULATORY SYSTEM,3,Major,Major,Surgical,Blue Cross/Blue Shield,,,,,Y,209443.26,38463.34
New York City,Manhattan,7002053,001463,NYU Langone Hospitals,50 to 69,OOS,M,Other Race,Not Span/Hispanic,3,Emergency,Home or Self Care,2020,CIR009,ACUTE MYOCARDIAL INFARCTION,MAM005,MEASUREMENT DURING CARDIAC CATHETERIZATION,174,PERCUTANEOUS CARDIAC INTERVENTION W AMI,05,DISEASES AND DISORDERS OF THE CIRCULATORY SYSTEM,2,Moderate,Minor,Surgical,Private Health Insurance,,,,,Y,117348.03,22201.15
New York City,Manhattan,7002053,001463,NYU Langone Hospitals,30 to 49,100,M,Other Race,Not Span/Hispanic,3,Emergency,Home or Self Care,2020,CIR009,ACUTE MYOCARDIAL INFARCTION,CAR004,PERCUTANEOUS CORONARY INTERVENTIONS (PCI),174,PERCUTANEOUS CARDIAC INTERVENTION W AMI,05,DISEASES AND DISORDERS OF THE CIRCULATORY SYSTEM,2,Moderate,Major,Surgical,Private Health Insurance,,,,,Y,180876.02,36538.35
New York City,Manhattan,7002053,001463,NYU Langone Hospitals,50 to 69,100,M,White,Not Span/Hispanic,3,Emergency,Home or Self Care,2020,CIR009,ACUTE MYOCARDIAL INFARCTION,CAR004,PERCUTANEOUS CORONARY INTERVENTIONS (PCI),174,PERCUTANEOUS CARDIAC INTERVENTION W AMI,05,DISEASES AND DISORDERS OF THE CIRCULATORY SYSTEM,1,Minor,Minor,Surgical,Private Health Insurance,,,,,Y,125544.52,23773.73
New York City,Manhattan,7002053,001463,NYU Langone Hospitals,50 to 69,111,F,White,Not Span/Hispanic,2,Emergency,Home or Self Care,2020,CIR009,ACUTE MYOCARDIAL INFARCTION,CAR004,PERCUTANEOUS CORONARY INTERVENTIONS (PCI),174,PERCUTANEOUS CARDIAC INTERVENTION W AMI,05,DISEASES AND DISORDERS OF THE CIRCULATORY SYSTEM,1,Minor,Moderate,Surgical,Private Health Insurance,,,,,Y,240864,36525.98
New York City,Manhattan,7002053,001463,NYU Langone Hospitals,50 to 69,112,M,White,Not Span/Hispanic,24,Emergency,Inpatient Rehabilitation Facility,2020,CIR009,ACUTE MYOCARDIAL INFARCTION,MAM005,MEASUREMENT DURING CARDIAC CATHETERIZATION,174,PERCUTANEOUS CARDIAC INTERVENTION W AMI,05,DISEASES AND DISORDERS OF THE CIRCULATORY SYSTEM,4,Extreme,Extreme,Surgical,Medicare,Medicaid,,,,Y,1141524.1,237443.91
New York City,Manhattan,7002053,001463,NYU Langone Hospitals,50 to 69,100,M,White,Not Span/Hispanic,3,Emergency,Home or Self Care,2020,CIR009,ACUTE MYOCARDIAL INFARCTION,MAM005,MEASUREMENT DURING CARDIAC CATHETERIZATION,174,PERCUTANEOUS CARDIAC INTERVENTION W AMI,05,DISEASES AND DISORDERS OF THE CIRCULATORY SYSTEM,4,Extreme,Extreme,Surgical,Private Health Insurance,,,,,Y,153302.67,29754.18
New York City,Manhattan,7002053,001463,NYU Langone Hospitals,30 to 49,100,M,Other Race,Not Span/Hispanic,3,Emergency,Home or Self Care,2020,CIR009,ACUTE MYOCARDIAL INFARCTION,CAR004,PERCUTANEOUS CORONARY INTERVENTIONS (PCI),174,PERCUTANEOUS CARDIAC INTERVENTION W AMI,05,DISEASES AND DISORDERS OF THE CIRCULATORY SYSTEM,3,Major,Moderate,Surgical,Blue Cross/Blue Shield,,,,,Y,147068.89,25567.05
New York City,Manhattan,7002053,001463,NYU Langone Hospitals,50 to 69,105,M,Other Race,Not Span/Hispanic,2,Emergency,Home or Self Care,2020,CIR009,ACUTE MYOCARDIAL INFARCTION,CAR004,PERCUTANEOUS CORONARY INTERVENTIONS (PCI),174,PERCUTANEOUS CARDIAC INTERVENTION W AMI,05,DISEASES AND DISORDERS OF THE CIRCULATORY SYSTEM,1,Minor,Moderate,Surgical,Blue Cross/Blue Shield,,,,,Y,135477.2,22807.51
New York City,Manhattan,7002053,001463,NYU Langone Hospitals,50 to 69,112,M,White,Not Span/Hispanic,4,Emergency,Home w/ Home Health Services,2020,CIR009,ACUTE MYOCARDIAL INFARCTION,CAR004,PERCUTANEOUS CORONARY INTERVENTIONS (PCI),174,PERCUTANEOUS CARDIAC INTERVENTION W AMI,05,DISEASES AND DISORDERS OF THE CIRCULATORY SYSTEM,4,Extreme,Extreme,Surgical,Medicare,Medicaid,,,,Y,189662.94,32028.38
New York City,Manhattan,7002053,001463,NYU Langone Hospitals,50 to 69,112,M,White,Not Span/Hispanic,4,Emergency,Home w/ Home Health Services,2020,CIR009,ACUTE MYOCARDIAL INFARCTION,CAR004,PERCUTANEOUS CORONARY INTERVENTIONS (PCI),174,PERCUTANEOUS CARDIAC INTERVENTION W AMI,05,DISEASES AND DISORDERS OF THE CIRCULATORY SYSTEM,3,Major,Major,Surgical,Medicare,Medicaid,,,,Y,147206.64,30726.33
New York City,Manhattan,7002053,001463,NYU Langone Hospitals,50 to 69,OOS,M,White,Not Span/Hispanic,2,Emergency,Home or Self Care,2020,CIR009,ACUTE MYOCARDIAL INFARCTION,CAR004,PERCUTANEOUS CORONARY INTERVENTIONS (PCI),174,PERCUTANEOUS CARDIAC INTERVENTION W AMI,05,DISEASES AND DISORDERS OF THE CIRCULATORY SYSTEM,1,Minor,Minor,Surgical,Blue Cross/Blue Shield,,,,,Y,175158.2,33193.02
New York City,Manhattan,7002053,001463,NYU Langone Hospitals,70 or Older,100,F,Other Race,Not Span/Hispanic,11,Emergency,Skilled Nursing Home,2020,CIR009,ACUTE MYOCARDIAL INFARCTION,CAR004,PERCUTANEOUS CORONARY INTERVENTIONS (PCI),174,PERCUTANEOUS CARDIAC INTERVENTION W AMI,05,DISEASES AND DISORDERS OF THE CIRCULATORY SYSTEM,4,Extreme,Extreme,Surgical,Medicare,,,,,Y,255604.21,57100.66
New York City,Manhattan,7002053,001463,NYU Langone Hospitals,70 or Older,113,M,Other Race,Not Span/Hispanic,13,Emergency,Home or Self Care,2020,CIR009,ACUTE MYOCARDIAL INFARCTION,IMG001,CARDIAC AND CORONARY FLUOROSCOPY,174,PERCUTANEOUS CARDIAC INTERVENTION W AMI,05,DISEASES AND DISORDERS OF THE CIRCULATORY SYSTEM,4,Extreme,Extreme,Surgical,Medicare,,,,,Y,406204.02,89543.59
New York City,Manhattan,7002053,001463,NYU Langone Hospitals,70 or Older,100,F,White,Not Span/Hispanic,2,Emergency,Home or Self Care,2020,CIR009,ACUTE MYOCARDIAL INFARCTION,MAM005,MEASUREMENT DURING CARDIAC CATHETERIZATION,174,PERCUTANEOUS CARDIAC INTERVENTION W AMI,05,DISEASES AND DISORDERS OF THE CIRCULATORY SYSTEM,1,Minor,Minor,Surgical,Medicare,Medicare,,,,Y,200292.02,33819.31
New York City,Manhattan,7002053,001463,NYU Langone Hospitals,50 to 69,113,M,White,Not Span/Hispanic,4,Emergency,Home or Self Care,2020,CIR009,ACUTE MYOCARDIAL INFARCTION,MAM005,MEASUREMENT DURING CARDIAC CATHETERIZATION,174,PERCUTANEOUS CARDIAC INTERVENTION W AMI,05,DISEASES AND DISORDERS OF THE CIRCULATORY SYSTEM,1,Minor,Moderate,Surgical,Blue Cross/Blue Shield,,,,,Y,198667.76,46922.72
New York City,Manhattan,7002053,001463,NYU Langone Hospitals,50 to 69,100,M,White,Not Span/Hispanic,4,Emergency,Home or Self Care,2020,CIR009,ACUTE MYOCARDIAL INFARCTION,CAR004,PERCUTANEOUS CORONARY INTERVENTIONS (PCI),174,PERCUTANEOUS CARDIAC INTERVENTION W AMI,05,DISEASES AND DISORDERS OF THE CIRCULATORY SYSTEM,2,Moderate,Moderate,Surgical,Blue Cross/Blue Shield,,,,,Y,301397.71,48856.52
New York City,Manhattan,7002053,001463,NYU Langone Hospitals,50 to 69,100,M,Black/African American,Not Span/Hispanic,2,Emergency,Home or Self Care,2020,CIR009,ACUTE MYOCARDIAL INFARCTION,CAR004,PERCUTANEOUS CORONARY INTERVENTIONS (PCI),174,PERCUTANEOUS CARDIAC INTERVENTION W AMI,05,DISEASES AND DISORDERS OF THE CIRCULATORY SYSTEM,1,Minor,Moderate,Surgical,Private Health Insurance,,,,,Y,155357.95,26546.07
New York City,Manhattan,7002053,001463,NYU Langone Hospitals,50 to 69,100,M,Black/African American,Not Span/Hispanic,1,Emergency,Expired,2020,CIR009,ACUTE MYOCARDIAL INFARCTION,MAM005,MEASUREMENT DURING CARDIAC CATHETERIZATION,174,PERCUTANEOUS CARDIAC INTERVENTION W AMI,05,DISEASES AND DISORDERS OF THE CIRCULATORY SYSTEM,4,Extreme,Extreme,Surgical,Medicare,Medicaid,,,,Y,234410.41,32459.67
New York City,Manhattan,7002053,001463,NYU Langone Hospitals,70 or Older,104,F,Other Race,Spanish/Hispanic,1,Emergency,Home or Self Care,2020,CIR009,ACUTE MYOCARDIAL INFARCTION,CAR004,PERCUTANEOUS CORONARY INTERVENTIONS (PCI),174,PERCUTANEOUS CARDIAC INTERVENTION W AMI,05,DISEASES AND DISORDERS OF THE CIRCULATORY SYSTEM,2,Moderate,Moderate,Surgical,Medicare,,,,,Y,135454.78,20127.27