Hospital Service Area,Hospital County,Operating Certificate Number,Permanent Facility Id,Facility Name,Age Group,Zip Code - 3 digits,Gender,Race,Ethnicity,Length of Stay,Type of Admission,Patient Disposition,Discharge Year,CCS Diagnosis Code,CCS Diagnosis Description,CCS Procedure Code,CCS Procedure Description,APR DRG Code,APR DRG Description,APR MDC Code,APR MDC Description,APR Severity of Illness Code,APR Severity of Illness Description,APR Risk of Mortality,APR Medical Surgical Description,Payment Typology 1,Payment Typology 2,Payment Typology 3,Birth Weight,Abortion Edit Indicator,Emergency Department Indicator,Total Charges,Total Costs
New York City,Manhattan,7002032,001469,Mount Sinai St. Luke's,50 to 69,OOS,M,White,Not Span/Hispanic,1,Urgent,Home or Self Care,2017,106,Cardiac dysrhythmias,049,OTHER OR HEART PRCS,175,Percutaneous coronary intervention w/o AMI,05,Diseases and Disorders of the Circulatory System,1,Minor,Minor,Surgical,Blue Cross/Blue Shield,Self-Pay,,,N,N,115861.98,79959.79
New York City,Bronx,7000006,001169,Montefiore Medical Center - Henry & Lucy Moses Div,50 to 69,104,F,Black/African American,Not Span/Hispanic,1,Emergency,Home or Self Care,2017,106,Cardiac dysrhythmias,049,OTHER OR HEART PRCS,175,Percutaneous coronary intervention w/o AMI,05,Diseases and Disorders of the Circulatory System,3,Major,Moderate,Surgical,Private Health Insurance,,,,N,N,79005.24,27963.56
New York City,Bronx,7000006,001169,Montefiore Medical Center - Henry & Lucy Moses Div,50 to 69,105,M,Black/African American,Spanish/Hispanic,1,Emergency,Home or Self Care,2017,106,Cardiac dysrhythmias,049,OTHER OR HEART PRCS,175,Percutaneous coronary intervention w/o AMI,05,Diseases and Disorders of the Circulatory System,1,Minor,Minor,Surgical,Private Health Insurance,,,,N,N,67632.00,23639.32
New York City,Bronx,7000006,001169,Montefiore Medical Center - Henry & Lucy Moses Div,30 to 49,104,F,Other Race,Not Span/Hispanic,1,Emergency,Home or Self Care,2017,106,Cardiac dysrhythmias,049,OTHER OR HEART PRCS,175,Percutaneous coronary intervention w/o AMI,05,Diseases and Disorders of the Circulatory System,1,Minor,Minor,Surgical,Medicare,Medicaid,,,N,N,68379.42,24458.53
New York City,Bronx,7000006,001169,Montefiore Medical Center - Henry & Lucy Moses Div,50 to 69,105,M,White,Not Span/Hispanic,1,Emergency,Home or Self Care,2017,106,Cardiac dysrhythmias,049,OTHER OR HEART PRCS,175,Percutaneous coronary intervention w/o AMI,05,Diseases and Disorders of the Circulatory System,1,Minor,Minor,Surgical,Blue Cross/Blue Shield,,,,N,N,90251.90,30836.31
New York City,Bronx,7000006,001169,Montefiore Medical Center - Henry & Lucy Moses Div,50 to 69,107,M,Other Race,Not Span/Hispanic,1,Emergency,Home or Self Care,2017,106,Cardiac dysrhythmias,049,OTHER OR HEART PRCS,175,Percutaneous coronary intervention w/o AMI,05,Diseases and Disorders of the Circulatory System,1,Minor,Minor,Surgical,Medicaid,,,,N,N,86418.60,30709.13
New York City,Bronx,7000006,001169,Montefiore Medical Center - Henry & Lucy Moses Div,50 to 69,104,M,Black/African American,Not Span/Hispanic,1,Emergency,Home or Self Care,2017,106,Cardiac dysrhythmias,049,OTHER OR HEART PRCS,175,Percutaneous coronary intervention w/o AMI,05,Diseases and Disorders of the Circulatory System,3,Major,Moderate,Surgical,Medicaid,,,,N,N,90376.59,31370.38
New York City,Bronx,7000006,001169,Montefiore Medical Center - Henry & Lucy Moses Div,50 to 69,104,F,Other Race,Not Span/Hispanic,1,Emergency,Home or Self Care,2017,106,Cardiac dysrhythmias,049,OTHER OR HEART PRCS,175,Percutaneous coronary intervention w/o AMI,05,Diseases and Disorders of the Circulatory System,1,Minor,Minor,Surgical,Medicaid,,,,N,N,80609.13,28562.64
New York City,Bronx,7000006,001169,Montefiore Medical Center - Henry & Lucy Moses Div,70 or Older,105,F,White,Not Span/Hispanic,1,Elective,Home w/ Home Health Services,2017,106,Cardiac dysrhythmias,049,OTHER OR HEART PRCS,175,Percutaneous coronary intervention w/o AMI,05,Diseases and Disorders of the Circulatory System,2,Moderate,Minor,Surgical,Medicare,,,,N,N,108678.92,36842.50
New York City,Bronx,7000006,001169,Montefiore Medical Center - Henry & Lucy Moses Div,50 to 69,104,M,Other Race,Not Span/Hispanic,1,Emergency,Home or Self Care,2017,101,Coronary atherosclerosis and other heart disease,045,PERC TRANSLUM COR ANGIO,175,Percutaneous coronary intervention w/o AMI,05,Diseases and Disorders of the Circulatory System,2,Moderate,Minor,Surgical,Medicaid,,,,N,N,46253.53,15451.40
New York City,Bronx,7000006,001169,Montefiore Medical Center - Henry & Lucy Moses Div,50 to 69,104,M,Other Race,Not Span/Hispanic,1,Emergency,Home or Self Care,2017,101,Coronary atherosclerosis and other heart disease,045,PERC TRANSLUM COR ANGIO,175,Percutaneous coronary intervention w/o AMI,05,Diseases and Disorders of the Circulatory System,2,Moderate,Minor,Surgical,Private Health Insurance,,,,N,N,44031.98,14839.15
New York City,Bronx,7000006,001169,Montefiore Medical Center - Henry & Lucy Moses Div,50 to 69,107,M,Other Race,Not Span/Hispanic,1,Elective,Home or Self Care,2017,101,Coronary atherosclerosis and other heart disease,045,PERC TRANSLUM COR ANGIO,175,Percutaneous coronary intervention w/o AMI,05,Diseases and Disorders of the Circulatory System,1,Minor,Minor,Surgical,Medicaid,,,,N,N,42746.45,14713.41
New York City,Bronx,7000006,001169,Montefiore Medical Center - Henry & Lucy Moses Div,50 to 69,104,M,Other Race,Spanish/Hispanic,6,Emergency,Home or Self Care,2017,101,Coronary atherosclerosis and other heart disease,045,PERC TRANSLUM COR ANGIO,175,Percutaneous coronary intervention w/o AMI,05,Diseases and Disorders of the Circulatory System,3,Major,Moderate,Surgical,Medicaid,,,,N,Y,122821.27,39844.70
New York City,Bronx,7000006,001169,Montefiore Medical Center - Henry & Lucy Moses Div,50 to 69,104,M,Other Race,Not Span/Hispanic,1,Emergency,Home or Self Care,2017,101,Coronary atherosclerosis and other heart disease,045,PERC TRANSLUM COR ANGIO,175,Percutaneous coronary intervention w/o AMI,05,Diseases and Disorders of the Circulatory System,2,Moderate,Minor,Surgical,Blue Cross/Blue Shield,,,,N,N,50608.81,17810.40
New York City,Bronx,7000006,001169,Montefiore Medical Center - Henry & Lucy Moses Div,50 to 69,104,M,Other Race,Not Span/Hispanic,1,Emergency,Home or Self Care,2017,101,Coronary atherosclerosis and other heart disease,045,PERC TRANSLUM COR ANGIO,175,Percutaneous coronary intervention w/o AMI,05,Diseases and Disorders of the Circulatory System,1,Minor,Minor,Surgical,Medicaid,,,,N,N,40657.46,13693.81
New York City,Bronx,7000006,001169,Montefiore Medical Center - Henry & Lucy Moses Div,50 to 69,104,M,Other Race,Not Span/Hispanic,1,Emergency,Home or Self Care,2017,101,Coronary atherosclerosis and other heart disease,045,PERC TRANSLUM COR ANGIO,175,Percutaneous coronary intervention w/o AMI,05,Diseases and Disorders of the Circulatory System,2,Moderate,Minor,Surgical,Medicaid,,,,N,N,46823.05,15905.28
New York City,Bronx,7000006,003058,Montefiore Med Center - Jack D Weiler Hosp of A Einstein College Div,50 to 69,105,M,White,Not Span/Hispanic,1,Emergency,Home or Self Care,2017,106,Cardiac dysrhythmias,049,OTHER OR HEART PRCS,175,Percutaneous coronary intervention w/o AMI,05,Diseases and Disorders of the Circulatory System,1,Minor,Minor,Surgical,Blue Cross/Blue Shield,,,,N,N,87273.85,30047.00
New York City,Bronx,7000006,003058,Montefiore Med Center - Jack D Weiler Hosp of A Einstein College Div,70 or Older,104,F,Black/African American,Spanish/Hispanic,10,Emergency,Facility w/ Custodial/Supportive Care,2017,106,Cardiac dysrhythmias,231,OTHER THERAPEUTIC PRCS,175,Percutaneous coronary intervention w/o AMI,05,Diseases and Disorders of the Circulatory System,2,Moderate,Moderate,Surgical,Medicare,Medicaid,,,N,Y,195607.51,59545.75
New York City,Bronx,7000006,003058,Montefiore Med Center - Jack D Weiler Hosp of A Einstein College Div,70 or Older,104,F,Other Race,Spanish/Hispanic,5,Emergency,Home or Self Care,2017,101,Coronary atherosclerosis and other heart disease,045,PERC TRANSLUM COR ANGIO,175,Percutaneous coronary intervention w/o AMI,05,Diseases and Disorders of the Circulatory System,3,Major,Major,Surgical,Medicare,,,,N,Y,157573.49,46821.56
New York City,Bronx,7000006,003058,Montefiore Med Center - Jack D Weiler Hosp of A Einstein College Div,50 to 69,104,F,Other Race,Not Span/Hispanic,4,Emergency,Home or Self Care,2017,101,Coronary atherosclerosis and other heart disease,045,PERC TRANSLUM COR ANGIO,175,Percutaneous coronary intervention w/o AMI,05,Diseases and Disorders of the Circulatory System,2,Moderate,Moderate,Surgical,Medicaid,,,,N,Y,85462.46,25849.83
New York City,Bronx,7000006,003058,Montefiore Med Center - Jack D Weiler Hosp of A Einstein College Div,70 or Older,104,F,Other Race,Not Span/Hispanic,1,Emergency,Home or Self Care,2017,101,Coronary atherosclerosis and other heart disease,045,PERC TRANSLUM COR ANGIO,175,Percutaneous coronary intervention w/o AMI,05,Diseases and Disorders of the Circulatory System,1,Minor,Minor,Surgical,Medicare,,,,N,N,41520.88,13651.70
New York City,Bronx,7000006,003058,Montefiore Med Center - Jack D Weiler Hosp of A Einstein College Div,70 or Older,100,F,Other Race,Spanish/Hispanic,4,Emergency,Home or Self Care,2017,099,Hypertension with complications and secondary hypertension,045,PERC TRANSLUM COR ANGIO,175,Percutaneous coronary intervention w/o AMI,05,Diseases and Disorders of the Circulatory System,3,Major,Moderate,Surgical,Medicare,,,,N,Y,86542.47,26148.67
New York City,Bronx,7000006,003058,Montefiore Med Center - Jack D Weiler Hosp of A Einstein College Div,50 to 69,104,M,White,Not Span/Hispanic,1,Emergency,Home or Self Care,2017,101,Coronary atherosclerosis and other heart disease,045,PERC TRANSLUM COR ANGIO,175,Percutaneous coronary intervention w/o AMI,05,Diseases and Disorders of the Circulatory System,3,Major,Moderate,Surgical,Medicaid,,,,N,N,52018.58,16822.15
New York City,Bronx,7000006,003058,Montefiore Med Center - Jack D Weiler Hosp of A Einstein College Div,50 to 69,112,F,Other Race,Spanish/Hispanic,1,Emergency,Home or Self Care,2017,101,Coronary atherosclerosis and other heart disease,045,PERC TRANSLUM COR ANGIO,175,Percutaneous coronary intervention w/o AMI,05,Diseases and Disorders of the Circulatory System,1,Minor,Minor,Surgical,Medicaid,,,,N,N,51404.06,17751.98
New York City,Bronx,7000006,003058,Montefiore Med Center - Jack D Weiler Hosp of A Einstein College Div,50 to 69,104,M,Other Race,Spanish/Hispanic,1,Emergency,Home or Self Care,2017,106,Cardiac dysrhythmias,049,OTHER OR HEART PRCS,175,Percutaneous coronary intervention w/o AMI,05,Diseases and Disorders of the Circulatory System,2,Moderate,Major,Surgical,Medicare,,,,N,N,89282.74,31522.17
New York City,Bronx,7000006,003058,Montefiore Med Center - Jack D Weiler Hosp of A Einstein College Div,50 to 69,104,M,Other Race,Spanish/Hispanic,6,Emergency,Home or Self Care,2017,101,Coronary atherosclerosis and other heart disease,045,PERC TRANSLUM COR ANGIO,175,Percutaneous coronary intervention w/o AMI,05,Diseases and Disorders of the Circulatory System,1,Minor,Minor,Surgical,Private Health Insurance,,,,N,Y,121042.09,36779.42
New York City,Bronx,7000006,003058,Montefiore Med Center - Jack D Weiler Hosp of A Einstein College Div,30 to 49,104,F,Black/African American,Not Span/Hispanic,1,Emergency,Skilled Nursing Home,2017,101,Coronary atherosclerosis and other heart disease,045,PERC TRANSLUM COR ANGIO,175,Percutaneous coronary intervention w/o AMI,05,Diseases and Disorders of the Circulatory System,2,Moderate,Moderate,Surgical,Medicaid,,,,N,N,69440.90,24270.54
New York City,Bronx,7000006,003058,Montefiore Med Center - Jack D Weiler Hosp of A Einstein College Div,50 to 69,104,M,Other Race,Not Span/Hispanic,4,Emergency,Home or Self Care,2017,237,Complication of device; implant or graft,045,PERC TRANSLUM COR ANGIO,175,Percutaneous coronary intervention w/o AMI,05,Diseases and Disorders of the Circulatory System,1,Minor,Minor,Surgical,Private Health Insurance,,,,N,Y,84603.27,26685.77
New York City,Bronx,7000006,003058,Montefiore Med Center - Jack D Weiler Hosp of A Einstein College Div,70 or Older,104,M,White,Not Span/Hispanic,3,Emergency,Home or Self Care,2017,106,Cardiac dysrhythmias,049,OTHER OR HEART PRCS,175,Percutaneous coronary intervention w/o AMI,05,Diseases and Disorders of the Circulatory System,2,Moderate,Moderate,Surgical,Medicare,,,,N,Y,102666.20,34737.71
New York City,Bronx,7000006,003058,Montefiore Med Center - Jack D Weiler Hosp of A Einstein College Div,50 to 69,104,M,Other Race,Not Span/Hispanic,1,Emergency,Home or Self Care,2017,101,Coronary atherosclerosis and other heart disease,045,PERC TRANSLUM COR ANGIO,175,Percutaneous coronary intervention w/o AMI,05,Diseases and Disorders of the Circulatory System,1,Minor,Minor,Surgical,Private Health Insurance,,,,N,N,71967.91,25210.60
New York City,Bronx,7000006,003058,Montefiore Med Center - Jack D Weiler Hosp of A Einstein College Div,50 to 69,104,M,Other Race,Not Span/Hispanic,3,Emergency,Home or Self Care,2017,101,Coronary atherosclerosis and other heart disease,045,PERC TRANSLUM COR ANGIO,175,Percutaneous coronary intervention w/o AMI,05,Diseases and Disorders of the Circulatory System,2,Moderate,Minor,Surgical,Private Health Insurance,,,,N,Y,68763.62,20977.83
New York City,Manhattan,7002002,001439,Mount Sinai Beth Israel,50 to 69,100,M,Black/African American,Not Span/Hispanic,12,Emergency,Home w/ Home Health Services,2017,106,Cardiac dysrhythmias,193,DX ULTRASOUND HEART,175,Percutaneous coronary intervention w/o AMI,05,Diseases and Disorders of the Circulatory System,3,Major,Major,Surgical,Medicare,Medicaid,Self-Pay,,N,Y,135056.49,41843.22
New York City,Manhattan,7002002,001439,Mount Sinai Beth Israel,70 or Older,112,F,White,Not Span/Hispanic,3,Urgent,Skilled Nursing Home,2017,106,Cardiac dysrhythmias,049,OTHER OR HEART PRCS,175,Percutaneous coronary intervention w/o AMI,05,Diseases and Disorders of the Circulatory System,2,Moderate,Major,Surgical,Medicare,Private Health Insurance,Self-Pay,,N,Y,82252.33,24193.88
New York City,Manhattan,7002002,001439,Mount Sinai Beth Israel,50 to 69,112,F,Black/African American,Spanish/Hispanic,6,Urgent,Home or Self Care,2017,101,Coronary atherosclerosis and other heart disease,045,PERC TRANSLUM COR ANGIO,175,Percutaneous coronary intervention w/o AMI,05,Diseases and Disorders of the Circulatory System,2,Moderate,Moderate,Surgical,Medicare,Miscellaneous/Other,Medicaid,,N,N,64898.16,19947.97
New York City,Manhattan,7002002,001439,Mount Sinai Beth Israel,50 to 69,112,M,Other Race,Not Span/Hispanic,1,Urgent,Home or Self Care,2017,101,Coronary atherosclerosis and other heart disease,045,PERC TRANSLUM COR ANGIO,175,Percutaneous coronary intervention w/o AMI,05,Diseases and Disorders of the Circulatory System,1,Minor,Minor,Surgical,Medicaid,Medicaid,Self-Pay,,N,N,22613.20,6689.40
New York City,Manhattan,7002002,001439,Mount Sinai Beth Israel,50 to 69,112,F,Other Race,Not Span/Hispanic,1,Urgent,Home or Self Care,2017,101,Coronary atherosclerosis and other heart disease,045,PERC TRANSLUM COR ANGIO,175,Percutaneous coronary intervention w/o AMI,05,Diseases and Disorders of the Circulatory System,2,Moderate,Minor,Surgical,Medicare,Miscellaneous/Other,Self-Pay,,N,Y,42969.10,21378.21
New York City,Manhattan,7002024,001456,Mount Sinai Hospital,70 or Older,OOS,F,White,Not Span/Hispanic,3,Elective,Home or Self Care,2017,101,Coronary atherosclerosis and other heart disease,045,PERC TRANSLUM COR ANGIO,175,Percutaneous coronary intervention w/o AMI,05,Diseases and Disorders of the Circulatory System,3,Major,Moderate,Surgical,Medicare,Private Health Insurance,Self-Pay,,N,N,36128.87,10841.27
New York City,Manhattan,7002024,001456,Mount Sinai Hospital,70 or Older,112,M,White,Not Span/Hispanic,2,Urgent,Home or Self Care,2017,096,Heart valve disorders,043,HEART VALVE PRCS,175,Percutaneous coronary intervention w/o AMI,05,Diseases and Disorders of the Circulatory System,4,Extreme,Moderate,Surgical,Medicare,Blue Cross/Blue Shield,Self-Pay,,N,N,117471.42,62044.68
New York City,Manhattan,7002024,001456,Mount Sinai Hospital,50 to 69,112,F,Black/African American,Not Span/Hispanic,3,Urgent,Home or Self Care,2017,101,Coronary atherosclerosis and other heart disease,045,PERC TRANSLUM COR ANGIO,175,Percutaneous coronary intervention w/o AMI,05,Diseases and Disorders of the Circulatory System,2,Moderate,Moderate,Surgical,Medicare,Medicare,Self-Pay,,N,N,52481.97,16185.42
New York City,Manhattan,7002024,001456,Mount Sinai Hospital,70 or Older,104,M,White,Not Span/Hispanic,7,Emergency,Home w/ Home Health Services,2017,096,Heart valve disorders,043,HEART VALVE PRCS,175,Percutaneous coronary intervention w/o AMI,05,Diseases and Disorders of the Circulatory System,3,Major,Major,Surgical,Medicare,Private Health Insurance,Self-Pay,,N,Y,89387.54,30715.43
New York City,Manhattan,7002024,001456,Mount Sinai Hospital,50 to 69,100,M,Other Race,Not Span/Hispanic,1,Emergency,Home or Self Care,2017,101,Coronary atherosclerosis and other heart disease,045,PERC TRANSLUM COR ANGIO,175,Percutaneous coronary intervention w/o AMI,05,Diseases and Disorders of the Circulatory System,1,Minor,Minor,Surgical,Medicare,Medicare,Medicaid,,N,Y,14035.38,4111.73
New York City,Manhattan,7002032,001469,Mount Sinai St. Luke's,70 or Older,112,F,Black/African American,Not Span/Hispanic,6,Emergency,Home w/ Home Health Services,2017,106,Cardiac dysrhythmias,049,OTHER OR HEART PRCS,175,Percutaneous coronary intervention w/o AMI,05,Diseases and Disorders of the Circulatory System,3,Major,Major,Surgical,Medicare,Medicaid,Self-Pay,,N,Y,52692.47,16257.87
New York City,Manhattan,7002032,001469,Mount Sinai St. Luke's,50 to 69,104,M,Other Race,Not Span/Hispanic,2,Urgent,Home or Self Care,2017,106,Cardiac dysrhythmias,049,OTHER OR HEART PRCS,175,Percutaneous coronary intervention w/o AMI,05,Diseases and Disorders of the Circulatory System,2,Moderate,Minor,Surgical,Medicaid,Self-Pay,Self-Pay,,N,N,321.00,125.37
New York City,Manhattan,7002032,001469,Mount Sinai St. Luke's,70 or Older,104,F,Other Race,Not Span/Hispanic,2,Urgent,Home or Self Care,2017,237,Complication of device; implant or graft,045,PERC TRANSLUM COR ANGIO,175,Percutaneous coronary intervention w/o AMI,05,Diseases and Disorders of the Circulatory System,2,Moderate,Major,Surgical,Medicare,Medicare,Medicaid,,N,N,321.00,125.37
New York City,Manhattan,7002032,001469,Mount Sinai St. Luke's,70 or Older,112,M,Black/African American,Unknown,3,Urgent,Home or Self Care,2017,096,Heart valve disorders,045,PERC TRANSLUM COR ANGIO,175,Percutaneous coronary intervention w/o AMI,05,Diseases and Disorders of the Circulatory System,3,Major,Major,Surgical,Medicare,Medicare,Self-Pay,,N,N,69454.22,35861.87
New York City,Manhattan,7002032,001469,Mount Sinai St. Luke's,50 to 69,101,M,Other Race,Not Span/Hispanic,1,Urgent,Home or Self Care,2017,106,Cardiac dysrhythmias,049,OTHER OR HEART PRCS,175,Percutaneous coronary intervention w/o AMI,05,Diseases and Disorders of the Circulatory System,1,Minor,Minor,Surgical,Blue Cross/Blue Shield,Self-Pay,,,N,N,81972.52,52902.24
Hudson Valley,Orange,3523000,000699,Orange Regional Medical Center,70 or Older,109,M,White,Not Span/Hispanic,19,Emergency,Skilled Nursing Home,2017,099,Hypertension with complications and secondary hypertension,045,PERC TRANSLUM COR ANGIO,175,Percutaneous coronary intervention w/o AMI,05,Diseases and Disorders of the Circulatory System,3,Major,Major,Surgical,Medicare,Private Health Insurance,,,N,Y,182892.24,78430.28
Hudson Valley,Orange,3523000,000699,Orange Regional Medical Center,70 or Older,127,M,White,Not Span/Hispanic,7,Emergency,Home or Self Care,2017,106,Cardiac dysrhythmias,049,OTHER OR HEART PRCS,175,Percutaneous coronary intervention w/o AMI,05,Diseases and Disorders of the Circulatory System,3,Major,Major,Surgical,Medicare,,,,N,Y,94516.60,31969.96
Hudson Valley,Orange,3523000,000699,Orange Regional Medical Center,70 or Older,109,M,White,Not Span/Hispanic,7,Emergency,Home w/ Home Health Services,2017,101,Coronary atherosclerosis and other heart disease,045,PERC TRANSLUM COR ANGIO,175,Percutaneous coronary intervention w/o AMI,05,Diseases and Disorders of the Circulatory System,2,Moderate,Major,Surgical,Medicare,Private Health Insurance,,,N,Y,108124.28,33902.54
Hudson Valley,Rockland,4329000,000779,Good Samaritan Hospital of Suffern,70 or Older,109,F,White,Not Span/Hispanic,2,Emergency,Home or Self Care,2017,101,Coronary atherosclerosis and other heart disease,045,PERC TRANSLUM COR ANGIO,175,Percutaneous coronary intervention w/o AMI,05,Diseases and Disorders of the Circulatory System,2,Moderate,Minor,Surgical,Medicare,,,,N,Y,143941.46,19163.05
New York City,Bronx,7000006,001169,Montefiore Medical Center - Henry & Lucy Moses Div,50 to 69,104,F,Other Race,Not Span/Hispanic,1,Emergency,Home or Self Care,2017,106,Cardiac dysrhythmias,049,OTHER OR HEART PRCS,175,Percutaneous coronary intervention w/o AMI,05,Diseases and Disorders of the Circulatory System,1,Minor,Minor,Surgical,Medicare,Medicaid,,,N,N,93265.97,32283.95
New York City,Bronx,7000006,001169,Montefiore Medical Center - Henry & Lucy Moses Div,50 to 69,104,F,Black/African American,Not Span/Hispanic,1,Emergency,Home or Self Care,2017,101,Coronary atherosclerosis and other heart disease,045,PERC TRANSLUM COR ANGIO,175,Percutaneous coronary intervention w/o AMI,05,Diseases and Disorders of the Circulatory System,1,Minor,Minor,Surgical,Medicare,Medicaid,,,N,N,41147.99,14116.70
New York City,Bronx,7000006,001169,Montefiore Medical Center - Henry & Lucy Moses Div,30 to 49,104,F,Other Race,Not Span/Hispanic,1,Emergency,Home or Self Care,2017,106,Cardiac dysrhythmias,049,OTHER OR HEART PRCS,175,Percutaneous coronary intervention w/o AMI,05,Diseases and Disorders of the Circulatory System,2,Moderate,Minor,Surgical,Medicaid,,,,N,N,53979.46,19636.37
New York City,Bronx,7000006,001169,Montefiore Medical Center - Henry & Lucy Moses Div,50 to 69,104,F,Black/African American,Not Span/Hispanic,1,Emergency,Home or Self Care,2017,101,Coronary atherosclerosis and other heart disease,045,PERC TRANSLUM COR ANGIO,175,Percutaneous coronary intervention w/o AMI,05,Diseases and Disorders of the Circulatory System,2,Moderate,Moderate,Surgical,Medicare,Medicaid,,,N,N,58824.71,20443.43
New York City,Bronx,7000006,001169,Montefiore Medical Center - Henry & Lucy Moses Div,70 or Older,100,F,Other Race,Not Span/Hispanic,1,Emergency,Home or Self Care,2017,101,Coronary atherosclerosis and other heart disease,045,PERC TRANSLUM COR ANGIO,175,Percutaneous coronary intervention w/o AMI,05,Diseases and Disorders of the Circulatory System,1,Minor,Minor,Surgical,Medicare,,,,N,N,36537.07,12604.91
New York City,Bronx,7000006,001169,Montefiore Medical Center - Henry & Lucy Moses Div,30 to 49,104,M,Other Race,Spanish/Hispanic,1,Elective,Home or Self Care,2017,101,Coronary atherosclerosis and other heart disease,045,PERC TRANSLUM COR ANGIO,175,Percutaneous coronary intervention w/o AMI,05,Diseases and Disorders of the Circulatory System,2,Moderate,Moderate,Surgical,Medicaid,,,,N,N,69958.72,25698.46
New York City,Bronx,7000006,001169,Montefiore Medical Center - Henry & Lucy Moses Div,70 or Older,104,M,Other Race,Not Span/Hispanic,4,Emergency,Home or Self Care,2017,101,Coronary atherosclerosis and other heart disease,045,PERC TRANSLUM COR ANGIO,175,Percutaneous coronary intervention w/o AMI,05,Diseases and Disorders of the Circulatory System,2,Moderate,Minor,Surgical,Medicare,,,,N,N,154980.84,54487.99
New York City,Bronx,7000006,001169,Montefiore Medical Center - Henry & Lucy Moses Div,50 to 69,104,M,Other Race,Spanish/Hispanic,1,Emergency,Home or Self Care,2017,101,Coronary atherosclerosis and other heart disease,045,PERC TRANSLUM COR ANGIO,175,Percutaneous coronary intervention w/o AMI,05,Diseases and Disorders of the Circulatory System,2,Moderate,Moderate,Surgical,Medicare,Medicaid,,,N,N,56233.07,19877.05