Hospital Service Area,Hospital County,Operating Certificate Number,Permanent Facility Id,Facility Name,Age Group,Zip Code - 3 digits,Gender,Race,Ethnicity,Length of Stay,Type of Admission,Patient Disposition,Discharge Year,CCS Diagnosis Code,CCS Diagnosis Description,CCS Procedure Code,CCS Procedure Description,APR DRG Code,APR DRG Description,APR MDC Code,APR MDC Description,APR Severity of Illness Code,APR Severity of Illness Description,APR Risk of Mortality,APR Medical Surgical Description,Payment Typology 1,Payment Typology 2,Payment Typology 3,Birth Weight,Abortion Edit Indicator,Emergency Department Indicator,Total Charges,Total Costs
Long Island,Suffolk,5123000,000885,Long Island Community Hospital,30 to 49,119,M,White,Not Span/Hispanic,3,Emergency,Home or Self Care,2020,CIR011,CORONARY ATHEROSCLEROSIS AND OTHER HEART DISEASE,MAM005,MEASUREMENT DURING CARDIAC CATHETERIZATION,175,PERCUTANEOUS CARDIAC INTERVENTION W/O AMI,05,DISEASES AND DISORDERS OF THE CIRCULATORY SYSTEM,2,Moderate,Moderate,Surgical,Private Health Insurance,Medicaid,,,,Y,67007,11053.46
Long Island,Suffolk,5123000,000885,Long Island Community Hospital,50 to 69,117,M,Black/African American,Not Span/Hispanic,4,Emergency,Home or Self Care,2020,CIR011,CORONARY ATHEROSCLEROSIS AND OTHER HEART DISEASE,CAR004,PERCUTANEOUS CORONARY INTERVENTIONS (PCI),175,PERCUTANEOUS CARDIAC INTERVENTION W/O AMI,05,DISEASES AND DISORDERS OF THE CIRCULATORY SYSTEM,3,Major,Moderate,Surgical,Medicare,Medicare,Medicaid,,,Y,112590.22,17402.58
Long Island,Suffolk,5123000,000885,Long Island Community Hospital,70 or Older,117,M,White,Not Span/Hispanic,3,Emergency,Home or Self Care,2020,CIR011,CORONARY ATHEROSCLEROSIS AND OTHER HEART DISEASE,CAR004,PERCUTANEOUS CORONARY INTERVENTIONS (PCI),175,PERCUTANEOUS CARDIAC INTERVENTION W/O AMI,05,DISEASES AND DISORDERS OF THE CIRCULATORY SYSTEM,3,Major,Moderate,Surgical,Medicare,Medicare,Blue Cross/Blue Shield,,,Y,106513.34,16166.53
Long Island,Suffolk,5123000,000885,Long Island Community Hospital,50 to 69,119,M,Black/African American,Not Span/Hispanic,1,Emergency,Home or Self Care,2020,CIR011,CORONARY ATHEROSCLEROSIS AND OTHER HEART DISEASE,CAR004,PERCUTANEOUS CORONARY INTERVENTIONS (PCI),175,PERCUTANEOUS CARDIAC INTERVENTION W/O AMI,05,DISEASES AND DISORDERS OF THE CIRCULATORY SYSTEM,1,Minor,Minor,Surgical,Medicare,Medicare,Private Health Insurance,,,Y,65872.16,9142.82
Long Island,Suffolk,5123000,000885,Long Island Community Hospital,50 to 69,119,M,White,Not Span/Hispanic,1,Emergency,Home or Self Care,2020,CIR011,CORONARY ATHEROSCLEROSIS AND OTHER HEART DISEASE,CAR004,PERCUTANEOUS CORONARY INTERVENTIONS (PCI),175,PERCUTANEOUS CARDIAC INTERVENTION W/O AMI,05,DISEASES AND DISORDERS OF THE CIRCULATORY SYSTEM,1,Minor,Moderate,Surgical,Private Health Insurance,,,,,Y,35007.62,6049.7
Long Island,Suffolk,5123000,000885,Long Island Community Hospital,30 to 49,117,M,Other Race,Not Span/Hispanic,4,Emergency,Home or Self Care,2020,CIR011,CORONARY ATHEROSCLEROSIS AND OTHER HEART DISEASE,CAR004,PERCUTANEOUS CORONARY INTERVENTIONS (PCI),175,PERCUTANEOUS CARDIAC INTERVENTION W/O AMI,05,DISEASES AND DISORDERS OF THE CIRCULATORY SYSTEM,1,Minor,Minor,Surgical,Blue Cross/Blue Shield,,,,,Y,81114.96,13305.78
Long Island,Suffolk,5123000,000885,Long Island Community Hospital,70 or Older,117,F,Black/African American,Not Span/Hispanic,3,Emergency,Home or Self Care,2020,CIR011,CORONARY ATHEROSCLEROSIS AND OTHER HEART DISEASE,CAR004,PERCUTANEOUS CORONARY INTERVENTIONS (PCI),175,PERCUTANEOUS CARDIAC INTERVENTION W/O AMI,05,DISEASES AND DISORDERS OF THE CIRCULATORY SYSTEM,1,Minor,Minor,Surgical,Medicare,,,,,Y,72991.65,11916.27
Long Island,Suffolk,5123000,000885,Long Island Community Hospital,70 or Older,117,M,White,Not Span/Hispanic,1,Emergency,Home or Self Care,2020,CIR011,CORONARY ATHEROSCLEROSIS AND OTHER HEART DISEASE,CAR004,PERCUTANEOUS CORONARY INTERVENTIONS (PCI),175,PERCUTANEOUS CARDIAC INTERVENTION W/O AMI,05,DISEASES AND DISORDERS OF THE CIRCULATORY SYSTEM,2,Moderate,Moderate,Surgical,Medicare,Medicare,Private Health Insurance,,,Y,77676.78,11312.12
Long Island,Suffolk,5123000,000885,Long Island Community Hospital,50 to 69,117,M,Black/African American,Not Span/Hispanic,5,Emergency,Home or Self Care,2020,CIR017,CARDIAC DYSRHYTHMIAS,CAR004,PERCUTANEOUS CORONARY INTERVENTIONS (PCI),175,PERCUTANEOUS CARDIAC INTERVENTION W/O AMI,05,DISEASES AND DISORDERS OF THE CIRCULATORY SYSTEM,2,Moderate,Major,Surgical,Medicare,Blue Cross/Blue Shield,,,,Y,88873.5,14830.74
Long Island,Suffolk,5123000,000885,Long Island Community Hospital,30 to 49,117,M,White,Not Span/Hispanic,2,Emergency,Home or Self Care,2020,CIR011,CORONARY ATHEROSCLEROSIS AND OTHER HEART DISEASE,CAR004,PERCUTANEOUS CORONARY INTERVENTIONS (PCI),175,PERCUTANEOUS CARDIAC INTERVENTION W/O AMI,05,DISEASES AND DISORDERS OF THE CIRCULATORY SYSTEM,2,Moderate,Moderate,Surgical,Blue Cross/Blue Shield,,,,,Y,76860.97,10315.73
Long Island,Suffolk,5123000,000885,Long Island Community Hospital,50 to 69,117,F,Black/African American,Not Span/Hispanic,6,Emergency,Home or Self Care,2020,CIR012,NONSPECIFIC CHEST PAIN,MAM005,MEASUREMENT DURING CARDIAC CATHETERIZATION,175,PERCUTANEOUS CARDIAC INTERVENTION W/O AMI,05,DISEASES AND DISORDERS OF THE CIRCULATORY SYSTEM,2,Moderate,Moderate,Surgical,Private Health Insurance,Medicaid,,,,Y,93734.67,17168.69
Long Island,Suffolk,5123000,000885,Long Island Community Hospital,70 or Older,117,F,White,Not Span/Hispanic,3,Emergency,Home or Self Care,2020,CIR011,CORONARY ATHEROSCLEROSIS AND OTHER HEART DISEASE,CAR004,PERCUTANEOUS CORONARY INTERVENTIONS (PCI),175,PERCUTANEOUS CARDIAC INTERVENTION W/O AMI,05,DISEASES AND DISORDERS OF THE CIRCULATORY SYSTEM,3,Major,Extreme,Surgical,Medicare,Medicare,Blue Cross/Blue Shield,,,Y,146213.86,21603.78
Long Island,Suffolk,5123000,000885,Long Island Community Hospital,50 to 69,119,M,White,Not Span/Hispanic,4,Emergency,Home or Self Care,2020,CIR011,CORONARY ATHEROSCLEROSIS AND OTHER HEART DISEASE,CAR004,PERCUTANEOUS CORONARY INTERVENTIONS (PCI),175,PERCUTANEOUS CARDIAC INTERVENTION W/O AMI,05,DISEASES AND DISORDERS OF THE CIRCULATORY SYSTEM,2,Moderate,Major,Surgical,Medicare,Medicare,,,,Y,74634.76,12342.54
Long Island,Suffolk,5123000,000885,Long Island Community Hospital,70 or Older,117,M,White,Not Span/Hispanic,4,Emergency,Home or Self Care,2020,CIR011,CORONARY ATHEROSCLEROSIS AND OTHER HEART DISEASE,CAR004,PERCUTANEOUS CORONARY INTERVENTIONS (PCI),175,PERCUTANEOUS CARDIAC INTERVENTION W/O AMI,05,DISEASES AND DISORDERS OF THE CIRCULATORY SYSTEM,1,Minor,Minor,Surgical,Medicare,Blue Cross/Blue Shield,,,,Y,99618.81,16273.64
Long Island,Suffolk,5123000,000885,Long Island Community Hospital,70 or Older,117,F,White,Not Span/Hispanic,1,Elective,Home or Self Care,2020,CIR003,NONRHEUMATIC AND UNSPECIFIED VALVE DISORDERS,CAR004,PERCUTANEOUS CORONARY INTERVENTIONS (PCI),175,PERCUTANEOUS CARDIAC INTERVENTION W/O AMI,05,DISEASES AND DISORDERS OF THE CIRCULATORY SYSTEM,1,Minor,Minor,Surgical,Medicare,Medicare,Blue Cross/Blue Shield,,,N,55185.61,8506.21
Long Island,Suffolk,5123000,000885,Long Island Community Hospital,50 to 69,119,M,White,Not Span/Hispanic,2,Emergency,Home or Self Care,2020,CIR011,CORONARY ATHEROSCLEROSIS AND OTHER HEART DISEASE,CAR004,PERCUTANEOUS CORONARY INTERVENTIONS (PCI),175,PERCUTANEOUS CARDIAC INTERVENTION W/O AMI,05,DISEASES AND DISORDERS OF THE CIRCULATORY SYSTEM,2,Moderate,Minor,Surgical,Private Health Insurance,,,,,Y,107441.25,14237.87
Long Island,Suffolk,5123000,000885,Long Island Community Hospital,50 to 69,117,M,Black/African American,Not Span/Hispanic,6,Emergency,Home w/ Home Health Services,2020,CIR008,HYPERTENSION WITH COMPLICATIONS AND SECONDARY HYPERTENSION,MAM005,MEASUREMENT DURING CARDIAC CATHETERIZATION,175,PERCUTANEOUS CARDIAC INTERVENTION W/O AMI,05,DISEASES AND DISORDERS OF THE CIRCULATORY SYSTEM,4,Extreme,Extreme,Surgical,Self-Pay,,,,,Y,168268.71,22254.2
Long Island,Suffolk,5123000,000885,Long Island Community Hospital,50 to 69,119,F,White,Not Span/Hispanic,3,Emergency,Home or Self Care,2020,CIR011,CORONARY ATHEROSCLEROSIS AND OTHER HEART DISEASE,MAM005,MEASUREMENT DURING CARDIAC CATHETERIZATION,175,PERCUTANEOUS CARDIAC INTERVENTION W/O AMI,05,DISEASES AND DISORDERS OF THE CIRCULATORY SYSTEM,2,Moderate,Minor,Surgical,Private Health Insurance,Medicaid,,,,Y,48350.74,9146.3
Long Island,Suffolk,5123000,000885,Long Island Community Hospital,70 or Older,119,F,White,Not Span/Hispanic,3,Emergency,Home or Self Care,2020,CIR011,CORONARY ATHEROSCLEROSIS AND OTHER HEART DISEASE,CAR004,PERCUTANEOUS CORONARY INTERVENTIONS (PCI),175,PERCUTANEOUS CARDIAC INTERVENTION W/O AMI,05,DISEASES AND DISORDERS OF THE CIRCULATORY SYSTEM,1,Minor,Minor,Surgical,Medicare,,,,,Y,62682.75,10266.45
Long Island,Suffolk,5123000,000885,Long Island Community Hospital,50 to 69,117,M,White,Not Span/Hispanic,2,Emergency,Home or Self Care,2020,CIR011,CORONARY ATHEROSCLEROSIS AND OTHER HEART DISEASE,CAR004,PERCUTANEOUS CORONARY INTERVENTIONS (PCI),175,PERCUTANEOUS CARDIAC INTERVENTION W/O AMI,05,DISEASES AND DISORDERS OF THE CIRCULATORY SYSTEM,1,Minor,Minor,Surgical,Private Health Insurance,,,,,Y,63989.75,10273.74
Long Island,Suffolk,5123000,000885,Long Island Community Hospital,70 or Older,117,M,White,Not Span/Hispanic,3,Emergency,Home w/ Home Health Services,2020,CIR011,CORONARY ATHEROSCLEROSIS AND OTHER HEART DISEASE,CAR004,PERCUTANEOUS CORONARY INTERVENTIONS (PCI),175,PERCUTANEOUS CARDIAC INTERVENTION W/O AMI,05,DISEASES AND DISORDERS OF THE CIRCULATORY SYSTEM,2,Moderate,Minor,Surgical,Medicare,Medicare,,,,Y,87928.56,14423.2
Long Island,Suffolk,5123000,000885,Long Island Community Hospital,70 or Older,117,F,White,Not Span/Hispanic,5,Emergency,Home or Self Care,2020,CIR011,CORONARY ATHEROSCLEROSIS AND OTHER HEART DISEASE,CAR004,PERCUTANEOUS CORONARY INTERVENTIONS (PCI),175,PERCUTANEOUS CARDIAC INTERVENTION W/O AMI,05,DISEASES AND DISORDERS OF THE CIRCULATORY SYSTEM,2,Moderate,Moderate,Surgical,Medicare,Blue Cross/Blue Shield,,,,Y,69182.17,12699.83
Long Island,Suffolk,5123000,000885,Long Island Community Hospital,70 or Older,117,M,White,Not Span/Hispanic,4,Emergency,Home or Self Care,2020,CIR011,CORONARY ATHEROSCLEROSIS AND OTHER HEART DISEASE,CAR004,PERCUTANEOUS CORONARY INTERVENTIONS (PCI),175,PERCUTANEOUS CARDIAC INTERVENTION W/O AMI,05,DISEASES AND DISORDERS OF THE CIRCULATORY SYSTEM,2,Moderate,Major,Surgical,Medicare,Medicare,Private Health Insurance,,,Y,72879.51,12264.6
Long Island,Suffolk,5123000,000885,Long Island Community Hospital,70 or Older,117,F,White,Not Span/Hispanic,8,Emergency,Home or Self Care,2020,INJ033,"COMPLICATION OF CARDIOVASCULAR DEVICE, IMPLANT OR GRAFT, INITIAL ENCOUNTER",CAR004,PERCUTANEOUS CORONARY INTERVENTIONS (PCI),175,PERCUTANEOUS CARDIAC INTERVENTION W/O AMI,05,DISEASES AND DISORDERS OF THE CIRCULATORY SYSTEM,2,Moderate,Moderate,Surgical,Medicare,,,,,Y,160683.59,25051.97
Long Island,Suffolk,5123000,000885,Long Island Community Hospital,70 or Older,119,F,White,Not Span/Hispanic,1,Emergency,Home or Self Care,2020,CIR011,CORONARY ATHEROSCLEROSIS AND OTHER HEART DISEASE,CAR004,PERCUTANEOUS CORONARY INTERVENTIONS (PCI),175,PERCUTANEOUS CARDIAC INTERVENTION W/O AMI,05,DISEASES AND DISORDERS OF THE CIRCULATORY SYSTEM,2,Moderate,Minor,Surgical,Medicare,Medicare,Blue Cross/Blue Shield,,,Y,70075.96,8971.15
Long Island,Suffolk,5123000,000885,Long Island Community Hospital,50 to 69,117,M,White,Not Span/Hispanic,4,Emergency,Home or Self Care,2020,CIR011,CORONARY ATHEROSCLEROSIS AND OTHER HEART DISEASE,MAM005,MEASUREMENT DURING CARDIAC CATHETERIZATION,175,PERCUTANEOUS CARDIAC INTERVENTION W/O AMI,05,DISEASES AND DISORDERS OF THE CIRCULATORY SYSTEM,1,Minor,Minor,Surgical,Private Health Insurance,Medicaid,,,,Y,94392.96,15486.47
Long Island,Suffolk,5123000,000885,Long Island Community Hospital,50 to 69,119,M,Other Race,Not Span/Hispanic,2,Emergency,Home or Self Care,2020,CIR011,CORONARY ATHEROSCLEROSIS AND OTHER HEART DISEASE,SUD002,PHARMACOTHERAPY FOR SUBSTANCE USE,175,PERCUTANEOUS CARDIAC INTERVENTION W/O AMI,05,DISEASES AND DISORDERS OF THE CIRCULATORY SYSTEM,1,Minor,Minor,Surgical,Medicaid,,,,,Y,82482.92,12408.76
Long Island,Suffolk,5123000,000885,Long Island Community Hospital,50 to 69,117,F,White,Not Span/Hispanic,1,Emergency,Short-term Hospital,2020,INJ033,"COMPLICATION OF CARDIOVASCULAR DEVICE, IMPLANT OR GRAFT, INITIAL ENCOUNTER",ESA009,CARDIAC ASSISTANCE WITH BALLOON PUMP,175,PERCUTANEOUS CARDIAC INTERVENTION W/O AMI,05,DISEASES AND DISORDERS OF THE CIRCULATORY SYSTEM,4,Extreme,Extreme,Surgical,Medicare,,,,,Y,384964.12,50913.35
Long Island,Suffolk,5123000,000885,Long Island Community Hospital,50 to 69,117,M,White,Not Span/Hispanic,4,Emergency,Home or Self Care,2020,CIR011,CORONARY ATHEROSCLEROSIS AND OTHER HEART DISEASE,MAM005,MEASUREMENT DURING CARDIAC CATHETERIZATION,175,PERCUTANEOUS CARDIAC INTERVENTION W/O AMI,05,DISEASES AND DISORDERS OF THE CIRCULATORY SYSTEM,2,Moderate,Moderate,Surgical,Private Health Insurance,Medicaid,,,,Y,94114.8,14947.85
Long Island,Suffolk,5123000,000885,Long Island Community Hospital,70 or Older,117,M,White,Not Span/Hispanic,1,Emergency,Home or Self Care,2020,CIR017,CARDIAC DYSRHYTHMIAS,CAR026,PACEMAKER AND DEFIBRILLATOR PROCEDURES,175,PERCUTANEOUS CARDIAC INTERVENTION W/O AMI,05,DISEASES AND DISORDERS OF THE CIRCULATORY SYSTEM,1,Minor,Minor,Surgical,Medicare,Medicare,Blue Cross/Blue Shield,,,Y,171033.74,23801.39
Long Island,Suffolk,5123000,000885,Long Island Community Hospital,50 to 69,117,M,White,Not Span/Hispanic,2,Emergency,Home or Self Care,2020,CIR011,CORONARY ATHEROSCLEROSIS AND OTHER HEART DISEASE,CAR004,PERCUTANEOUS CORONARY INTERVENTIONS (PCI),175,PERCUTANEOUS CARDIAC INTERVENTION W/O AMI,05,DISEASES AND DISORDERS OF THE CIRCULATORY SYSTEM,1,Minor,Minor,Surgical,Medicare,,,,,Y,79864.22,12165.47
Long Island,Suffolk,5123000,000885,Long Island Community Hospital,50 to 69,119,M,Other Race,Not Span/Hispanic,3,Emergency,Home or Self Care,2020,CIR011,CORONARY ATHEROSCLEROSIS AND OTHER HEART DISEASE,CAR004,PERCUTANEOUS CORONARY INTERVENTIONS (PCI),175,PERCUTANEOUS CARDIAC INTERVENTION W/O AMI,05,DISEASES AND DISORDERS OF THE CIRCULATORY SYSTEM,2,Moderate,Moderate,Surgical,Medicare,,,,,Y,85911.01,13601.79
Long Island,Suffolk,5123000,000885,Long Island Community Hospital,50 to 69,117,F,White,Not Span/Hispanic,6,Emergency,Home or Self Care,2020,CIR011,CORONARY ATHEROSCLEROSIS AND OTHER HEART DISEASE,IMG001,CARDIAC AND CORONARY FLUOROSCOPY,175,PERCUTANEOUS CARDIAC INTERVENTION W/O AMI,05,DISEASES AND DISORDERS OF THE CIRCULATORY SYSTEM,2,Moderate,Major,Surgical,Medicare,Medicare,Medicaid,,,Y,102022.28,15528.57
Long Island,Suffolk,5123000,000885,Long Island Community Hospital,70 or Older,117,M,White,Not Span/Hispanic,5,Emergency,Home or Self Care,2020,CIR019,HEART FAILURE,CAR004,PERCUTANEOUS CORONARY INTERVENTIONS (PCI),175,PERCUTANEOUS CARDIAC INTERVENTION W/O AMI,05,DISEASES AND DISORDERS OF THE CIRCULATORY SYSTEM,3,Major,Major,Surgical,Medicare,Medicare,Blue Cross/Blue Shield,,,Y,99244.58,16389.44
Long Island,Suffolk,5123000,000885,Long Island Community Hospital,50 to 69,119,M,White,Not Span/Hispanic,3,Urgent,Home or Self Care,2020,CIR038,POSTPROCEDURAL OR POSTOPERATIVE CIRCULATORY SYSTEM COMPLICATION,CAR004,PERCUTANEOUS CORONARY INTERVENTIONS (PCI),175,PERCUTANEOUS CARDIAC INTERVENTION W/O AMI,05,DISEASES AND DISORDERS OF THE CIRCULATORY SYSTEM,4,Extreme,Extreme,Surgical,Blue Cross/Blue Shield,,,,,N,120376.19,20331.27
Long Island,Suffolk,5123000,000885,Long Island Community Hospital,50 to 69,117,M,White,Not Span/Hispanic,1,Emergency,Home or Self Care,2020,CIR011,CORONARY ATHEROSCLEROSIS AND OTHER HEART DISEASE,CAR004,PERCUTANEOUS CORONARY INTERVENTIONS (PCI),175,PERCUTANEOUS CARDIAC INTERVENTION W/O AMI,05,DISEASES AND DISORDERS OF THE CIRCULATORY SYSTEM,1,Minor,Minor,Surgical,Medicare,Medicare,,,,Y,119433.95,16182.65
Long Island,Suffolk,5123000,000885,Long Island Community Hospital,50 to 69,119,M,White,Not Span/Hispanic,1,Emergency,Home or Self Care,2020,CIR011,CORONARY ATHEROSCLEROSIS AND OTHER HEART DISEASE,CAR004,PERCUTANEOUS CORONARY INTERVENTIONS (PCI),175,PERCUTANEOUS CARDIAC INTERVENTION W/O AMI,05,DISEASES AND DISORDERS OF THE CIRCULATORY SYSTEM,2,Moderate,Minor,Surgical,Private Health Insurance,,,,,Y,59172.77,8543.11
Long Island,Suffolk,5123000,000885,Long Island Community Hospital,70 or Older,117,M,White,Not Span/Hispanic,1,Emergency,Home or Self Care,2020,CIR011,CORONARY ATHEROSCLEROSIS AND OTHER HEART DISEASE,CAR004,PERCUTANEOUS CORONARY INTERVENTIONS (PCI),175,PERCUTANEOUS CARDIAC INTERVENTION W/O AMI,05,DISEASES AND DISORDERS OF THE CIRCULATORY SYSTEM,3,Major,Moderate,Surgical,Medicare,,,,,Y,97425.05,14685.19
Long Island,Suffolk,5123000,000885,Long Island Community Hospital,50 to 69,119,M,White,Not Span/Hispanic,3,Emergency,Home or Self Care,2020,CIR011,CORONARY ATHEROSCLEROSIS AND OTHER HEART DISEASE,IMG001,CARDIAC AND CORONARY FLUOROSCOPY,175,PERCUTANEOUS CARDIAC INTERVENTION W/O AMI,05,DISEASES AND DISORDERS OF THE CIRCULATORY SYSTEM,2,Moderate,Moderate,Surgical,Private Health Insurance,Medicaid,,,,Y,109973.13,16872.83
Long Island,Suffolk,5123000,000885,Long Island Community Hospital,50 to 69,117,M,White,Not Span/Hispanic,1,Emergency,Short-term Hospital,2020,CIR018,CARDIAC ARREST AND VENTRICULAR FIBRILLATION,CAR004,PERCUTANEOUS CORONARY INTERVENTIONS (PCI),175,PERCUTANEOUS CARDIAC INTERVENTION W/O AMI,05,DISEASES AND DISORDERS OF THE CIRCULATORY SYSTEM,3,Major,Major,Surgical,Medicare,Medicare,Private Health Insurance,,,Y,49641.73,7503.78
Long Island,Suffolk,5123000,000885,Long Island Community Hospital,70 or Older,117,M,White,Not Span/Hispanic,7,Emergency,Skilled Nursing Home,2020,CIR019,HEART FAILURE,CAR004,PERCUTANEOUS CORONARY INTERVENTIONS (PCI),175,PERCUTANEOUS CARDIAC INTERVENTION W/O AMI,05,DISEASES AND DISORDERS OF THE CIRCULATORY SYSTEM,3,Major,Extreme,Surgical,Medicare,Medicare,Private Health Insurance,,,Y,116647.29,24968.71
Long Island,Suffolk,5123000,000885,Long Island Community Hospital,70 or Older,117,F,White,Not Span/Hispanic,8,Emergency,Home w/ Home Health Services,2020,CIR038,POSTPROCEDURAL OR POSTOPERATIVE CIRCULATORY SYSTEM COMPLICATION,CAR004,PERCUTANEOUS CORONARY INTERVENTIONS (PCI),175,PERCUTANEOUS CARDIAC INTERVENTION W/O AMI,05,DISEASES AND DISORDERS OF THE CIRCULATORY SYSTEM,4,Extreme,Extreme,Surgical,Medicare,Medicare,Private Health Insurance,,,Y,99181.02,18864.09
Long Island,Suffolk,5123000,000885,Long Island Community Hospital,70 or Older,117,F,White,Not Span/Hispanic,3,Emergency,Home or Self Care,2020,INJ033,"COMPLICATION OF CARDIOVASCULAR DEVICE, IMPLANT OR GRAFT, INITIAL ENCOUNTER",CAR004,PERCUTANEOUS CORONARY INTERVENTIONS (PCI),175,PERCUTANEOUS CARDIAC INTERVENTION W/O AMI,05,DISEASES AND DISORDERS OF THE CIRCULATORY SYSTEM,3,Major,Major,Surgical,Medicare,Medicare,Private Health Insurance,,,Y,78823.87,12973.63
