Hospital Service Area,Hospital County,Operating Certificate Number,Permanent Facility Id,Facility Name,Age Group,Zip Code - 3 digits,Gender,Race,Ethnicity,Length of Stay,Type of Admission,Patient Disposition,Discharge Year,CCS Diagnosis Code,CCS Diagnosis Description,CCS Procedure Code,CCS Procedure Description,APR DRG Code,APR DRG Description,APR MDC Code,APR MDC Description,APR Severity of Illness Code,APR Severity of Illness Description,APR Risk of Mortality,APR Medical Surgical Description,Payment Typology 1,Payment Typology 2,Payment Typology 3,Birth Weight,Abortion Edit Indicator,Emergency Department Indicator,Total Charges,Total Costs
New York City,Richmond,7004003,001740,Staten Island University Hosp-North,50 to 69,103,M,White,Not Span/Hispanic,17,Emergency,Skilled Nursing Home,2018,CIR019,HEART FAILURE,CAR026,PACEMAKER AND DEFIBRILLATOR PROCEDURES,176,CARDIAC PACEMAKER & DEFIBRILLATOR DEVICE REPLACEMENT,05,DISEASES AND DISORDERS OF THE CIRCULATORY SYSTEM,3,Major,Major,Surgical,Medicare,,,,,true,268037.2,74107.34
Long Island,Suffolk,5153000,000913,Huntington Hospital,70 or Older,117,M,White,Not Span/Hispanic,6,Emergency,Home or Self Care,2018,CIR016,CONDUCTION DISORDERS,CAR026,PACEMAKER AND DEFIBRILLATOR PROCEDURES,176,CARDIAC PACEMAKER & DEFIBRILLATOR DEVICE REPLACEMENT,05,DISEASES AND DISORDERS OF THE CIRCULATORY SYSTEM,3,Major,Major,Surgical,Medicare,Private Health Insurance,,,,true,142859.23,43263.77
Long Island,Nassau,2951001,000541,North Shore University Hospital,70 or Older,113,F,Other Race,Not Span/Hispanic,11,Emergency,Skilled Nursing Home,2018,CIR019,HEART FAILURE,CAR026,PACEMAKER AND DEFIBRILLATOR PROCEDURES,176,CARDIAC PACEMAKER & DEFIBRILLATOR DEVICE REPLACEMENT,05,DISEASES AND DISORDERS OF THE CIRCULATORY SYSTEM,3,Major,Major,Surgical,Medicare,,,,,true,203947.67,41049.78
Finger Lakes,Monroe,2701005,000413,Strong Memorial Hospital,70 or Older,145,F,White,Not Span/Hispanic,1,Elective,Home or Self Care,2018,CIR019,HEART FAILURE,CAR026,PACEMAKER AND DEFIBRILLATOR PROCEDURES,176,CARDIAC PACEMAKER & DEFIBRILLATOR DEVICE REPLACEMENT,05,DISEASES AND DISORDERS OF THE CIRCULATORY SYSTEM,3,Major,Moderate,Surgical,Medicare,Medicare,Self-Pay,,,false,15425.2,7922.45
New York City,Kings,7001020,001305,Maimonides Medical Center,70 or Older,112,M,White,Not Span/Hispanic,1,Urgent,Home or Self Care,2018,FAC009,"IMPLANT, DEVICE OR GRAFT RELATED ENCOUNTER",CAR026,PACEMAKER AND DEFIBRILLATOR PROCEDURES,176,CARDIAC PACEMAKER & DEFIBRILLATOR DEVICE REPLACEMENT,05,DISEASES AND DISORDERS OF THE CIRCULATORY SYSTEM,3,Major,Moderate,Surgical,Medicare,Medicaid,Self-Pay,,,false,126639,25419.43
Long Island,Nassau,2951001,000541,North Shore University Hospital,70 or Older,110,M,White,Not Span/Hispanic,2,Emergency,Skilled Nursing Home,2018,INJ033,"COMPLICATION OF CARDIOVASCULAR DEVICE, IMPLANT OR GRAFT, INITIAL ENCOUNTER",CAR026,PACEMAKER AND DEFIBRILLATOR PROCEDURES,176,CARDIAC PACEMAKER & DEFIBRILLATOR DEVICE REPLACEMENT,05,DISEASES AND DISORDERS OF THE CIRCULATORY SYSTEM,3,Major,Major,Surgical,Medicare,Medicare,Medicaid,,,true,40758.46,6499.89
Capital/Adirond,Albany,0101000,000001,Albany Medical Center Hospital,30 to 49,121,F,White,Not Span/Hispanic,5,Emergency,Home or Self Care,2018,INJ033,"COMPLICATION OF CARDIOVASCULAR DEVICE, IMPLANT OR GRAFT, INITIAL ENCOUNTER",CAR026,PACEMAKER AND DEFIBRILLATOR PROCEDURES,176,CARDIAC PACEMAKER & DEFIBRILLATOR DEVICE REPLACEMENT,05,DISEASES AND DISORDERS OF THE CIRCULATORY SYSTEM,3,Major,Major,Surgical,Medicare,Medicaid,,,,true,96263.1,43133.29
New York City,Manhattan,7002017,001450,Lenox Hill Hospital,70 or Older,100,M,White,Not Span/Hispanic,6,Emergency,Home or Self Care,2018,CIR017,CARDIAC DYSRHYTHMIAS,CAR026,PACEMAKER AND DEFIBRILLATOR PROCEDURES,176,CARDIAC PACEMAKER & DEFIBRILLATOR DEVICE REPLACEMENT,05,DISEASES AND DISORDERS OF THE CIRCULATORY SYSTEM,3,Major,Major,Surgical,Medicare,Medicaid,,,,true,228118.16,66405.49
New York City,Kings,7001008,001293,"New York Community Hospital of Brooklyn, Inc",70 or Older,112,F,White,Not Span/Hispanic,2,Emergency,Home w/ Home Health Services,2018,INJ033,"COMPLICATION OF CARDIOVASCULAR DEVICE, IMPLANT OR GRAFT, INITIAL ENCOUNTER",CAR026,PACEMAKER AND DEFIBRILLATOR PROCEDURES,176,CARDIAC PACEMAKER & DEFIBRILLATOR DEVICE REPLACEMENT,05,DISEASES AND DISORDERS OF THE CIRCULATORY SYSTEM,2,Moderate,Moderate,Surgical,Medicare,Medicaid,Self-Pay,,,true,20003.58,11591.06
New York City,Bronx,7000006,001169,Montefiore Medical Center - Henry & Lucy Moses Div,30 to 49,104,F,Other Race,Spanish/Hispanic,7,Emergency,Home w/ Home Health Services,2018,CIR019,HEART FAILURE,CAR026,PACEMAKER AND DEFIBRILLATOR PROCEDURES,176,CARDIAC PACEMAKER & DEFIBRILLATOR DEVICE REPLACEMENT,05,DISEASES AND DISORDERS OF THE CIRCULATORY SYSTEM,3,Major,Moderate,Surgical,Medicaid,,,,,false,179762.79,45472.14
New York City,Queens,7003004,001630,Long Island Jewish Medical Center,70 or Older,110,M,Other Race,Not Span/Hispanic,1,Urgent,Home or Self Care,2018,CIR016,CONDUCTION DISORDERS,CAR026,PACEMAKER AND DEFIBRILLATOR PROCEDURES,176,CARDIAC PACEMAKER & DEFIBRILLATOR DEVICE REPLACEMENT,05,DISEASES AND DISORDERS OF THE CIRCULATORY SYSTEM,1,Minor,Minor,Surgical,Blue Cross/Blue Shield,Self-Pay,,,,false,56804,13170.55
Long Island,Suffolk,5157003,000943,St Catherine of Siena Hospital,50 to 69,117,F,White,Not Span/Hispanic,4,Emergency,Home or Self Care,2018,CIR017,CARDIAC DYSRHYTHMIAS,MAM005,MEASUREMENT DURING CARDIAC CATHETERIZATION,176,CARDIAC PACEMAKER & DEFIBRILLATOR DEVICE REPLACEMENT,05,DISEASES AND DISORDERS OF THE CIRCULATORY SYSTEM,3,Major,Moderate,Surgical,Private Health Insurance,,,,,true,297755.24,51590.79
Long Island,Suffolk,5151001,000245,Stony Brook University Hospital,70 or Older,117,M,White,Not Span/Hispanic,6,Emergency,Skilled Nursing Home,2018,CIR016,CONDUCTION DISORDERS,CAR026,PACEMAKER AND DEFIBRILLATOR PROCEDURES,176,CARDIAC PACEMAKER & DEFIBRILLATOR DEVICE REPLACEMENT,05,DISEASES AND DISORDERS OF THE CIRCULATORY SYSTEM,3,Major,Major,Surgical,Medicare,Self-Pay,,,,true,183786.2,80548.63
New York City,Manhattan,7002001,001438,Bellevue Hospital Center,50 to 69,112,M,Black/African American,Not Span/Hispanic,3,Emergency,Home or Self Care,2018,CIR016,CONDUCTION DISORDERS,CAR026,PACEMAKER AND DEFIBRILLATOR PROCEDURES,176,CARDIAC PACEMAKER & DEFIBRILLATOR DEVICE REPLACEMENT,05,DISEASES AND DISORDERS OF THE CIRCULATORY SYSTEM,3,Major,Moderate,Surgical,Private Health Insurance,,,,,true,22424.82,14903.54
New York City,Bronx,7000006,001169,Montefiore Medical Center - Henry & Lucy Moses Div,70 or Older,104,F,Other Race,Spanish/Hispanic,1,Emergency,Home or Self Care,2018,CIR019,HEART FAILURE,CAR026,PACEMAKER AND DEFIBRILLATOR PROCEDURES,176,CARDIAC PACEMAKER & DEFIBRILLATOR DEVICE REPLACEMENT,05,DISEASES AND DISORDERS OF THE CIRCULATORY SYSTEM,3,Major,Major,Surgical,Medicare,,,,,false,125601.62,45064.51
Long Island,Nassau,2951001,000541,North Shore University Hospital,70 or Older,114,F,Black/African American,Not Span/Hispanic,3,Emergency,Home or Self Care,2018,CIR019,HEART FAILURE,CAR026,PACEMAKER AND DEFIBRILLATOR PROCEDURES,176,CARDIAC PACEMAKER & DEFIBRILLATOR DEVICE REPLACEMENT,05,DISEASES AND DISORDERS OF THE CIRCULATORY SYSTEM,3,Major,Moderate,Surgical,Medicare,Medicare,,,,true,33901.5,5667.08
New York City,Manhattan,7002054,001458,New York-Presbyterian Hospital - New York Weill Cornell Center,70 or Older,100,F,Other Race,Spanish/Hispanic,6,Emergency,Home w/ Home Health Services,2018,INJ033,"COMPLICATION OF CARDIOVASCULAR DEVICE, IMPLANT OR GRAFT, INITIAL ENCOUNTER",CAR026,PACEMAKER AND DEFIBRILLATOR PROCEDURES,176,CARDIAC PACEMAKER & DEFIBRILLATOR DEVICE REPLACEMENT,05,DISEASES AND DISORDERS OF THE CIRCULATORY SYSTEM,3,Major,Major,Surgical,Medicare,Medicaid,Self-Pay,,,false,148527.58,67187.05
New York City,Manhattan,7002054,001464,New York-Presbyterian Hospital - Columbia Presbyterian Center,50 to 69,103,M,Black/African American,Not Span/Hispanic,10,Elective,Skilled Nursing Home,2018,GEN003,CHRONIC KIDNEY DISEASE,CAR026,PACEMAKER AND DEFIBRILLATOR PROCEDURES,176,CARDIAC PACEMAKER & DEFIBRILLATOR DEVICE REPLACEMENT,05,DISEASES AND DISORDERS OF THE CIRCULATORY SYSTEM,3,Major,Moderate,Surgical,Medicare,Blue Cross/Blue Shield,Self-Pay,,,false,206314.41,65431.4
New York City,Queens,7003010,001637,New York - Presbyterian/Queens,70 or Older,113,M,White,Not Span/Hispanic,10,Emergency,Home w/ Home Health Services,2018,CIR019,HEART FAILURE,CAR026,PACEMAKER AND DEFIBRILLATOR PROCEDURES,176,CARDIAC PACEMAKER & DEFIBRILLATOR DEVICE REPLACEMENT,05,DISEASES AND DISORDERS OF THE CIRCULATORY SYSTEM,4,Extreme,Extreme,Surgical,Medicare,Medicaid,Self-Pay,,,true,99801.43,36435.94
New York City,Manhattan,7002001,001438,Bellevue Hospital Center,50 to 69,112,F,Other Race,Spanish/Hispanic,2,Emergency,Home or Self Care,2018,CIR016,CONDUCTION DISORDERS,CAR026,PACEMAKER AND DEFIBRILLATOR PROCEDURES,176,CARDIAC PACEMAKER & DEFIBRILLATOR DEVICE REPLACEMENT,05,DISEASES AND DISORDERS OF THE CIRCULATORY SYSTEM,2,Moderate,Moderate,Surgical,Medicare,Medicare,Medicaid,,,false,18794.61,12490.9
New York City,Manhattan,7002032,001469,Mount Sinai Morningside,70 or Older,100,F,Black/African American,Unknown,6,Emergency,Home w/ Home Health Services,2018,CIR019,HEART FAILURE,CAR026,PACEMAKER AND DEFIBRILLATOR PROCEDURES,176,CARDIAC PACEMAKER & DEFIBRILLATOR DEVICE REPLACEMENT,05,DISEASES AND DISORDERS OF THE CIRCULATORY SYSTEM,3,Major,Major,Surgical,Medicare,Medicare,Self-Pay,,,true,132683.95,39319.55
Hudson Valley,Westchester,5902001,001045,White Plains Hospital Center,70 or Older,106,M,Other Race,Not Span/Hispanic,1,Emergency,Home w/ Home Health Services,2018,INJ033,"COMPLICATION OF CARDIOVASCULAR DEVICE, IMPLANT OR GRAFT, INITIAL ENCOUNTER",CAR026,PACEMAKER AND DEFIBRILLATOR PROCEDURES,176,CARDIAC PACEMAKER & DEFIBRILLATOR DEVICE REPLACEMENT,05,DISEASES AND DISORDERS OF THE CIRCULATORY SYSTEM,3,Major,Major,Surgical,Medicare,Private Health Insurance,,,,true,51314,11455.41
New York City,Kings,7001008,001293,"New York Community Hospital of Brooklyn, Inc",70 or Older,112,M,White,Not Span/Hispanic,2,Emergency,Skilled Nursing Home,2018,CIR019,HEART FAILURE,CAR026,PACEMAKER AND DEFIBRILLATOR PROCEDURES,176,CARDIAC PACEMAKER & DEFIBRILLATOR DEVICE REPLACEMENT,05,DISEASES AND DISORDERS OF THE CIRCULATORY SYSTEM,3,Major,Major,Surgical,Medicare,Medicare,Medicaid,,,true,36739.1,18473.06
New York City,Kings,7001008,001293,"New York Community Hospital of Brooklyn, Inc",70 or Older,112,M,White,Not Span/Hispanic,3,Emergency,Skilled Nursing Home,2018,INJ033,"COMPLICATION OF CARDIOVASCULAR DEVICE, IMPLANT OR GRAFT, INITIAL ENCOUNTER",CAR026,PACEMAKER AND DEFIBRILLATOR PROCEDURES,176,CARDIAC PACEMAKER & DEFIBRILLATOR DEVICE REPLACEMENT,05,DISEASES AND DISORDERS OF THE CIRCULATORY SYSTEM,2,Moderate,Moderate,Surgical,Medicare,Medicaid,Self-Pay,,,true,27545.17,15651.73
Long Island,Nassau,2951001,000541,North Shore University Hospital,18 to 29,113,M,Other Race,Not Span/Hispanic,15,Urgent,Home or Self Care,2018,INJ033,"COMPLICATION OF CARDIOVASCULAR DEVICE, IMPLANT OR GRAFT, INITIAL ENCOUNTER",CAR026,PACEMAKER AND DEFIBRILLATOR PROCEDURES,176,CARDIAC PACEMAKER & DEFIBRILLATOR DEVICE REPLACEMENT,05,DISEASES AND DISORDERS OF THE CIRCULATORY SYSTEM,4,Extreme,Extreme,Surgical,Private Health Insurance,,,,,false,407752.51,97593.13
New York City,Queens,7003004,001630,Long Island Jewish Medical Center,50 to 69,114,F,Other Race,Not Span/Hispanic,2,Emergency,Home or Self Care,2018,CIR016,CONDUCTION DISORDERS,CAR026,PACEMAKER AND DEFIBRILLATOR PROCEDURES,176,CARDIAC PACEMAKER & DEFIBRILLATOR DEVICE REPLACEMENT,05,DISEASES AND DISORDERS OF THE CIRCULATORY SYSTEM,1,Minor,Minor,Surgical,Medicaid,Self-Pay,,,,false,132126.21,45629.28
Long Island,Suffolk,5151001,000245,Stony Brook University Hospital,70 or Older,119,M,Black/African American,Not Span/Hispanic,3,Emergency,Skilled Nursing Home,2018,CIR016,CONDUCTION DISORDERS,CAR026,PACEMAKER AND DEFIBRILLATOR PROCEDURES,176,CARDIAC PACEMAKER & DEFIBRILLATOR DEVICE REPLACEMENT,05,DISEASES AND DISORDERS OF THE CIRCULATORY SYSTEM,3,Major,Major,Surgical,Medicare,Private Health Insurance,,,,true,130036.87,64887.8
Long Island,Nassau,2951001,000541,North Shore University Hospital,70 or Older,113,F,White,Not Span/Hispanic,1,Urgent,Home or Self Care,2018,CIR016,CONDUCTION DISORDERS,CAR026,PACEMAKER AND DEFIBRILLATOR PROCEDURES,176,CARDIAC PACEMAKER & DEFIBRILLATOR DEVICE REPLACEMENT,05,DISEASES AND DISORDERS OF THE CIRCULATORY SYSTEM,1,Minor,Minor,Surgical,Medicaid,,,,,false,42627.02,9978.67
Hudson Valley,Westchester,5957001,001139,Westchester Medical Center,50 to 69,109,M,Black/African American,Not Span/Hispanic,8,Urgent,Court/Law Enforcement,2018,CIR019,HEART FAILURE,CAR026,PACEMAKER AND DEFIBRILLATOR PROCEDURES,176,CARDIAC PACEMAKER & DEFIBRILLATOR DEVICE REPLACEMENT,05,DISEASES AND DISORDERS OF THE CIRCULATORY SYSTEM,4,Extreme,Extreme,Surgical,Department of Corrections,,,,,false,272495,85676.78
Finger Lakes,Monroe,2701001,000409,Highland Hospital,70 or Older,146,F,White,Not Span/Hispanic,6,Emergency,Home w/ Home Health Services,2018,SYM012,CIRCULATORY SIGNS AND SYMPTOMS,CAR026,PACEMAKER AND DEFIBRILLATOR PROCEDURES,176,CARDIAC PACEMAKER & DEFIBRILLATOR DEVICE REPLACEMENT,05,DISEASES AND DISORDERS OF THE CIRCULATORY SYSTEM,3,Major,Major,Surgical,Medicare,,,,,true,25999.71,9771.31
Long Island,Suffolk,5157003,000943,St Catherine of Siena Hospital,70 or Older,117,M,White,Not Span/Hispanic,5,Emergency,Home or Self Care,2018,CIR019,HEART FAILURE,CAR026,PACEMAKER AND DEFIBRILLATOR PROCEDURES,176,CARDIAC PACEMAKER & DEFIBRILLATOR DEVICE REPLACEMENT,05,DISEASES AND DISORDERS OF THE CIRCULATORY SYSTEM,3,Major,Major,Surgical,Medicare,Private Health Insurance,,,,true,154166.73,28325.14
Long Island,Nassau,2951001,000541,North Shore University Hospital,70 or Older,115,F,Black/African American,Not Span/Hispanic,3,Urgent,Home w/ Home Health Services,2018,CIR016,CONDUCTION DISORDERS,CAR026,PACEMAKER AND DEFIBRILLATOR PROCEDURES,176,CARDIAC PACEMAKER & DEFIBRILLATOR DEVICE REPLACEMENT,05,DISEASES AND DISORDERS OF THE CIRCULATORY SYSTEM,2,Moderate,Moderate,Surgical,Medicare,Medicare,Medicaid,,,false,77241.13,15335.04
New York City,Kings,7001020,001305,Maimonides Medical Center,30 to 49,112,F,Black/African American,Unknown,3,Emergency,Home or Self Care,2018,INJ033,"COMPLICATION OF CARDIOVASCULAR DEVICE, IMPLANT OR GRAFT, INITIAL ENCOUNTER",CAR026,PACEMAKER AND DEFIBRILLATOR PROCEDURES,176,CARDIAC PACEMAKER & DEFIBRILLATOR DEVICE REPLACEMENT,05,DISEASES AND DISORDERS OF THE CIRCULATORY SYSTEM,2,Moderate,Minor,Surgical,Medicare,Medicare,Self-Pay,,,false,151713,31910.51
Long Island,Suffolk,5151001,000245,Stony Brook University Hospital,70 or Older,117,F,White,Not Span/Hispanic,5,Emergency,Home w/ Home Health Services,2018,CIR016,CONDUCTION DISORDERS,CAR026,PACEMAKER AND DEFIBRILLATOR PROCEDURES,176,CARDIAC PACEMAKER & DEFIBRILLATOR DEVICE REPLACEMENT,05,DISEASES AND DISORDERS OF THE CIRCULATORY SYSTEM,3,Major,Major,Surgical,Medicare,Blue Cross/Blue Shield,,,,true,97289.46,38595.75
Long Island,Nassau,2953000,000563,St. Francis Hospital & Heart Center,70 or Older,113,M,White,Not Span/Hispanic,1,Elective,Home or Self Care,2018,INJ033,"COMPLICATION OF CARDIOVASCULAR DEVICE, IMPLANT OR GRAFT, INITIAL ENCOUNTER",CAR026,PACEMAKER AND DEFIBRILLATOR PROCEDURES,176,CARDIAC PACEMAKER & DEFIBRILLATOR DEVICE REPLACEMENT,05,DISEASES AND DISORDERS OF THE CIRCULATORY SYSTEM,3,Major,Moderate,Surgical,Medicare,Medicare,Blue Cross/Blue Shield,,,false,146301.43,21661.46
Central NY,Tompkins,5401001,000977,Cayuga Medical Center at Ithaca,70 or Older,148,M,Other Race,Not Span/Hispanic,3,Elective,Home or Self Care,2018,INJ033,"COMPLICATION OF CARDIOVASCULAR DEVICE, IMPLANT OR GRAFT, INITIAL ENCOUNTER",CAR026,PACEMAKER AND DEFIBRILLATOR PROCEDURES,176,CARDIAC PACEMAKER & DEFIBRILLATOR DEVICE REPLACEMENT,05,DISEASES AND DISORDERS OF THE CIRCULATORY SYSTEM,3,Major,Major,Surgical,Medicare,Self-Pay,Self-Pay,,,false,23076.32,10530.18
Southern Tier,Broome,0303001,000058,United Health Services Hospitals Inc. - Wilson Medical Center,70 or Older,137,M,White,Not Span/Hispanic,1,Emergency,Home or Self Care,2018,CIR016,CONDUCTION DISORDERS,CAR026,PACEMAKER AND DEFIBRILLATOR PROCEDURES,176,CARDIAC PACEMAKER & DEFIBRILLATOR DEVICE REPLACEMENT,05,DISEASES AND DISORDERS OF THE CIRCULATORY SYSTEM,1,Minor,Minor,Surgical,Medicare,Medicare,,,,true,46626,19389.12
Central NY,Tompkins,5401001,000977,Cayuga Medical Center at Ithaca,70 or Older,148,F,White,Not Span/Hispanic,9,Emergency,Facility w/ Custodial/Supportive Care,2018,CIR011,CORONARY ATHEROSCLEROSIS AND OTHER HEART DISEASE,CAR026,PACEMAKER AND DEFIBRILLATOR PROCEDURES,176,CARDIAC PACEMAKER & DEFIBRILLATOR DEVICE REPLACEMENT,05,DISEASES AND DISORDERS OF THE CIRCULATORY SYSTEM,3,Major,Major,Surgical,Blue Cross/Blue Shield,Self-Pay,Self-Pay,,,true,94151.34,41620.65
New York City,Kings,7001021,001306,New York - Presbyterian Brooklyn Methodist Hospital,50 to 69,114,M,Black/African American,Not Span/Hispanic,2,Emergency,Home or Self Care,2018,FAC009,"IMPLANT, DEVICE OR GRAFT RELATED ENCOUNTER",CAR026,PACEMAKER AND DEFIBRILLATOR PROCEDURES,176,CARDIAC PACEMAKER & DEFIBRILLATOR DEVICE REPLACEMENT,05,DISEASES AND DISORDERS OF THE CIRCULATORY SYSTEM,3,Major,Moderate,Surgical,Medicaid,Self-Pay,,,,true,75956.56,32954.81
New York City,Bronx,7000006,001169,Montefiore Medical Center - Henry & Lucy Moses Div,50 to 69,104,M,Black/African American,Not Span/Hispanic,1,Emergency,Home or Self Care,2018,FAC009,"IMPLANT, DEVICE OR GRAFT RELATED ENCOUNTER",CAR026,PACEMAKER AND DEFIBRILLATOR PROCEDURES,176,CARDIAC PACEMAKER & DEFIBRILLATOR DEVICE REPLACEMENT,05,DISEASES AND DISORDERS OF THE CIRCULATORY SYSTEM,3,Major,Major,Surgical,Medicare,Private Health Insurance,,,,false,103880.25,30606.47
Long Island,Nassau,2909000,000513,Mercy Hospital,50 to 69,115,M,White,Not Span/Hispanic,9,Emergency,Skilled Nursing Home,2018,CIR019,HEART FAILURE,CAR026,PACEMAKER AND DEFIBRILLATOR PROCEDURES,176,CARDIAC PACEMAKER & DEFIBRILLATOR DEVICE REPLACEMENT,05,DISEASES AND DISORDERS OF THE CIRCULATORY SYSTEM,3,Major,Major,Surgical,Medicaid,Blue Cross/Blue Shield,Medicaid,,,true,241065.2,47840.81
Western NY,Erie,1401014,000207,Buffalo General Medical Center,70 or Older,142,M,White,Not Span/Hispanic,27,Emergency,Home w/ Home Health Services,2018,CIR019,HEART FAILURE,CAR026,PACEMAKER AND DEFIBRILLATOR PROCEDURES,176,CARDIAC PACEMAKER & DEFIBRILLATOR DEVICE REPLACEMENT,05,DISEASES AND DISORDERS OF THE CIRCULATORY SYSTEM,3,Major,Major,Surgical,Medicare,Self-Pay,,,,true,124783.49,57060.04
Long Island,Nassau,2950001,000527,Mount Sinai South Nassau,70 or Older,116,M,White,Not Span/Hispanic,2,Emergency,Home w/ Home Health Services,2018,CIR019,HEART FAILURE,CAR026,PACEMAKER AND DEFIBRILLATOR PROCEDURES,176,CARDIAC PACEMAKER & DEFIBRILLATOR DEVICE REPLACEMENT,05,DISEASES AND DISORDERS OF THE CIRCULATORY SYSTEM,3,Major,Major,Surgical,Medicare,Medicare,,,,true,75463.82,15611.95
New York City,Queens,7003010,001637,New York - Presbyterian/Queens,50 to 69,114,M,Other Race,Not Span/Hispanic,2,Emergency,Home or Self Care,2018,INJ033,"COMPLICATION OF CARDIOVASCULAR DEVICE, IMPLANT OR GRAFT, INITIAL ENCOUNTER",CAR026,PACEMAKER AND DEFIBRILLATOR PROCEDURES,176,CARDIAC PACEMAKER & DEFIBRILLATOR DEVICE REPLACEMENT,05,DISEASES AND DISORDERS OF THE CIRCULATORY SYSTEM,2,Moderate,Moderate,Surgical,Private Health Insurance,Self-Pay,,,,true,49975.2,22426.52
New York City,Manhattan,7002054,001458,New York-Presbyterian Hospital - New York Weill Cornell Center,70 or Older,112,M,White,Not Span/Hispanic,1,Emergency,Home or Self Care,2018,CIR019,HEART FAILURE,CAR026,PACEMAKER AND DEFIBRILLATOR PROCEDURES,176,CARDIAC PACEMAKER & DEFIBRILLATOR DEVICE REPLACEMENT,05,DISEASES AND DISORDERS OF THE CIRCULATORY SYSTEM,3,Major,Minor,Surgical,Medicare,Medicare,Self-Pay,,,false,71710.24,28680.84
Long Island,Nassau,2951001,000541,North Shore University Hospital,70 or Older,115,F,Black/African American,Not Span/Hispanic,28,Urgent,Inpatient Rehabilitation Facility,2018,INJ033,"COMPLICATION OF CARDIOVASCULAR DEVICE, IMPLANT OR GRAFT, INITIAL ENCOUNTER",CAR026,PACEMAKER AND DEFIBRILLATOR PROCEDURES,176,CARDIAC PACEMAKER & DEFIBRILLATOR DEVICE REPLACEMENT,05,DISEASES AND DISORDERS OF THE CIRCULATORY SYSTEM,4,Extreme,Major,Surgical,Medicare,,,,,false,476875.36,96250.2
Long Island,Nassau,2951001,000541,North Shore University Hospital,70 or Older,114,F,Other Race,Spanish/Hispanic,1,Elective,Home or Self Care,2018,CIR019,HEART FAILURE,CAR026,PACEMAKER AND DEFIBRILLATOR PROCEDURES,176,CARDIAC PACEMAKER & DEFIBRILLATOR DEVICE REPLACEMENT,05,DISEASES AND DISORDERS OF THE CIRCULATORY SYSTEM,3,Major,Moderate,Surgical,Medicaid,Medicaid,,,,false,119723.35,33447.52
New York City,Manhattan,7002002,001439,Mount Sinai Beth Israel,50 to 69,100,M,Other Race,Spanish/Hispanic,3,Emergency,Home or Self Care,2018,INJ030,DRUG INDUCED OR TOXIC RELATED CONDITION,CAR026,PACEMAKER AND DEFIBRILLATOR PROCEDURES,176,CARDIAC PACEMAKER & DEFIBRILLATOR DEVICE REPLACEMENT,05,DISEASES AND DISORDERS OF THE CIRCULATORY SYSTEM,3,Major,Major,Surgical,Medicare,Miscellaneous/Other,Medicaid,,,false,30608.36,5994.34
Long Island,Nassau,2908000,000511,NYU Langone Hospital-Long Island,70 or Older,115,M,White,Not Span/Hispanic,4,Emergency,Home w/ Home Health Services,2018,RSP011,"PLEURISY, PLEURAL EFFUSION AND PULMONARY COLLAPSE",RES002,"LUNG, PLEURA, OR DIAPHRAGM BIOPSY (NON-ENDOSCOPIC)",176,CARDIAC PACEMAKER & DEFIBRILLATOR DEVICE REPLACEMENT,05,DISEASES AND DISORDERS OF THE CIRCULATORY SYSTEM,3,Major,Major,Surgical,Medicare,Medicare,Private Health Insurance,,,true,275506.05,45088
New York City,Queens,7003004,001630,Long Island Jewish Medical Center,70 or Older,114,M,Other Race,Not Span/Hispanic,4,Emergency,Home w/ Home Health Services,2018,CIR016,CONDUCTION DISORDERS,CAR026,PACEMAKER AND DEFIBRILLATOR PROCEDURES,176,CARDIAC PACEMAKER & DEFIBRILLATOR DEVICE REPLACEMENT,05,DISEASES AND DISORDERS OF THE CIRCULATORY SYSTEM,3,Major,Major,Surgical,Medicare,Medicaid,Self-Pay,,,false,92134.19,57115.48
Long Island,Nassau,2951001,000541,North Shore University Hospital,50 to 69,114,M,White,Spanish/Hispanic,2,Emergency,Home or Self Care,2018,INJ033,"COMPLICATION OF CARDIOVASCULAR DEVICE, IMPLANT OR GRAFT, INITIAL ENCOUNTER",CAR026,PACEMAKER AND DEFIBRILLATOR PROCEDURES,176,CARDIAC PACEMAKER & DEFIBRILLATOR DEVICE REPLACEMENT,05,DISEASES AND DISORDERS OF THE CIRCULATORY SYSTEM,3,Major,Moderate,Surgical,Medicaid,Medicaid,,,,true,111662.94,29108.98
New York City,Manhattan,7002002,001439,Mount Sinai Beth Israel,50 to 69,112,F,White,Unknown,5,Urgent,Skilled Nursing Home,2018,CIR019,HEART FAILURE,CAR026,PACEMAKER AND DEFIBRILLATOR PROCEDURES,176,CARDIAC PACEMAKER & DEFIBRILLATOR DEVICE REPLACEMENT,05,DISEASES AND DISORDERS OF THE CIRCULATORY SYSTEM,3,Major,Moderate,Surgical,Medicare,Miscellaneous/Other,Medicaid,,,false,54881.08,11175.8
New York City,Bronx,7000006,001169,Montefiore Medical Center - Henry & Lucy Moses Div,50 to 69,107,M,White,Not Span/Hispanic,2,Emergency,Home or Self Care,2018,CIR019,HEART FAILURE,CAR026,PACEMAKER AND DEFIBRILLATOR PROCEDURES,176,CARDIAC PACEMAKER & DEFIBRILLATOR DEVICE REPLACEMENT,05,DISEASES AND DISORDERS OF THE CIRCULATORY SYSTEM,3,Major,Minor,Surgical,Medicare,Medicaid,,,,false,136966.64,44991.4
Long Island,Suffolk,5151001,000245,Stony Brook University Hospital,70 or Older,117,M,White,Not Span/Hispanic,5,Emergency,Home w/ Home Health Services,2018,CIR016,CONDUCTION DISORDERS,CAR026,PACEMAKER AND DEFIBRILLATOR PROCEDURES,176,CARDIAC PACEMAKER & DEFIBRILLATOR DEVICE REPLACEMENT,05,DISEASES AND DISORDERS OF THE CIRCULATORY SYSTEM,4,Extreme,Extreme,Surgical,Medicare,Medicare,,,,true,232981.64,111248.78