Hospital Service Area,Hospital County,Operating Certificate Number,Permanent Facility Id,Facility Name,Age Group,Zip Code - 3 digits,Gender,Race,Ethnicity,Length of Stay,Type of Admission,Patient Disposition,Discharge Year,CCS Diagnosis Code,CCS Diagnosis Description,CCS Procedure Code,CCS Procedure Description,APR DRG Code,APR DRG Description,APR MDC Code,APR MDC Description,APR Severity of Illness Code,APR Severity of Illness Description,APR Risk of Mortality,APR Medical Surgical Description,Payment Typology 1,Payment Typology 2,Payment Typology 3,Birth Weight,Abortion Edit Indicator,Emergency Department Indicator,Total Charges,Total Costs
New York City,Manhattan,7002053,001463,NYU Langone Hospitals,50 to 69,OOS,M,White,Not Span/Hispanic,5,Emergency,Home or Self Care,2019,INJ033,"COMPLICATION OF CARDIOVASCULAR DEVICE, IMPLANT OR GRAFT, INITIAL ENCOUNTER",CAR026,PACEMAKER AND DEFIBRILLATOR PROCEDURES,176,CARDIAC PACEMAKER & DEFIBRILLATOR DEVICE REPLACEMENT,05,DISEASES AND DISORDERS OF THE CIRCULATORY SYSTEM,3,Major,Moderate,Surgical,Medicare,Medicare,,,,true,294630.77,54420.1
New York City,Manhattan,7002053,001463,NYU Langone Hospitals,30 to 49,114,M,Black/African American,Not Span/Hispanic,14,Elective,Home w/ Home Health Services,2019,INJ033,"COMPLICATION OF CARDIOVASCULAR DEVICE, IMPLANT OR GRAFT, INITIAL ENCOUNTER",CAR027,HEART ASSIST DEVICE PROCEDURES,176,CARDIAC PACEMAKER & DEFIBRILLATOR DEVICE REPLACEMENT,05,DISEASES AND DISORDERS OF THE CIRCULATORY SYSTEM,4,Extreme,Major,Surgical,Medicaid,,,,,false,1180125.84,214957.94
New York City,Manhattan,7002053,001463,NYU Langone Hospitals,70 or Older,117,F,Other Race,Spanish/Hispanic,3,Emergency,Home w/ Home Health Services,2019,INJ033,"COMPLICATION OF CARDIOVASCULAR DEVICE, IMPLANT OR GRAFT, INITIAL ENCOUNTER",CAR026,PACEMAKER AND DEFIBRILLATOR PROCEDURES,176,CARDIAC PACEMAKER & DEFIBRILLATOR DEVICE REPLACEMENT,05,DISEASES AND DISORDERS OF THE CIRCULATORY SYSTEM,2,Moderate,Moderate,Surgical,Medicare,Medicaid,,,,true,150494.02,37816.85
New York City,Manhattan,7002053,001463,NYU Langone Hospitals,70 or Older,112,F,White,Not Span/Hispanic,2,Elective,Home w/ Home Health Services,2019,CIR016,CONDUCTION DISORDERS,CAR026,PACEMAKER AND DEFIBRILLATOR PROCEDURES,176,CARDIAC PACEMAKER & DEFIBRILLATOR DEVICE REPLACEMENT,05,DISEASES AND DISORDERS OF THE CIRCULATORY SYSTEM,3,Major,Major,Surgical,Medicare,,,,,false,191257.38,32905.97
New York City,Manhattan,7002053,001463,NYU Langone Hospitals,30 to 49,112,M,White,Not Span/Hispanic,8,Elective,Home w/ Home Health Services,2019,INJ033,"COMPLICATION OF CARDIOVASCULAR DEVICE, IMPLANT OR GRAFT, INITIAL ENCOUNTER",MST005,INCISION AND DRAINAGE OF SUBCUTANEOUS TISSUE AND FASCIA,176,CARDIAC PACEMAKER & DEFIBRILLATOR DEVICE REPLACEMENT,05,DISEASES AND DISORDERS OF THE CIRCULATORY SYSTEM,3,Major,Moderate,Surgical,Medicare,Medicaid,,,,false,115636.06,34058.36
New York City,Manhattan,7002053,001463,NYU Langone Hospitals,50 to 69,112,M,White,Not Span/Hispanic,1,Elective,Home or Self Care,2019,CIR011,CORONARY ATHEROSCLEROSIS AND OTHER HEART DISEASE,CAR026,PACEMAKER AND DEFIBRILLATOR PROCEDURES,176,CARDIAC PACEMAKER & DEFIBRILLATOR DEVICE REPLACEMENT,05,DISEASES AND DISORDERS OF THE CIRCULATORY SYSTEM,3,Major,Major,Surgical,Medicare,Medicaid,,,,false,425771.54,66678.55
New York City,Manhattan,7002053,001463,NYU Langone Hospitals,70 or Older,112,M,Other Race,Unknown,5,Emergency,Skilled Nursing Home,2019,CIR019,HEART FAILURE,CAR026,PACEMAKER AND DEFIBRILLATOR PROCEDURES,176,CARDIAC PACEMAKER & DEFIBRILLATOR DEVICE REPLACEMENT,05,DISEASES AND DISORDERS OF THE CIRCULATORY SYSTEM,3,Major,Moderate,Surgical,Medicare,Private Health Insurance,,,,false,299923.13,54497.09
New York City,Manhattan,7002053,001463,NYU Langone Hospitals,70 or Older,100,M,White,Not Span/Hispanic,1,Emergency,Home or Self Care,2019,CIR016,CONDUCTION DISORDERS,CAR026,PACEMAKER AND DEFIBRILLATOR PROCEDURES,176,CARDIAC PACEMAKER & DEFIBRILLATOR DEVICE REPLACEMENT,05,DISEASES AND DISORDERS OF THE CIRCULATORY SYSTEM,2,Moderate,Moderate,Surgical,Private Health Insurance,,,,,true,466237.66,71406.91
New York City,Manhattan,7002053,001463,NYU Langone Hospitals,50 to 69,OOS,M,White,Not Span/Hispanic,6,Emergency,Home or Self Care,2019,CIR018,CARDIAC ARREST AND VENTRICULAR FIBRILLATION,CAR026,PACEMAKER AND DEFIBRILLATOR PROCEDURES,176,CARDIAC PACEMAKER & DEFIBRILLATOR DEVICE REPLACEMENT,05,DISEASES AND DISORDERS OF THE CIRCULATORY SYSTEM,3,Major,Extreme,Surgical,Private Health Insurance,,,,,true,580118.17,99455.55
New York City,Manhattan,7002053,001463,NYU Langone Hospitals,50 to 69,100,M,Black/African American,Not Span/Hispanic,11,Emergency,Home w/ Home Health Services,2019,CIR019,HEART FAILURE,CAR026,PACEMAKER AND DEFIBRILLATOR PROCEDURES,176,CARDIAC PACEMAKER & DEFIBRILLATOR DEVICE REPLACEMENT,05,DISEASES AND DISORDERS OF THE CIRCULATORY SYSTEM,4,Extreme,Major,Surgical,Blue Cross/Blue Shield,,,,,true,652420.65,129319.69
New York City,Manhattan,7002053,001463,NYU Langone Hospitals,30 to 49,112,F,Other Race,Spanish/Hispanic,6,Emergency,Home w/ Home Health Services,2019,GEN003,CHRONIC KIDNEY DISEASE,CAR026,PACEMAKER AND DEFIBRILLATOR PROCEDURES,176,CARDIAC PACEMAKER & DEFIBRILLATOR DEVICE REPLACEMENT,05,DISEASES AND DISORDERS OF THE CIRCULATORY SYSTEM,3,Major,Major,Surgical,Blue Cross/Blue Shield,Medicare,,,,true,546556.05,102291.73
New York City,Manhattan,7002053,001463,NYU Langone Hospitals,50 to 69,OOS,M,White,Not Span/Hispanic,1,Elective,Home or Self Care,2019,INJ033,"COMPLICATION OF CARDIOVASCULAR DEVICE, IMPLANT OR GRAFT, INITIAL ENCOUNTER",CAR026,PACEMAKER AND DEFIBRILLATOR PROCEDURES,176,CARDIAC PACEMAKER & DEFIBRILLATOR DEVICE REPLACEMENT,05,DISEASES AND DISORDERS OF THE CIRCULATORY SYSTEM,2,Moderate,Moderate,Surgical,Private Health Insurance,Medicare,,,,false,380685.96,58857.47
New York City,Manhattan,7002053,001463,NYU Langone Hospitals,70 or Older,117,M,White,Not Span/Hispanic,1,Elective,Home or Self Care,2019,CIR017,CARDIAC DYSRHYTHMIAS,CAR029,"CARDIOVASCULAR DEVICE PROCEDURES, NEC",176,CARDIAC PACEMAKER & DEFIBRILLATOR DEVICE REPLACEMENT,05,DISEASES AND DISORDERS OF THE CIRCULATORY SYSTEM,2,Moderate,Moderate,Surgical,Medicare,Federal/State/Local/VA,,,,false,188703.98,29793.1
New York City,Manhattan,7002053,001463,NYU Langone Hospitals,70 or Older,112,M,Other Race,Spanish/Hispanic,16,Emergency,Skilled Nursing Home,2019,INJ033,"COMPLICATION OF CARDIOVASCULAR DEVICE, IMPLANT OR GRAFT, INITIAL ENCOUNTER",CAR026,PACEMAKER AND DEFIBRILLATOR PROCEDURES,176,CARDIAC PACEMAKER & DEFIBRILLATOR DEVICE REPLACEMENT,05,DISEASES AND DISORDERS OF THE CIRCULATORY SYSTEM,3,Major,Major,Surgical,Medicare,,,,,true,225895.3,74437.44
New York City,Manhattan,7002053,001463,NYU Langone Hospitals,70 or Older,115,M,White,Not Span/Hispanic,4,Elective,Home w/ Home Health Services,2019,INJ033,"COMPLICATION OF CARDIOVASCULAR DEVICE, IMPLANT OR GRAFT, INITIAL ENCOUNTER",CAR026,PACEMAKER AND DEFIBRILLATOR PROCEDURES,176,CARDIAC PACEMAKER & DEFIBRILLATOR DEVICE REPLACEMENT,05,DISEASES AND DISORDERS OF THE CIRCULATORY SYSTEM,3,Major,Major,Surgical,Medicare,,,,,false,429416.24,78331.03
