Hospital Service Area,Hospital County,Operating Certificate Number,Permanent Facility Id,Facility Name,Age Group,Zip Code - 3 digits,Gender,Race,Ethnicity,Length of Stay,Type of Admission,Patient Disposition,Discharge Year,CCS Diagnosis Code,CCS Diagnosis Description,CCS Procedure Code,CCS Procedure Description,APR DRG Code,APR DRG Description,APR MDC Code,APR MDC Description,APR Severity of Illness Code,APR Severity of Illness Description,APR Risk of Mortality,APR Medical Surgical Description,Payment Typology 1,Payment Typology 2,Payment Typology 3,Birth Weight,Abortion Edit Indicator,Emergency Department Indicator,Total Charges,Total Costs
Long Island,Nassau,2908000,000511,NYU Langone Hospital-Long Island,30 to 49,115,F,Black/African American,Not Span/Hispanic,3,Emergency,Home or Self Care,2019,CIR016,CONDUCTION DISORDERS,CAR026,PACEMAKER AND DEFIBRILLATOR PROCEDURES,176,CARDIAC PACEMAKER & DEFIBRILLATOR DEVICE REPLACEMENT,05,DISEASES AND DISORDERS OF THE CIRCULATORY SYSTEM,2,Moderate,Moderate,Surgical,Medicaid,,,,,true,224202.89,36724.93
Long Island,Nassau,2908000,000511,NYU Langone Hospital-Long Island,70 or Older,117,M,White,Not Span/Hispanic,2,Urgent,Home or Self Care,2019,CIR017,CARDIAC DYSRHYTHMIAS,CAR026,PACEMAKER AND DEFIBRILLATOR PROCEDURES,176,CARDIAC PACEMAKER & DEFIBRILLATOR DEVICE REPLACEMENT,05,DISEASES AND DISORDERS OF THE CIRCULATORY SYSTEM,3,Major,Major,Surgical,Medicare,Medicare,Blue Cross/Blue Shield,,,false,212026.08,34529.32
Long Island,Nassau,2908000,000511,NYU Langone Hospital-Long Island,50 to 69,110,M,White,Not Span/Hispanic,15,Emergency,Expired,2019,CIR009,ACUTE MYOCARDIAL INFARCTION,CAR026,PACEMAKER AND DEFIBRILLATOR PROCEDURES,176,CARDIAC PACEMAKER & DEFIBRILLATOR DEVICE REPLACEMENT,05,DISEASES AND DISORDERS OF THE CIRCULATORY SYSTEM,4,Extreme,Extreme,Surgical,Blue Cross/Blue Shield,Medicare,,,,true,714140.98,95854.01
Long Island,Nassau,2908000,000511,NYU Langone Hospital-Long Island,50 to 69,115,M,Black/African American,Not Span/Hispanic,1,Urgent,Home or Self Care,2019,CIR016,CONDUCTION DISORDERS,CAR026,PACEMAKER AND DEFIBRILLATOR PROCEDURES,176,CARDIAC PACEMAKER & DEFIBRILLATOR DEVICE REPLACEMENT,05,DISEASES AND DISORDERS OF THE CIRCULATORY SYSTEM,2,Moderate,Moderate,Surgical,Blue Cross/Blue Shield,,,,,false,138636.22,22362.52
Long Island,Nassau,2908000,000511,NYU Langone Hospital-Long Island,50 to 69,119,F,White,Not Span/Hispanic,4,Urgent,Home or Self Care,2019,CIR017,CARDIAC DYSRHYTHMIAS,CAR026,PACEMAKER AND DEFIBRILLATOR PROCEDURES,176,CARDIAC PACEMAKER & DEFIBRILLATOR DEVICE REPLACEMENT,05,DISEASES AND DISORDERS OF THE CIRCULATORY SYSTEM,3,Major,Major,Surgical,Medicaid,Medicaid,,,,false,475436.62,71666.71
Long Island,Nassau,2908000,000511,NYU Langone Hospital-Long Island,70 or Older,115,M,White,Not Span/Hispanic,24,Emergency,Skilled Nursing Home,2019,CIR019,HEART FAILURE,CAR026,PACEMAKER AND DEFIBRILLATOR PROCEDURES,176,CARDIAC PACEMAKER & DEFIBRILLATOR DEVICE REPLACEMENT,05,DISEASES AND DISORDERS OF THE CIRCULATORY SYSTEM,3,Major,Major,Surgical,Medicare,Medicare,Blue Cross/Blue Shield,,,true,395993.14,71227.33
Long Island,Nassau,2908000,000511,NYU Langone Hospital-Long Island,70 or Older,115,M,White,Not Span/Hispanic,2,Emergency,Home w/ Home Health Services,2019,CIR016,CONDUCTION DISORDERS,CAR026,PACEMAKER AND DEFIBRILLATOR PROCEDURES,176,CARDIAC PACEMAKER & DEFIBRILLATOR DEVICE REPLACEMENT,05,DISEASES AND DISORDERS OF THE CIRCULATORY SYSTEM,2,Moderate,Minor,Surgical,Medicare,Medicare,,,,true,111484.43,18162.87
Long Island,Nassau,2908000,000511,NYU Langone Hospital-Long Island,50 to 69,115,M,White,Spanish/Hispanic,59,Emergency,Skilled Nursing Home,2019,CIR019,HEART FAILURE,CAR026,PACEMAKER AND DEFIBRILLATOR PROCEDURES,176,CARDIAC PACEMAKER & DEFIBRILLATOR DEVICE REPLACEMENT,05,DISEASES AND DISORDERS OF THE CIRCULATORY SYSTEM,4,Extreme,Major,Surgical,Medicare,Medicare,Blue Cross/Blue Shield,,,true,1091496.23,192591.46
Long Island,Nassau,2908000,000511,NYU Langone Hospital-Long Island,70 or Older,110,F,Black/African American,Not Span/Hispanic,5,Emergency,Home w/ Home Health Services,2019,CIR019,HEART FAILURE,CAR026,PACEMAKER AND DEFIBRILLATOR PROCEDURES,176,CARDIAC PACEMAKER & DEFIBRILLATOR DEVICE REPLACEMENT,05,DISEASES AND DISORDERS OF THE CIRCULATORY SYSTEM,3,Major,Major,Surgical,Medicare,Medicare,Medicaid,,,true,182118.72,28941.43
Long Island,Nassau,2908000,000511,NYU Langone Hospital-Long Island,70 or Older,119,F,White,Not Span/Hispanic,5,Urgent,Home or Self Care,2019,CIR017,CARDIAC DYSRHYTHMIAS,IMG008,ULTRASONOGRAPHY,176,CARDIAC PACEMAKER & DEFIBRILLATOR DEVICE REPLACEMENT,05,DISEASES AND DISORDERS OF THE CIRCULATORY SYSTEM,3,Major,Major,Surgical,Medicare,Medicare,Private Health Insurance,,,false,159383.99,25454.45
Long Island,Nassau,2908000,000511,NYU Langone Hospital-Long Island,70 or Older,117,F,White,Not Span/Hispanic,2,Emergency,Home or Self Care,2019,CIR016,CONDUCTION DISORDERS,CAR026,PACEMAKER AND DEFIBRILLATOR PROCEDURES,176,CARDIAC PACEMAKER & DEFIBRILLATOR DEVICE REPLACEMENT,05,DISEASES AND DISORDERS OF THE CIRCULATORY SYSTEM,2,Moderate,Moderate,Surgical,Medicare,Medicare,Blue Cross/Blue Shield,,,true,113045.97,18246.54
Long Island,Nassau,2908000,000511,NYU Langone Hospital-Long Island,70 or Older,110,F,White,Not Span/Hispanic,33,Emergency,Skilled Nursing Home,2019,CIR019,HEART FAILURE,CAR026,PACEMAKER AND DEFIBRILLATOR PROCEDURES,176,CARDIAC PACEMAKER & DEFIBRILLATOR DEVICE REPLACEMENT,05,DISEASES AND DISORDERS OF THE CIRCULATORY SYSTEM,4,Extreme,Extreme,Surgical,Medicare,Medicare,Private Health Insurance,,,true,358036.34,76997.27
Long Island,Nassau,2908000,000511,NYU Langone Hospital-Long Island,50 to 69,115,M,White,Not Span/Hispanic,1,Urgent,Home or Self Care,2019,CIR018,CARDIAC ARREST AND VENTRICULAR FIBRILLATION,CAR026,PACEMAKER AND DEFIBRILLATOR PROCEDURES,176,CARDIAC PACEMAKER & DEFIBRILLATOR DEVICE REPLACEMENT,05,DISEASES AND DISORDERS OF THE CIRCULATORY SYSTEM,3,Major,Major,Surgical,Blue Cross/Blue Shield,,,,,false,310760.07,46046.25
Long Island,Nassau,2908000,000511,NYU Langone Hospital-Long Island,70 or Older,117,F,White,Not Span/Hispanic,10,Emergency,Home w/ Home Health Services,2019,CIR019,HEART FAILURE,CAR026,PACEMAKER AND DEFIBRILLATOR PROCEDURES,176,CARDIAC PACEMAKER & DEFIBRILLATOR DEVICE REPLACEMENT,05,DISEASES AND DISORDERS OF THE CIRCULATORY SYSTEM,3,Major,Major,Surgical,Medicare,Medicare,Blue Cross/Blue Shield,,,true,267088.68,48055.2
Long Island,Nassau,2908000,000511,NYU Langone Hospital-Long Island,70 or Older,115,M,White,Not Span/Hispanic,7,Emergency,Home or Self Care,2019,FAC009,"IMPLANT, DEVICE OR GRAFT RELATED ENCOUNTER",CAR026,PACEMAKER AND DEFIBRILLATOR PROCEDURES,176,CARDIAC PACEMAKER & DEFIBRILLATOR DEVICE REPLACEMENT,05,DISEASES AND DISORDERS OF THE CIRCULATORY SYSTEM,3,Major,Major,Surgical,Medicare,Medicare,Medicaid,,,true,311356.2,53322.4
Long Island,Nassau,2908000,000511,NYU Langone Hospital-Long Island,70 or Older,115,M,White,Not Span/Hispanic,2,Emergency,Home or Self Care,2019,INJ033,"COMPLICATION OF CARDIOVASCULAR DEVICE, IMPLANT OR GRAFT, INITIAL ENCOUNTER",CAR026,PACEMAKER AND DEFIBRILLATOR PROCEDURES,176,CARDIAC PACEMAKER & DEFIBRILLATOR DEVICE REPLACEMENT,05,DISEASES AND DISORDERS OF THE CIRCULATORY SYSTEM,2,Moderate,Major,Surgical,Medicare,Medicare,Private Health Insurance,,,true,108307.84,17198.29
Long Island,Nassau,2908000,000511,NYU Langone Hospital-Long Island,70 or Older,115,F,White,Not Span/Hispanic,1,Emergency,Skilled Nursing Home,2019,CIR016,CONDUCTION DISORDERS,CAR026,PACEMAKER AND DEFIBRILLATOR PROCEDURES,176,CARDIAC PACEMAKER & DEFIBRILLATOR DEVICE REPLACEMENT,05,DISEASES AND DISORDERS OF THE CIRCULATORY SYSTEM,3,Major,Major,Surgical,Medicare,Medicare,Medicaid,,,true,99026.09,14973.53
Long Island,Nassau,2908000,000511,NYU Langone Hospital-Long Island,70 or Older,115,M,Black/African American,Not Span/Hispanic,2,Emergency,Home or Self Care,2019,CIR031,HYPOTENSION,CAR026,PACEMAKER AND DEFIBRILLATOR PROCEDURES,176,CARDIAC PACEMAKER & DEFIBRILLATOR DEVICE REPLACEMENT,05,DISEASES AND DISORDERS OF THE CIRCULATORY SYSTEM,2,Moderate,Major,Surgical,Medicare,Medicare,Blue Cross/Blue Shield,,,true,98902.21,15601.79
Long Island,Nassau,2908000,000511,NYU Langone Hospital-Long Island,70 or Older,112,M,White,Not Span/Hispanic,1,Urgent,Home or Self Care,2019,CIR016,CONDUCTION DISORDERS,CAR026,PACEMAKER AND DEFIBRILLATOR PROCEDURES,176,CARDIAC PACEMAKER & DEFIBRILLATOR DEVICE REPLACEMENT,05,DISEASES AND DISORDERS OF THE CIRCULATORY SYSTEM,1,Minor,Minor,Surgical,Medicare,Medicare,,,,false,93203.08,14980.62
Long Island,Nassau,2908000,000511,NYU Langone Hospital-Long Island,70 or Older,117,M,White,Not Span/Hispanic,24,Emergency,Home w/ Home Health Services,2019,CIR019,HEART FAILURE,CAR026,PACEMAKER AND DEFIBRILLATOR PROCEDURES,176,CARDIAC PACEMAKER & DEFIBRILLATOR DEVICE REPLACEMENT,05,DISEASES AND DISORDERS OF THE CIRCULATORY SYSTEM,4,Extreme,Extreme,Surgical,Medicare,Medicare,Private Health Insurance,,,true,505362.31,94975.79
Long Island,Nassau,2908000,000511,NYU Langone Hospital-Long Island,50 to 69,112,M,Black/African American,Not Span/Hispanic,7,Elective,Skilled Nursing Home,2019,FAC009,"IMPLANT, DEVICE OR GRAFT RELATED ENCOUNTER",CAR026,PACEMAKER AND DEFIBRILLATOR PROCEDURES,176,CARDIAC PACEMAKER & DEFIBRILLATOR DEVICE REPLACEMENT,05,DISEASES AND DISORDERS OF THE CIRCULATORY SYSTEM,4,Extreme,Extreme,Surgical,Medicare,Medicaid,,,,false,132703.69,24435.69
Long Island,Nassau,2908000,000511,NYU Langone Hospital-Long Island,70 or Older,118,F,White,Not Span/Hispanic,7,Urgent,Skilled Nursing Home,2019,CIR016,CONDUCTION DISORDERS,CAR026,PACEMAKER AND DEFIBRILLATOR PROCEDURES,176,CARDIAC PACEMAKER & DEFIBRILLATOR DEVICE REPLACEMENT,05,DISEASES AND DISORDERS OF THE CIRCULATORY SYSTEM,4,Extreme,Major,Surgical,Medicare,Private Health Insurance,,,,false,207175.9,32967.49
Long Island,Nassau,2908000,000511,NYU Langone Hospital-Long Island,50 to 69,115,F,Other Race,Not Span/Hispanic,4,Emergency,Home or Self Care,2019,FAC009,"IMPLANT, DEVICE OR GRAFT RELATED ENCOUNTER",CAR026,PACEMAKER AND DEFIBRILLATOR PROCEDURES,176,CARDIAC PACEMAKER & DEFIBRILLATOR DEVICE REPLACEMENT,05,DISEASES AND DISORDERS OF THE CIRCULATORY SYSTEM,3,Major,Major,Surgical,Medicaid,,,,,true,247176.03,40643.48
Long Island,Nassau,2908000,000511,NYU Langone Hospital-Long Island,70 or Older,115,F,White,Not Span/Hispanic,5,Emergency,Home w/ Home Health Services,2019,CIR017,CARDIAC DYSRHYTHMIAS,CAR026,PACEMAKER AND DEFIBRILLATOR PROCEDURES,176,CARDIAC PACEMAKER & DEFIBRILLATOR DEVICE REPLACEMENT,05,DISEASES AND DISORDERS OF THE CIRCULATORY SYSTEM,3,Major,Major,Surgical,Medicare,Blue Cross/Blue Shield,,,,true,152824.75,24857.97
Long Island,Nassau,2908000,000511,NYU Langone Hospital-Long Island,50 to 69,115,M,White,Not Span/Hispanic,1,Elective,Home or Self Care,2019,CIR016,CONDUCTION DISORDERS,CAR026,PACEMAKER AND DEFIBRILLATOR PROCEDURES,176,CARDIAC PACEMAKER & DEFIBRILLATOR DEVICE REPLACEMENT,05,DISEASES AND DISORDERS OF THE CIRCULATORY SYSTEM,2,Moderate,Moderate,Surgical,Medicare,,,,,false,316799.44,50269.09
Long Island,Nassau,2908000,000511,NYU Langone Hospital-Long Island,70 or Older,114,M,Black/African American,Not Span/Hispanic,2,Emergency,Hospice - Home,2019,CIR016,CONDUCTION DISORDERS,CAR026,PACEMAKER AND DEFIBRILLATOR PROCEDURES,176,CARDIAC PACEMAKER & DEFIBRILLATOR DEVICE REPLACEMENT,05,DISEASES AND DISORDERS OF THE CIRCULATORY SYSTEM,3,Major,Major,Surgical,Medicare,,,,,true,116418.36,18418.82
