Hospital Service Area,Hospital County,Operating Certificate Number,Permanent Facility Id,Facility Name,Age Group,Zip Code - 3 digits,Gender,Race,Ethnicity,Length of Stay,Type of Admission,Patient Disposition,Discharge Year,CCS Diagnosis Code,CCS Diagnosis Description,CCS Procedure Code,CCS Procedure Description,APR DRG Code,APR DRG Description,APR MDC Code,APR MDC Description,APR Severity of Illness Code,APR Severity of Illness Description,APR Risk of Mortality,APR Medical Surgical Description,Payment Typology 1,Payment Typology 2,Payment Typology 3,Birth Weight,Abortion Edit Indicator,Emergency Department Indicator,Total Charges,Total Costs
Long Island,Nassau,2908000,000511,NYU Winthrop Hospital,50 to 69,115,M,White,Not Span/Hispanic,4,Emergency,Home w/ Home Health Services,2017,237,Complication of device; implant or graft,048,CARDIAC PACEMAKER/DEFIB,177,Cardiac pacemaker & defibrillator revision except device replacement,05,Diseases and Disorders of the Circulatory System,1,Minor,Moderate,Surgical,Medicare,Medicare,Medicaid,,N,Y,72405.27,18363.27
Long Island,Nassau,2908000,000511,NYU Winthrop Hospital,70 or Older,118,M,White,Not Span/Hispanic,1,Elective,Home w/ Home Health Services,2017,118,Phlebitis; thrombophlebitis and thromboembolism,048,CARDIAC PACEMAKER/DEFIB,177,Cardiac pacemaker & defibrillator revision except device replacement,05,Diseases and Disorders of the Circulatory System,1,Minor,Major,Surgical,Medicare,Medicare,,,N,N,84007.54,15995.89
Long Island,Nassau,2908000,000511,NYU Winthrop Hospital,70 or Older,115,M,White,Not Span/Hispanic,4,Emergency,Home w/ Home Health Services,2017,237,Complication of device; implant or graft,048,CARDIAC PACEMAKER/DEFIB,177,Cardiac pacemaker & defibrillator revision except device replacement,05,Diseases and Disorders of the Circulatory System,2,Moderate,Moderate,Surgical,Medicare,Medicare,Blue Cross/Blue Shield,,N,Y,149907.85,41170.12
Long Island,Nassau,2908000,000511,NYU Winthrop Hospital,70 or Older,117,M,White,Not Span/Hispanic,7,Elective,Home w/ Home Health Services,2017,237,Complication of device; implant or graft,048,CARDIAC PACEMAKER/DEFIB,177,Cardiac pacemaker & defibrillator revision except device replacement,05,Diseases and Disorders of the Circulatory System,2,Moderate,Minor,Surgical,Medicare,Medicare,,,N,N,149250.12,39842.53
Long Island,Nassau,2908000,000511,NYU Winthrop Hospital,70 or Older,117,F,White,Not Span/Hispanic,1,Elective,Home or Self Care,2017,097,Peri-; endo-; and myocarditis; cardiomyopathy (except that caused by tuberculosis or sexually transmitted disease),227,"OT DX PRC (INTERVW,EVAL",177,Cardiac pacemaker & defibrillator revision except device replacement,05,Diseases and Disorders of the Circulatory System,1,Minor,Minor,Surgical,Medicare,Medicare,Private Health Insurance,,N,N,158668.90,35062.24
Long Island,Nassau,2908000,000511,NYU Winthrop Hospital,50 to 69,116,M,White,Not Span/Hispanic,6,Emergency,Skilled Nursing Home,2017,237,Complication of device; implant or graft,175,OT OR THER PRC SKN/BRST,177,Cardiac pacemaker & defibrillator revision except device replacement,05,Diseases and Disorders of the Circulatory System,3,Major,Major,Surgical,Medicaid,,,,N,Y,145530.74,36942.05
Long Island,Nassau,2908000,000511,NYU Winthrop Hospital,50 to 69,110,M,White,Not Span/Hispanic,1,Elective,Home or Self Care,2017,237,Complication of device; implant or graft,048,CARDIAC PACEMAKER/DEFIB,177,Cardiac pacemaker & defibrillator revision except device replacement,05,Diseases and Disorders of the Circulatory System,1,Minor,Moderate,Surgical,Blue Cross/Blue Shield,,,,N,N,46823.25,11703.35
Long Island,Nassau,2908000,000511,NYU Winthrop Hospital,70 or Older,115,M,White,Not Span/Hispanic,10,Emergency,Home or Self Care,2017,237,Complication of device; implant or graft,048,CARDIAC PACEMAKER/DEFIB,177,Cardiac pacemaker & defibrillator revision except device replacement,05,Diseases and Disorders of the Circulatory System,3,Major,Major,Surgical,Medicare,Medicare,Self-Pay,,N,Y,360497.95,83502.76
Long Island,Nassau,2908000,000511,NYU Winthrop Hospital,70 or Older,110,F,White,Not Span/Hispanic,4,Elective,Home w/ Home Health Services,2017,106,Cardiac dysrhythmias,048,CARDIAC PACEMAKER/DEFIB,177,Cardiac pacemaker & defibrillator revision except device replacement,05,Diseases and Disorders of the Circulatory System,2,Moderate,Moderate,Surgical,Medicare,Medicare,Self-Pay,,N,N,99770.85,24883.72
Long Island,Nassau,2908000,000511,NYU Winthrop Hospital,50 to 69,115,M,White,Not Span/Hispanic,5,Urgent,Home or Self Care,2017,237,Complication of device; implant or graft,048,CARDIAC PACEMAKER/DEFIB,177,Cardiac pacemaker & defibrillator revision except device replacement,05,Diseases and Disorders of the Circulatory System,3,Major,Moderate,Surgical,Blue Cross/Blue Shield,,,,N,N,291231.29,70119.90
