Hospital Service Area,Hospital County,Operating Certificate Number,Permanent Facility Id,Facility Name,Age Group,Zip Code - 3 digits,Gender,Race,Ethnicity,Length of Stay,Type of Admission,Patient Disposition,Discharge Year,CCS Diagnosis Code,CCS Diagnosis Description,CCS Procedure Code,CCS Procedure Description,APR DRG Code,APR DRG Description,APR MDC Code,APR MDC Description,APR Severity of Illness Code,APR Severity of Illness Description,APR Risk of Mortality,APR Medical Surgical Description,Payment Typology 1,Payment Typology 2,Payment Typology 3,Birth Weight,Abortion Edit Indicator,Emergency Department Indicator,Total Charges,Total Costs
New York City,Bronx,7000006,001169,Montefiore Medical Center - Henry & Lucy Moses Div,50 to 69,104,F,Other Race,Spanish/Hispanic,1,Emergency,Home or Self Care,2018,INJ033,"COMPLICATION OF CARDIOVASCULAR DEVICE, IMPLANT OR GRAFT, INITIAL ENCOUNTER",CAR026,PACEMAKER AND DEFIBRILLATOR PROCEDURES,177,CARDIAC PACEMAKER & DEFIBRILLATOR REVISION EXCEPT DEVICE REPLACEMENT,05,DISEASES AND DISORDERS OF THE CIRCULATORY SYSTEM,3,Major,Moderate,Surgical,Medicaid,,,,,false,134194.36,46557.84
Long Island,Nassau,2951001,000541,North Shore University Hospital,70 or Older,117,F,White,Not Span/Hispanic,3,Urgent,Home or Self Care,2018,INJ033,"COMPLICATION OF CARDIOVASCULAR DEVICE, IMPLANT OR GRAFT, INITIAL ENCOUNTER",CAR026,PACEMAKER AND DEFIBRILLATOR PROCEDURES,177,CARDIAC PACEMAKER & DEFIBRILLATOR REVISION EXCEPT DEVICE REPLACEMENT,05,DISEASES AND DISORDERS OF THE CIRCULATORY SYSTEM,1,Minor,Moderate,Surgical,Medicare,Medicare,,,,false,59466.81,10470.03
Western NY,Erie,1401008,000213,Mercy Hospital of Buffalo,30 to 49,142,F,Other Race,Spanish/Hispanic,7,Emergency,Home or Self Care,2018,INJ033,"COMPLICATION OF CARDIOVASCULAR DEVICE, IMPLANT OR GRAFT, INITIAL ENCOUNTER",CAR017,PERICARDIAL PROCEDURES,177,CARDIAC PACEMAKER & DEFIBRILLATOR REVISION EXCEPT DEVICE REPLACEMENT,05,DISEASES AND DISORDERS OF THE CIRCULATORY SYSTEM,3,Major,Extreme,Surgical,Medicaid,,,,,true,46354.17,17837.22
New York City,Bronx,7000006,003058,Montefiore Med Center - Jack D Weiler Hosp of A Einstein College Div,50 to 69,104,M,Other Race,Spanish/Hispanic,1,Emergency,Home or Self Care,2018,INJ033,"COMPLICATION OF CARDIOVASCULAR DEVICE, IMPLANT OR GRAFT, INITIAL ENCOUNTER",CAR026,PACEMAKER AND DEFIBRILLATOR PROCEDURES,177,CARDIAC PACEMAKER & DEFIBRILLATOR REVISION EXCEPT DEVICE REPLACEMENT,05,DISEASES AND DISORDERS OF THE CIRCULATORY SYSTEM,2,Moderate,Major,Surgical,Medicaid,,,,,false,59099.02,16417.72
Western NY,Erie,1401008,000213,Mercy Hospital of Buffalo,70 or Older,142,M,White,Not Span/Hispanic,1,Elective,Home or Self Care,2018,CIR011,CORONARY ATHEROSCLEROSIS AND OTHER HEART DISEASE,CAR026,PACEMAKER AND DEFIBRILLATOR PROCEDURES,177,CARDIAC PACEMAKER & DEFIBRILLATOR REVISION EXCEPT DEVICE REPLACEMENT,05,DISEASES AND DISORDERS OF THE CIRCULATORY SYSTEM,3,Major,Moderate,Surgical,Private Health Insurance,Medicare,Medicare,,,false,70357.18,37870.7
Capital/Adirond,Albany,0101000,000001,Albany Medical Center Hospital,50 to 69,120,F,Black/African American,Not Span/Hispanic,5,Elective,Home or Self Care,2018,CIR019,HEART FAILURE,CAR026,PACEMAKER AND DEFIBRILLATOR PROCEDURES,177,CARDIAC PACEMAKER & DEFIBRILLATOR REVISION EXCEPT DEVICE REPLACEMENT,05,DISEASES AND DISORDERS OF THE CIRCULATORY SYSTEM,3,Major,Major,Surgical,Medicare,,,,,false,49778.26,18212.42
New York City,Queens,7003003,001629,Jamaica Hospital Medical Center,70 or Older,114,F,Black/African American,Spanish/Hispanic,2,Emergency,Home or Self Care,2018,INJ033,"COMPLICATION OF CARDIOVASCULAR DEVICE, IMPLANT OR GRAFT, INITIAL ENCOUNTER",CAR026,PACEMAKER AND DEFIBRILLATOR PROCEDURES,177,CARDIAC PACEMAKER & DEFIBRILLATOR REVISION EXCEPT DEVICE REPLACEMENT,05,DISEASES AND DISORDERS OF THE CIRCULATORY SYSTEM,1,Minor,Moderate,Surgical,Medicare,Medicaid,,,,true,12148.3,8019.71
Western NY,Erie,1401008,000213,Mercy Hospital of Buffalo,70 or Older,142,M,White,Not Span/Hispanic,1,Elective,Home or Self Care,2018,INJ033,"COMPLICATION OF CARDIOVASCULAR DEVICE, IMPLANT OR GRAFT, INITIAL ENCOUNTER",CAR026,PACEMAKER AND DEFIBRILLATOR PROCEDURES,177,CARDIAC PACEMAKER & DEFIBRILLATOR REVISION EXCEPT DEVICE REPLACEMENT,05,DISEASES AND DISORDERS OF THE CIRCULATORY SYSTEM,1,Minor,Moderate,Surgical,Medicare,Medicare,,,,false,13247.1,6618.64
Long Island,Nassau,2951001,000541,North Shore University Hospital,50 to 69,116,M,White,Not Span/Hispanic,3,Emergency,Home or Self Care,2018,CIR019,HEART FAILURE,CAR026,PACEMAKER AND DEFIBRILLATOR PROCEDURES,177,CARDIAC PACEMAKER & DEFIBRILLATOR REVISION EXCEPT DEVICE REPLACEMENT,05,DISEASES AND DISORDERS OF THE CIRCULATORY SYSTEM,3,Major,Moderate,Surgical,Medicare,Private Health Insurance,,,,true,51869.16,13359.98
Central NY,Onondaga,3301007,000635,University Hospital SUNY Health Science Center,70 or Older,132,F,White,Not Span/Hispanic,7,Elective,Skilled Nursing Home,2018,CIR019,HEART FAILURE,CAR026,PACEMAKER AND DEFIBRILLATOR PROCEDURES,177,CARDIAC PACEMAKER & DEFIBRILLATOR REVISION EXCEPT DEVICE REPLACEMENT,05,DISEASES AND DISORDERS OF THE CIRCULATORY SYSTEM,3,Major,Major,Surgical,Medicare,Private Health Insurance,,,,false,80344.44,22081.59
Capital/Adirond,Schenectady,4601001,000829,Ellis Hospital,70 or Older,120,M,White,Not Span/Hispanic,4,Emergency,Home or Self Care,2018,INJ033,"COMPLICATION OF CARDIOVASCULAR DEVICE, IMPLANT OR GRAFT, INITIAL ENCOUNTER",CAR026,PACEMAKER AND DEFIBRILLATOR PROCEDURES,177,CARDIAC PACEMAKER & DEFIBRILLATOR REVISION EXCEPT DEVICE REPLACEMENT,05,DISEASES AND DISORDERS OF THE CIRCULATORY SYSTEM,2,Moderate,Major,Surgical,Medicare,Medicare,,,,true,45460.45,12038.66
Central NY,Cayuga,0501000,000085,Auburn Community Hospital,50 to 69,131,M,White,Not Span/Hispanic,2,Emergency,Home or Self Care,2018,CIR016,CONDUCTION DISORDERS,IMG008,ULTRASONOGRAPHY,177,CARDIAC PACEMAKER & DEFIBRILLATOR REVISION EXCEPT DEVICE REPLACEMENT,05,DISEASES AND DISORDERS OF THE CIRCULATORY SYSTEM,3,Major,Major,Surgical,Medicare,,,,,true,61268.02,22035.88
Long Island,Nassau,2953000,000563,St. Francis Hospital & Heart Center,70 or Older,110,M,White,Not Span/Hispanic,1,Elective,Home or Self Care,2018,INJ033,"COMPLICATION OF CARDIOVASCULAR DEVICE, IMPLANT OR GRAFT, INITIAL ENCOUNTER",CAR026,PACEMAKER AND DEFIBRILLATOR PROCEDURES,177,CARDIAC PACEMAKER & DEFIBRILLATOR REVISION EXCEPT DEVICE REPLACEMENT,05,DISEASES AND DISORDERS OF THE CIRCULATORY SYSTEM,2,Moderate,Major,Surgical,Medicare,Medicare,Private Health Insurance,,,false,113772.17,15655.29
New York City,Bronx,7000006,003058,Montefiore Med Center - Jack D Weiler Hosp of A Einstein College Div,70 or Older,104,F,Other Race,Spanish/Hispanic,5,Emergency,Home or Self Care,2018,INJ033,"COMPLICATION OF CARDIOVASCULAR DEVICE, IMPLANT OR GRAFT, INITIAL ENCOUNTER",CAR017,PERICARDIAL PROCEDURES,177,CARDIAC PACEMAKER & DEFIBRILLATOR REVISION EXCEPT DEVICE REPLACEMENT,05,DISEASES AND DISORDERS OF THE CIRCULATORY SYSTEM,2,Moderate,Major,Surgical,Medicare,Medicaid,,,,true,162816.58,30963.82
New York City,Queens,7003000,001626,Elmhurst Hospital Center,50 to 69,113,M,Other Race,Unknown,3,Emergency,Short-term Hospital,2018,CIR011,CORONARY ATHEROSCLEROSIS AND OTHER HEART DISEASE,CAR026,PACEMAKER AND DEFIBRILLATOR PROCEDURES,177,CARDIAC PACEMAKER & DEFIBRILLATOR REVISION EXCEPT DEVICE REPLACEMENT,05,DISEASES AND DISORDERS OF THE CIRCULATORY SYSTEM,2,Moderate,Major,Surgical,Self-Pay,,,,,true,28461.05,16933.36
New York City,Bronx,7000006,001169,Montefiore Medical Center - Henry & Lucy Moses Div,70 or Older,104,F,Multi-racial,Unknown,1,Emergency,Home or Self Care,2018,INJ033,"COMPLICATION OF CARDIOVASCULAR DEVICE, IMPLANT OR GRAFT, INITIAL ENCOUNTER",CAR026,PACEMAKER AND DEFIBRILLATOR PROCEDURES,177,CARDIAC PACEMAKER & DEFIBRILLATOR REVISION EXCEPT DEVICE REPLACEMENT,05,DISEASES AND DISORDERS OF THE CIRCULATORY SYSTEM,1,Minor,Moderate,Surgical,Medicare,Private Health Insurance,,,,false,53663.48,11572.88
Hudson Valley,Westchester,5932000,001129,Phelps Hospital,70 or Older,105,F,White,Not Span/Hispanic,4,Emergency,Home or Self Care,2018,INJ033,"COMPLICATION OF CARDIOVASCULAR DEVICE, IMPLANT OR GRAFT, INITIAL ENCOUNTER",CAR026,PACEMAKER AND DEFIBRILLATOR PROCEDURES,177,CARDIAC PACEMAKER & DEFIBRILLATOR REVISION EXCEPT DEVICE REPLACEMENT,05,DISEASES AND DISORDERS OF THE CIRCULATORY SYSTEM,1,Minor,Moderate,Surgical,Medicare,Private Health Insurance,,,,true,48164.63,17259.83
Southern Tier,Broome,0303001,000058,United Health Services Hospitals Inc. - Wilson Medical Center,70 or Older,OOS,F,White,Not Span/Hispanic,2,Urgent,Home or Self Care,2018,INJ033,"COMPLICATION OF CARDIOVASCULAR DEVICE, IMPLANT OR GRAFT, INITIAL ENCOUNTER",CAR026,PACEMAKER AND DEFIBRILLATOR PROCEDURES,177,CARDIAC PACEMAKER & DEFIBRILLATOR REVISION EXCEPT DEVICE REPLACEMENT,05,DISEASES AND DISORDERS OF THE CIRCULATORY SYSTEM,2,Moderate,Major,Surgical,Medicare,Medicare,Private Health Insurance,,,false,26528.6,12122.48
New York City,Richmond,7004003,001740,Staten Island University Hosp-North,50 to 69,103,M,White,Not Span/Hispanic,3,Emergency,Home or Self Care,2018,INJ033,"COMPLICATION OF CARDIOVASCULAR DEVICE, IMPLANT OR GRAFT, INITIAL ENCOUNTER",CAR026,PACEMAKER AND DEFIBRILLATOR PROCEDURES,177,CARDIAC PACEMAKER & DEFIBRILLATOR REVISION EXCEPT DEVICE REPLACEMENT,05,DISEASES AND DISORDERS OF THE CIRCULATORY SYSTEM,1,Minor,Moderate,Surgical,Medicare,Medicare,,,,true,80885.11,20693.79
Finger Lakes,Monroe,2701003,000411,Rochester General Hospital,70 or Older,146,M,Black/African American,Not Span/Hispanic,20,Emergency,Home w/ Home Health Services,2018,CIR017,CARDIAC DYSRHYTHMIAS,CAR026,PACEMAKER AND DEFIBRILLATOR PROCEDURES,177,CARDIAC PACEMAKER & DEFIBRILLATOR REVISION EXCEPT DEVICE REPLACEMENT,05,DISEASES AND DISORDERS OF THE CIRCULATORY SYSTEM,3,Major,Major,Surgical,Medicare,Medicare,,,,true,97492.89,41971.36
New York City,Richmond,7004003,001740,Staten Island University Hosp-North,70 or Older,103,M,White,Not Span/Hispanic,1,Elective,Home or Self Care,2018,INJ033,"COMPLICATION OF CARDIOVASCULAR DEVICE, IMPLANT OR GRAFT, INITIAL ENCOUNTER",CAR026,PACEMAKER AND DEFIBRILLATOR PROCEDURES,177,CARDIAC PACEMAKER & DEFIBRILLATOR REVISION EXCEPT DEVICE REPLACEMENT,05,DISEASES AND DISORDERS OF THE CIRCULATORY SYSTEM,1,Minor,Minor,Surgical,Medicare,Medicare,,,,false,12712.63,3366.29
New York City,Richmond,7004003,001740,Staten Island University Hosp-North,50 to 69,103,M,White,Not Span/Hispanic,3,Emergency,Home or Self Care,2018,INJ033,"COMPLICATION OF CARDIOVASCULAR DEVICE, IMPLANT OR GRAFT, INITIAL ENCOUNTER",CAR026,PACEMAKER AND DEFIBRILLATOR PROCEDURES,177,CARDIAC PACEMAKER & DEFIBRILLATOR REVISION EXCEPT DEVICE REPLACEMENT,05,DISEASES AND DISORDERS OF THE CIRCULATORY SYSTEM,1,Minor,Moderate,Surgical,Blue Cross/Blue Shield,,,,,true,65184.9,17276.85
Hudson Valley,Westchester,5932000,001129,Phelps Hospital,70 or Older,105,F,White,Not Span/Hispanic,2,Emergency,Home or Self Care,2018,INJ033,"COMPLICATION OF CARDIOVASCULAR DEVICE, IMPLANT OR GRAFT, INITIAL ENCOUNTER",CAR026,PACEMAKER AND DEFIBRILLATOR PROCEDURES,177,CARDIAC PACEMAKER & DEFIBRILLATOR REVISION EXCEPT DEVICE REPLACEMENT,05,DISEASES AND DISORDERS OF THE CIRCULATORY SYSTEM,2,Moderate,Major,Surgical,Medicare,Medicaid,,,,true,41990.97,8127.4
New York City,Manhattan,7002032,001469,Mount Sinai Morningside,70 or Older,109,M,White,Not Span/Hispanic,5,Urgent,Home w/ Home Health Services,2018,CIR011,CORONARY ATHEROSCLEROSIS AND OTHER HEART DISEASE,CAR026,PACEMAKER AND DEFIBRILLATOR PROCEDURES,177,CARDIAC PACEMAKER & DEFIBRILLATOR REVISION EXCEPT DEVICE REPLACEMENT,05,DISEASES AND DISORDERS OF THE CIRCULATORY SYSTEM,3,Major,Moderate,Surgical,Medicare,Blue Cross/Blue Shield,Self-Pay,,,false,70406.32,18183.39
New York City,Queens,7002024,001639,Mount Sinai Hospital - Mount Sinai Hospital of Queens,50 to 69,111,M,Black/African American,Not Span/Hispanic,2,Emergency,Home or Self Care,2018,INJ033,"COMPLICATION OF CARDIOVASCULAR DEVICE, IMPLANT OR GRAFT, INITIAL ENCOUNTER",CAR026,PACEMAKER AND DEFIBRILLATOR PROCEDURES,177,CARDIAC PACEMAKER & DEFIBRILLATOR REVISION EXCEPT DEVICE REPLACEMENT,05,DISEASES AND DISORDERS OF THE CIRCULATORY SYSTEM,1,Minor,Moderate,Surgical,Medicare,Medicaid,Medicare,,,true,16115.9,4950.67
New York City,Bronx,7000006,001169,Montefiore Medical Center - Henry & Lucy Moses Div,50 to 69,105,M,Other Race,Not Span/Hispanic,14,Emergency,Home or Self Care,2018,INJ033,"COMPLICATION OF CARDIOVASCULAR DEVICE, IMPLANT OR GRAFT, INITIAL ENCOUNTER",CAR026,PACEMAKER AND DEFIBRILLATOR PROCEDURES,177,CARDIAC PACEMAKER & DEFIBRILLATOR REVISION EXCEPT DEVICE REPLACEMENT,05,DISEASES AND DISORDERS OF THE CIRCULATORY SYSTEM,2,Moderate,Major,Surgical,Medicaid,,,,,false,178791.45,37837.21
New York City,Manhattan,7002001,001438,Bellevue Hospital Center,70 or Older,112,F,Black/African American,Not Span/Hispanic,29,Emergency,Skilled Nursing Home,2018,INJ033,"COMPLICATION OF CARDIOVASCULAR DEVICE, IMPLANT OR GRAFT, INITIAL ENCOUNTER",CAR026,PACEMAKER AND DEFIBRILLATOR PROCEDURES,177,CARDIAC PACEMAKER & DEFIBRILLATOR REVISION EXCEPT DEVICE REPLACEMENT,05,DISEASES AND DISORDERS OF THE CIRCULATORY SYSTEM,1,Minor,Moderate,Surgical,Medicare,Medicare,,,,false,146779.96,97549.96
Long Island,Nassau,2951001,000541,North Shore University Hospital,50 to 69,113,M,Other Race,Not Span/Hispanic,13,Urgent,Home or Self Care,2018,INJ033,"COMPLICATION OF CARDIOVASCULAR DEVICE, IMPLANT OR GRAFT, INITIAL ENCOUNTER",CAR026,PACEMAKER AND DEFIBRILLATOR PROCEDURES,177,CARDIAC PACEMAKER & DEFIBRILLATOR REVISION EXCEPT DEVICE REPLACEMENT,05,DISEASES AND DISORDERS OF THE CIRCULATORY SYSTEM,2,Moderate,Extreme,Surgical,Medicare,Private Health Insurance,,,,false,231184.82,47643.7
New York City,Richmond,7004003,001740,Staten Island University Hosp-North,50 to 69,OOS,M,Other Race,Not Span/Hispanic,1,Emergency,Home or Self Care,2018,INJ033,"COMPLICATION OF CARDIOVASCULAR DEVICE, IMPLANT OR GRAFT, INITIAL ENCOUNTER",CAR026,PACEMAKER AND DEFIBRILLATOR PROCEDURES,177,CARDIAC PACEMAKER & DEFIBRILLATOR REVISION EXCEPT DEVICE REPLACEMENT,05,DISEASES AND DISORDERS OF THE CIRCULATORY SYSTEM,2,Moderate,Moderate,Surgical,Medicare,,,,,true,30588.56,8504.2
New York City,Manhattan,7002001,001438,Bellevue Hospital Center,50 to 69,100,M,White,Not Span/Hispanic,1,Emergency,Home or Self Care,2018,CIR017,CARDIAC DYSRHYTHMIAS,CAR026,PACEMAKER AND DEFIBRILLATOR PROCEDURES,177,CARDIAC PACEMAKER & DEFIBRILLATOR REVISION EXCEPT DEVICE REPLACEMENT,05,DISEASES AND DISORDERS OF THE CIRCULATORY SYSTEM,2,Moderate,Major,Surgical,Medicare,Medicaid,,,,true,13091.16,8700.38
New York City,Manhattan,7002017,001450,Lenox Hill Hospital,70 or Older,OOS,M,White,Not Span/Hispanic,4,Emergency,Home or Self Care,2018,CIR006,PERICARDITIS AND PERICARDIAL DISEASE,CAR026,PACEMAKER AND DEFIBRILLATOR PROCEDURES,177,CARDIAC PACEMAKER & DEFIBRILLATOR REVISION EXCEPT DEVICE REPLACEMENT,05,DISEASES AND DISORDERS OF THE CIRCULATORY SYSTEM,1,Minor,Moderate,Surgical,Medicare,Private Health Insurance,,,,true,105053.72,24983.59
New York City,Queens,7003004,001630,Long Island Jewish Medical Center,70 or Older,114,F,Other Race,Not Span/Hispanic,1,Urgent,Home w/ Home Health Services,2018,INJ033,"COMPLICATION OF CARDIOVASCULAR DEVICE, IMPLANT OR GRAFT, INITIAL ENCOUNTER",CAR026,PACEMAKER AND DEFIBRILLATOR PROCEDURES,177,CARDIAC PACEMAKER & DEFIBRILLATOR REVISION EXCEPT DEVICE REPLACEMENT,05,DISEASES AND DISORDERS OF THE CIRCULATORY SYSTEM,2,Moderate,Moderate,Surgical,Medicare,Medicare,Self-Pay,,,false,23459.43,5272.72
Western NY,Erie,1401008,000213,Mercy Hospital of Buffalo,70 or Older,140,M,White,Not Span/Hispanic,7,Elective,Home w/ Home Health Services,2018,INJ033,"COMPLICATION OF CARDIOVASCULAR DEVICE, IMPLANT OR GRAFT, INITIAL ENCOUNTER",CAR026,PACEMAKER AND DEFIBRILLATOR PROCEDURES,177,CARDIAC PACEMAKER & DEFIBRILLATOR REVISION EXCEPT DEVICE REPLACEMENT,05,DISEASES AND DISORDERS OF THE CIRCULATORY SYSTEM,2,Moderate,Extreme,Surgical,Medicare,Medicare,,,,false,60472.02,21505.36
New York City,Manhattan,7002001,001438,Bellevue Hospital Center,50 to 69,113,M,Other Race,Not Span/Hispanic,1,Emergency,Home or Self Care,2018,INJ033,"COMPLICATION OF CARDIOVASCULAR DEVICE, IMPLANT OR GRAFT, INITIAL ENCOUNTER",CAR026,PACEMAKER AND DEFIBRILLATOR PROCEDURES,177,CARDIAC PACEMAKER & DEFIBRILLATOR REVISION EXCEPT DEVICE REPLACEMENT,05,DISEASES AND DISORDERS OF THE CIRCULATORY SYSTEM,1,Minor,Moderate,Surgical,Private Health Insurance,,,,,true,7594.1,5047.04
Finger Lakes,Monroe,2701003,000411,Rochester General Hospital,70 or Older,145,M,White,Not Span/Hispanic,1,Emergency,Expired,2018,CIR016,CONDUCTION DISORDERS,CAR026,PACEMAKER AND DEFIBRILLATOR PROCEDURES,177,CARDIAC PACEMAKER & DEFIBRILLATOR REVISION EXCEPT DEVICE REPLACEMENT,05,DISEASES AND DISORDERS OF THE CIRCULATORY SYSTEM,4,Extreme,Extreme,Surgical,Medicare,,,,,true,26124.1,9357.7
Long Island,Nassau,2951001,000541,North Shore University Hospital,70 or Older,114,F,White,Not Span/Hispanic,5,Emergency,Home w/ Home Health Services,2018,SYM012,CIRCULATORY SIGNS AND SYMPTOMS,CAR026,PACEMAKER AND DEFIBRILLATOR PROCEDURES,177,CARDIAC PACEMAKER & DEFIBRILLATOR REVISION EXCEPT DEVICE REPLACEMENT,05,DISEASES AND DISORDERS OF THE CIRCULATORY SYSTEM,3,Major,Major,Surgical,Medicare,Medicare,,,,true,85855.37,17711.86
Western NY,Erie,1401008,000213,Mercy Hospital of Buffalo,50 to 69,140,M,White,Not Span/Hispanic,1,Emergency,Home or Self Care,2018,INJ033,"COMPLICATION OF CARDIOVASCULAR DEVICE, IMPLANT OR GRAFT, INITIAL ENCOUNTER",CAR026,PACEMAKER AND DEFIBRILLATOR PROCEDURES,177,CARDIAC PACEMAKER & DEFIBRILLATOR REVISION EXCEPT DEVICE REPLACEMENT,05,DISEASES AND DISORDERS OF THE CIRCULATORY SYSTEM,1,Minor,Moderate,Surgical,Medicare,Medicare,,,,true,19248.45,10258.49
New York City,Manhattan,7002054,001458,New York-Presbyterian Hospital - New York Weill Cornell Center,70 or Older,100,F,White,Not Span/Hispanic,12,Emergency,Home w/ Home Health Services,2018,CIR006,PERICARDITIS AND PERICARDIAL DISEASE,CAR017,PERICARDIAL PROCEDURES,177,CARDIAC PACEMAKER & DEFIBRILLATOR REVISION EXCEPT DEVICE REPLACEMENT,05,DISEASES AND DISORDERS OF THE CIRCULATORY SYSTEM,1,Minor,Moderate,Surgical,Medicare,Private Health Insurance,Self-Pay,,,true,296788.56,128799.67
New York City,Queens,7003004,001630,Long Island Jewish Medical Center,70 or Older,110,F,Other Race,Not Span/Hispanic,2,Emergency,Home w/ Home Health Services,2018,INJ033,"COMPLICATION OF CARDIOVASCULAR DEVICE, IMPLANT OR GRAFT, INITIAL ENCOUNTER",CAR026,PACEMAKER AND DEFIBRILLATOR PROCEDURES,177,CARDIAC PACEMAKER & DEFIBRILLATOR REVISION EXCEPT DEVICE REPLACEMENT,05,DISEASES AND DISORDERS OF THE CIRCULATORY SYSTEM,1,Minor,Moderate,Surgical,Medicare,Medicaid,Self-Pay,,,false,26477.22,4903.59
Long Island,Nassau,2951001,000541,North Shore University Hospital,50 to 69,110,M,Other Race,Not Span/Hispanic,7,Emergency,Home or Self Care,2018,INJ033,"COMPLICATION OF CARDIOVASCULAR DEVICE, IMPLANT OR GRAFT, INITIAL ENCOUNTER",CAR026,PACEMAKER AND DEFIBRILLATOR PROCEDURES,177,CARDIAC PACEMAKER & DEFIBRILLATOR REVISION EXCEPT DEVICE REPLACEMENT,05,DISEASES AND DISORDERS OF THE CIRCULATORY SYSTEM,2,Moderate,Major,Surgical,Private Health Insurance,,,,,true,126148.2,27763.29
Long Island,Nassau,2909000,000513,Mercy Hospital,70 or Older,117,F,White,Not Span/Hispanic,1,Emergency,Home w/ Home Health Services,2018,CIR017,CARDIAC DYSRHYTHMIAS,ADM015,ADMINISTRATION OF ANTIBIOTICS,177,CARDIAC PACEMAKER & DEFIBRILLATOR REVISION EXCEPT DEVICE REPLACEMENT,05,DISEASES AND DISORDERS OF THE CIRCULATORY SYSTEM,2,Moderate,Moderate,Surgical,Medicare,Medicare,Private Health Insurance,,,true,164220.65,33661.65
New York City,Kings,7001020,001305,Maimonides Medical Center,50 to 69,112,M,Black/African American,Not Span/Hispanic,7,Emergency,Home or Self Care,2018,INJ033,"COMPLICATION OF CARDIOVASCULAR DEVICE, IMPLANT OR GRAFT, INITIAL ENCOUNTER",CAR026,PACEMAKER AND DEFIBRILLATOR PROCEDURES,177,CARDIAC PACEMAKER & DEFIBRILLATOR REVISION EXCEPT DEVICE REPLACEMENT,05,DISEASES AND DISORDERS OF THE CIRCULATORY SYSTEM,1,Minor,Moderate,Surgical,Private Health Insurance,Self-Pay,,,,true,169960.03,39712.83
Finger Lakes,Monroe,2701005,000413,Strong Memorial Hospital,50 to 69,146,F,White,Not Span/Hispanic,5,Elective,Home or Self Care,2018,CIR019,HEART FAILURE,CAR026,PACEMAKER AND DEFIBRILLATOR PROCEDURES,177,CARDIAC PACEMAKER & DEFIBRILLATOR REVISION EXCEPT DEVICE REPLACEMENT,05,DISEASES AND DISORDERS OF THE CIRCULATORY SYSTEM,3,Major,Extreme,Surgical,Medicare,Medicare,Self-Pay,,,false,34079.06,15556.73
New York City,Kings,7001021,001306,New York - Presbyterian Brooklyn Methodist Hospital,50 to 69,112,F,Black/African American,Not Span/Hispanic,3,Emergency,Home or Self Care,2018,CIR017,CARDIAC DYSRHYTHMIAS,MST028,"SUBCUTANEOUS TISSUE AND FASCIA PROCEDURES, NEC",177,CARDIAC PACEMAKER & DEFIBRILLATOR REVISION EXCEPT DEVICE REPLACEMENT,05,DISEASES AND DISORDERS OF THE CIRCULATORY SYSTEM,2,Moderate,Major,Surgical,Medicare,Medicare,Self-Pay,,,false,197291.5,57653.31
Long Island,Nassau,2951001,000541,North Shore University Hospital,70 or Older,110,F,White,Not Span/Hispanic,20,Emergency,Expired,2018,CIR016,CONDUCTION DISORDERS,CAR026,PACEMAKER AND DEFIBRILLATOR PROCEDURES,177,CARDIAC PACEMAKER & DEFIBRILLATOR REVISION EXCEPT DEVICE REPLACEMENT,05,DISEASES AND DISORDERS OF THE CIRCULATORY SYSTEM,4,Extreme,Extreme,Surgical,Medicare,Medicaid,,,,true,417578.55,83769.17
New York City,Kings,7001021,001306,New York - Presbyterian Brooklyn Methodist Hospital,70 or Older,112,M,White,Spanish/Hispanic,30,Emergency,Home w/ Home Health Services,2018,CIR016,CONDUCTION DISORDERS,CAR026,PACEMAKER AND DEFIBRILLATOR PROCEDURES,177,CARDIAC PACEMAKER & DEFIBRILLATOR REVISION EXCEPT DEVICE REPLACEMENT,05,DISEASES AND DISORDERS OF THE CIRCULATORY SYSTEM,4,Extreme,Major,Surgical,Medicare,Medicare,Medicaid,,,true,249840.01,79018.5
Central NY,Oneida,3202002,000598,St Elizabeth Medical Center,70 or Older,134,F,Other Race,Unknown,4,Urgent,Skilled Nursing Home,2018,INJ033,"COMPLICATION OF CARDIOVASCULAR DEVICE, IMPLANT OR GRAFT, INITIAL ENCOUNTER",CAR026,PACEMAKER AND DEFIBRILLATOR PROCEDURES,177,CARDIAC PACEMAKER & DEFIBRILLATOR REVISION EXCEPT DEVICE REPLACEMENT,05,DISEASES AND DISORDERS OF THE CIRCULATORY SYSTEM,1,Minor,Moderate,Surgical,Medicare,Private Health Insurance,,,,false,24058,6575.1
Capital/Adirond,Albany,0101004,000005,St. Peter's Hospital,50 to 69,123,M,White,Not Span/Hispanic,2,Emergency,Home or Self Care,2018,INJ033,"COMPLICATION OF CARDIOVASCULAR DEVICE, IMPLANT OR GRAFT, INITIAL ENCOUNTER",CAR026,PACEMAKER AND DEFIBRILLATOR PROCEDURES,177,CARDIAC PACEMAKER & DEFIBRILLATOR REVISION EXCEPT DEVICE REPLACEMENT,05,DISEASES AND DISORDERS OF THE CIRCULATORY SYSTEM,2,Moderate,Major,Surgical,Medicare,Medicare,,,,true,25762.7,10259.64
New York City,Kings,7001021,001306,New York - Presbyterian Brooklyn Methodist Hospital,70 or Older,112,F,Black/African American,Not Span/Hispanic,1,Emergency,Home w/ Home Health Services,2018,CIR019,HEART FAILURE,CAR026,PACEMAKER AND DEFIBRILLATOR PROCEDURES,177,CARDIAC PACEMAKER & DEFIBRILLATOR REVISION EXCEPT DEVICE REPLACEMENT,05,DISEASES AND DISORDERS OF THE CIRCULATORY SYSTEM,3,Major,Moderate,Surgical,Medicare,Medicare,Medicaid,,,false,218877.78,61754.66
New York City,Kings,7001046,001309,Interfaith Medical Center,70 or Older,112,M,Black/African American,Not Span/Hispanic,14,Emergency,Short-term Hospital,2018,CIR016,CONDUCTION DISORDERS,CAR026,PACEMAKER AND DEFIBRILLATOR PROCEDURES,177,CARDIAC PACEMAKER & DEFIBRILLATOR REVISION EXCEPT DEVICE REPLACEMENT,05,DISEASES AND DISORDERS OF THE CIRCULATORY SYSTEM,2,Moderate,Minor,Surgical,Medicare,Medicare,,,,false,104772.67,37818.37