Hospital Service Area,Hospital County,Operating Certificate Number,Permanent Facility Id,Facility Name,Age Group,Zip Code - 3 digits,Gender,Race,Ethnicity,Length of Stay,Type of Admission,Patient Disposition,Discharge Year,CCS Diagnosis Code,CCS Diagnosis Description,CCS Procedure Code,CCS Procedure Description,APR DRG Code,APR DRG Description,APR MDC Code,APR MDC Description,APR Severity of Illness Code,APR Severity of Illness Description,APR Risk of Mortality,APR Medical Surgical Description,Payment Typology 1,Payment Typology 2,Payment Typology 3,Birth Weight,Abortion Edit Indicator,Emergency Department Indicator,Total Charges,Total Costs
New York City,Manhattan,7002001,001438,Bellevue Hospital Center,50 to 69,112,M,Black/African American,Not Span/Hispanic,20,Urgent,Skilled Nursing Home,2020,CIR006,PERICARDITIS AND PERICARDIAL DISEASE,CAR017,PERICARDIAL PROCEDURES,180,OTHER CIRCULATORY SYSTEM PROCEDURES,05,DISEASES AND DISORDERS OF THE CIRCULATORY SYSTEM,4,Extreme,Extreme,Surgical,Medicaid,,,,,N,177170.49,101887.91
New York City,Manhattan,7002001,001438,Bellevue Hospital Center,50 to 69,100,F,Other Race,Not Span/Hispanic,7,Emergency,Home or Self Care,2020,CIR006,PERICARDITIS AND PERICARDIAL DISEASE,CAR017,PERICARDIAL PROCEDURES,180,OTHER CIRCULATORY SYSTEM PROCEDURES,05,DISEASES AND DISORDERS OF THE CIRCULATORY SYSTEM,3,Major,Major,Surgical,Medicaid,,,,,Y,109062.16,62719.9
New York City,Manhattan,7002001,001438,Bellevue Hospital Center,30 to 49,100,M,Other Race,Not Span/Hispanic,1,Emergency,Psychiatric Hospital or Unit of Hosp,2020,INJ016,"INJURY TO BLOOD VESSELS, INITIAL ENCOUNTER",MST022,"TENDON, MUSCLE, BURSA, AND LIGAMENT REPAIR (EXCLUDING PERINEAL)",180,OTHER CIRCULATORY SYSTEM PROCEDURES,05,DISEASES AND DISORDERS OF THE CIRCULATORY SYSTEM,2,Moderate,Minor,Surgical,Medicaid,,,,,Y,40940,23543.94
New York City,Manhattan,7002001,001438,Bellevue Hospital Center,30 to 49,100,M,Other Race,Not Span/Hispanic,2,Emergency,Home or Self Care,2020,INJ016,"INJURY TO BLOOD VESSELS, INITIAL ENCOUNTER",CAR012,VESSEL REPAIR AND REPLACEMENT,180,OTHER CIRCULATORY SYSTEM PROCEDURES,05,DISEASES AND DISORDERS OF THE CIRCULATORY SYSTEM,1,Minor,Minor,Surgical,Private Health Insurance,,,,,Y,40233.06,23137.39
New York City,Manhattan,7002001,001438,Bellevue Hospital Center,30 to 49,104,M,Other Race,Spanish/Hispanic,5,Emergency,Home or Self Care,2020,CIR008,HYPERTENSION WITH COMPLICATIONS AND SECONDARY HYPERTENSION,MST023,TOE AND MID FOOT AMPUTATION,180,OTHER CIRCULATORY SYSTEM PROCEDURES,05,DISEASES AND DISORDERS OF THE CIRCULATORY SYSTEM,2,Moderate,Major,Surgical,Medicaid,,,,,Y,52558.73,30225.68
New York City,Manhattan,7002001,001438,Bellevue Hospital Center,30 to 49,113,M,Black/African American,Not Span/Hispanic,4,Elective,Court/Law Enforcement,2020,CIR035,VARICOSE VEINS OF LOWER EXTREMITY,CAR020,SAPHENOUS VEIN HARVEST AND OTHER THERAPEUTIC VESSEL REMOVAL,180,OTHER CIRCULATORY SYSTEM PROCEDURES,05,DISEASES AND DISORDERS OF THE CIRCULATORY SYSTEM,1,Minor,Moderate,Surgical,Medicaid,,,,,N,30864.62,17749.75
New York City,Manhattan,7002001,001438,Bellevue Hospital Center,30 to 49,100,M,Other Race,Spanish/Hispanic,1,Emergency,Home or Self Care,2020,INJ016,"INJURY TO BLOOD VESSELS, INITIAL ENCOUNTER",CAR012,VESSEL REPAIR AND REPLACEMENT,180,OTHER CIRCULATORY SYSTEM PROCEDURES,05,DISEASES AND DISORDERS OF THE CIRCULATORY SYSTEM,1,Minor,Minor,Surgical,Self-Pay,,,,,Y,33833.09,19456.87
New York City,Manhattan,7002001,001438,Bellevue Hospital Center,50 to 69,112,M,Other Race,Spanish/Hispanic,5,Elective,Home or Self Care,2020,CIR017,CARDIAC DYSRHYTHMIAS,CAR026,PACEMAKER AND DEFIBRILLATOR PROCEDURES,180,OTHER CIRCULATORY SYSTEM PROCEDURES,05,DISEASES AND DISORDERS OF THE CIRCULATORY SYSTEM,2,Moderate,Major,Surgical,Private Health Insurance,,,,,N,75486.74,43411.22
New York City,Manhattan,7002001,001438,Bellevue Hospital Center,50 to 69,113,F,White,Not Span/Hispanic,13,Emergency,Home or Self Care,2020,CIR006,PERICARDITIS AND PERICARDIAL DISEASE,CAR017,PERICARDIAL PROCEDURES,180,OTHER CIRCULATORY SYSTEM PROCEDURES,05,DISEASES AND DISORDERS OF THE CIRCULATORY SYSTEM,3,Major,Extreme,Surgical,Medicaid,,,,,Y,178761.45,102802.85
New York City,Manhattan,7002001,001438,Bellevue Hospital Center,50 to 69,112,M,Other Race,Spanish/Hispanic,9,Emergency,Skilled Nursing Home,2020,INJ033,"COMPLICATION OF CARDIOVASCULAR DEVICE, IMPLANT OR GRAFT, INITIAL ENCOUNTER",CAR026,PACEMAKER AND DEFIBRILLATOR PROCEDURES,180,OTHER CIRCULATORY SYSTEM PROCEDURES,05,DISEASES AND DISORDERS OF THE CIRCULATORY SYSTEM,2,Moderate,Major,Surgical,Medicare,,,,,Y,105803.8,60846.07
New York City,Manhattan,7002001,001438,Bellevue Hospital Center,50 to 69,112,M,Other Race,Spanish/Hispanic,12,Emergency,Home or Self Care,2020,INJ033,"COMPLICATION OF CARDIOVASCULAR DEVICE, IMPLANT OR GRAFT, INITIAL ENCOUNTER",CAR026,PACEMAKER AND DEFIBRILLATOR PROCEDURES,180,OTHER CIRCULATORY SYSTEM PROCEDURES,05,DISEASES AND DISORDERS OF THE CIRCULATORY SYSTEM,2,Moderate,Minor,Surgical,Medicare,Medicaid,,,,Y,126048.92,72488.72
New York City,Manhattan,7002001,001438,Bellevue Hospital Center,30 to 49,113,M,Multi-racial,Not Span/Hispanic,3,Elective,Court/Law Enforcement,2020,CIR036,POSTTHROMBOTIC SYNDROME AND VENOUS INSUFFICIENCY/HYPERTENSION,CAR020,SAPHENOUS VEIN HARVEST AND OTHER THERAPEUTIC VESSEL REMOVAL,180,OTHER CIRCULATORY SYSTEM PROCEDURES,05,DISEASES AND DISORDERS OF THE CIRCULATORY SYSTEM,1,Minor,Moderate,Surgical,Medicaid,,,,,N,24533.9,14109.05
New York City,Manhattan,7002001,001438,Bellevue Hospital Center,30 to 49,100,F,Other Race,Spanish/Hispanic,5,Emergency,Home or Self Care,2020,INJ016,"INJURY TO BLOOD VESSELS, INITIAL ENCOUNTER",CAR012,VESSEL REPAIR AND REPLACEMENT,180,OTHER CIRCULATORY SYSTEM PROCEDURES,05,DISEASES AND DISORDERS OF THE CIRCULATORY SYSTEM,2,Moderate,Minor,Surgical,Medicaid,,,,,Y,65841.06,37864.14
New York City,Manhattan,7002001,001438,Bellevue Hospital Center,50 to 69,112,M,Black/African American,Not Span/Hispanic,17,Emergency,Home or Self Care,2020,GEN003,CHRONIC KIDNEY DISEASE,CAR015,PERIPHERAL ARTERIOVENOUS FISTULA AND SHUNT PROCEDURES,180,OTHER CIRCULATORY SYSTEM PROCEDURES,05,DISEASES AND DISORDERS OF THE CIRCULATORY SYSTEM,3,Major,Extreme,Surgical,Medicaid,,,,,Y,154637.01,88929.27
New York City,Manhattan,7002001,001438,Bellevue Hospital Center,70 or Older,112,M,Other Race,Spanish/Hispanic,16,Emergency,Home or Self Care,2020,CIR017,CARDIAC DYSRHYTHMIAS,PNS005,PERIPHERAL NERVE DENERVATION,180,OTHER CIRCULATORY SYSTEM PROCEDURES,05,DISEASES AND DISORDERS OF THE CIRCULATORY SYSTEM,3,Major,Major,Surgical,Medicaid,,,,,Y,168327.49,96802.45
New York City,Manhattan,7002001,001438,Bellevue Hospital Center,30 to 49,112,F,Other Race,Spanish/Hispanic,25,Elective,Short-term Hospital,2020,CIR004,ENDOCARDITIS AND ENDOCARDIAL DISEASE,CAR026,PACEMAKER AND DEFIBRILLATOR PROCEDURES,180,OTHER CIRCULATORY SYSTEM PROCEDURES,05,DISEASES AND DISORDERS OF THE CIRCULATORY SYSTEM,4,Extreme,Extreme,Surgical,Medicaid,,,,,Y,304804.03,175287.92
New York City,Manhattan,7002001,001438,Bellevue Hospital Center,50 to 69,112,M,Black/African American,Not Span/Hispanic,33,Emergency,Home w/ Home Health Services,2020,END003,DIABETES MELLITUS WITH COMPLICATION,MST026,FINGER AND OTHER UPPER EXTREMITY AMPUTATION,180,OTHER CIRCULATORY SYSTEM PROCEDURES,05,DISEASES AND DISORDERS OF THE CIRCULATORY SYSTEM,4,Extreme,Moderate,Surgical,Medicaid,,,,,Y,293195.37,168611.97
New York City,Manhattan,7002001,001438,Bellevue Hospital Center,50 to 69,104,M,Other Race,Not Span/Hispanic,16,Urgent,Home or Self Care,2020,CIR009,ACUTE MYOCARDIAL INFARCTION,GIS005,EXPLORATION OF PERITONEAL CAVITY,180,OTHER CIRCULATORY SYSTEM PROCEDURES,05,DISEASES AND DISORDERS OF THE CIRCULATORY SYSTEM,4,Extreme,Extreme,Surgical,Medicare,Medicaid,,,,N,200260.96,115166.87
New York City,Manhattan,7002001,001438,Bellevue Hospital Center,70 or Older,113,F,Other Race,Spanish/Hispanic,71,Urgent,Skilled Nursing Home,2020,INJ033,"COMPLICATION OF CARDIOVASCULAR DEVICE, IMPLANT OR GRAFT, INITIAL ENCOUNTER",CAR026,PACEMAKER AND DEFIBRILLATOR PROCEDURES,180,OTHER CIRCULATORY SYSTEM PROCEDURES,05,DISEASES AND DISORDERS OF THE CIRCULATORY SYSTEM,4,Extreme,Major,Surgical,Medicare,Private Health Insurance,,,,N,556541.57,320058.15
New York City,Manhattan,7002001,001438,Bellevue Hospital Center,70 or Older,112,M,White,Not Span/Hispanic,25,Emergency,Home w/ Home Health Services,2020,INJ033,"COMPLICATION OF CARDIOVASCULAR DEVICE, IMPLANT OR GRAFT, INITIAL ENCOUNTER",MST028,"SUBCUTANEOUS TISSUE AND FASCIA PROCEDURES, NEC",180,OTHER CIRCULATORY SYSTEM PROCEDURES,05,DISEASES AND DISORDERS OF THE CIRCULATORY SYSTEM,4,Extreme,Major,Surgical,Medicare,,,,,Y,229659.41,132073.45
New York City,Manhattan,7002001,001438,Bellevue Hospital Center,70 or Older,100,M,Multi-racial,Unknown,37,Emergency,Inpatient Rehabilitation Facility,2020,CIR019,HEART FAILURE,MST025,ABOVE KNEE AND OTHER PROXIMAL LOWER EXTREMITY AMPUTATION,180,OTHER CIRCULATORY SYSTEM PROCEDURES,05,DISEASES AND DISORDERS OF THE CIRCULATORY SYSTEM,4,Extreme,Extreme,Surgical,Medicare,Medicaid,,,,Y,292835.66,168405.1
