Hospital Service Area,Hospital County,Operating Certificate Number,Permanent Facility Id,Facility Name,Age Group,Zip Code - 3 digits,Gender,Race,Ethnicity,Length of Stay,Type of Admission,Patient Disposition,Discharge Year,CCS Diagnosis Code,CCS Diagnosis Description,CCS Procedure Code,CCS Procedure Description,APR DRG Code,APR DRG Description,APR MDC Code,APR MDC Description,APR Severity of Illness Code,APR Severity of Illness Description,APR Risk of Mortality,APR Medical Surgical Description,Payment Typology 1,Payment Typology 2,Payment Typology 3,Birth Weight,Abortion Edit Indicator,Emergency Department Indicator,Total Charges,Total Costs
New York City,Manhattan,7002053,001463,NYU Langone Hospitals,30 to 49,100,M,Other Race,Not Span/Hispanic,21,Emergency,Inpatient Rehabilitation Facility,2020,INJ036,"COMPLICATION OF TRANSPLANTED ORGANS OR TISSUE, INITIAL ENCOUNTER",CAR017,PERICARDIAL PROCEDURES,180,OTHER CIRCULATORY SYSTEM PROCEDURES,05,DISEASES AND DISORDERS OF THE CIRCULATORY SYSTEM,2,Moderate,Minor,Surgical,Medicare,Medicaid,,,,N,450942.13,99352.21
New York City,Manhattan,7002053,001463,NYU Langone Hospitals,50 to 69,113,F,Other Race,Not Span/Hispanic,11,Elective,Home or Self Care,2020,MAL001,CARDIAC AND CIRCULATORY CONGENITAL ANOMALIES,CAR013,HEART AND GREAT VESSEL BYPASS PROCEDURES,180,OTHER CIRCULATORY SYSTEM PROCEDURES,05,DISEASES AND DISORDERS OF THE CIRCULATORY SYSTEM,3,Major,Major,Surgical,Private Health Insurance,,,,,N,598453.8,113031.22
New York City,Manhattan,7002053,001463,NYU Langone Hospitals,30 to 49,110,M,Other Race,Spanish/Hispanic,3,Emergency,Home or Self Care,2020,CIR006,PERICARDITIS AND PERICARDIAL DISEASE,CAR017,PERICARDIAL PROCEDURES,180,OTHER CIRCULATORY SYSTEM PROCEDURES,05,DISEASES AND DISORDERS OF THE CIRCULATORY SYSTEM,2,Moderate,Moderate,Surgical,Medicaid,,,,,N,79680.14,16945.27
New York City,Manhattan,7002053,001463,NYU Langone Hospitals,50 to 69,OOS,F,Other Race,Not Span/Hispanic,1,Elective,Home or Self Care,2020,CIR039,OTHER SPECIFIED DISEASES OF VEINS AND LYMPHATICS,CAR020,SAPHENOUS VEIN HARVEST AND OTHER THERAPEUTIC VESSEL REMOVAL,180,OTHER CIRCULATORY SYSTEM PROCEDURES,05,DISEASES AND DISORDERS OF THE CIRCULATORY SYSTEM,2,Moderate,Minor,Surgical,Medicare,Private Health Insurance,,,,N,59928.55,10296.81
New York City,Manhattan,7002053,001463,NYU Langone Hospitals,50 to 69,105,M,White,Not Span/Hispanic,2,Elective,Home or Self Care,2020,INJ033,"COMPLICATION OF CARDIOVASCULAR DEVICE, IMPLANT OR GRAFT, INITIAL ENCOUNTER",CAR006,CAROTID ENDARTERECTOMY AND STENTING,180,OTHER CIRCULATORY SYSTEM PROCEDURES,05,DISEASES AND DISORDERS OF THE CIRCULATORY SYSTEM,2,Moderate,Minor,Surgical,Blue Cross/Blue Shield,,,,,N,240686.6,40219.82
New York City,Manhattan,7002053,001463,NYU Langone Hospitals,30 to 49,100,M,Other Race,Not Span/Hispanic,22,Emergency,Home w/ Home Health Services,2020,CIR006,PERICARDITIS AND PERICARDIAL DISEASE,CAR017,PERICARDIAL PROCEDURES,180,OTHER CIRCULATORY SYSTEM PROCEDURES,05,DISEASES AND DISORDERS OF THE CIRCULATORY SYSTEM,4,Extreme,Major,Surgical,Medicare,Medicaid,,,,Y,321137.5,86536.11
New York City,Manhattan,7002053,001463,NYU Langone Hospitals,0 to 17,105,M,Other Race,Spanish/Hispanic,11,Emergency,Home or Self Care,2020,CIR038,POSTPROCEDURAL OR POSTOPERATIVE CIRCULATORY SYSTEM COMPLICATION,CAR017,PERICARDIAL PROCEDURES,180,OTHER CIRCULATORY SYSTEM PROCEDURES,05,DISEASES AND DISORDERS OF THE CIRCULATORY SYSTEM,2,Moderate,Major,Surgical,Blue Cross/Blue Shield,,,,,Y,248690.25,60135.91
New York City,Manhattan,7002053,001463,NYU Langone Hospitals,70 or Older,100,F,White,Not Span/Hispanic,2,Emergency,Home or Self Care,2020,CIR006,PERICARDITIS AND PERICARDIAL DISEASE,CAR017,PERICARDIAL PROCEDURES,180,OTHER CIRCULATORY SYSTEM PROCEDURES,05,DISEASES AND DISORDERS OF THE CIRCULATORY SYSTEM,2,Moderate,Major,Surgical,Medicare,,,,,Y,135679.02,21812.1
New York City,Manhattan,7002053,001463,NYU Langone Hospitals,30 to 49,112,M,Other Race,Not Span/Hispanic,3,Emergency,Home or Self Care,2020,INJ033,"COMPLICATION OF CARDIOVASCULAR DEVICE, IMPLANT OR GRAFT, INITIAL ENCOUNTER",RES001,BRONCHOSCOPY (DIAGNOSTIC),180,OTHER CIRCULATORY SYSTEM PROCEDURES,05,DISEASES AND DISORDERS OF THE CIRCULATORY SYSTEM,2,Moderate,Major,Surgical,Private Health Insurance,,,,,Y,121469.57,24491.54
New York City,Manhattan,7002053,001463,NYU Langone Hospitals,30 to 49,113,F,White,Not Span/Hispanic,4,Elective,Home or Self Care,2020,CIR006,PERICARDITIS AND PERICARDIAL DISEASE,CAR017,PERICARDIAL PROCEDURES,180,OTHER CIRCULATORY SYSTEM PROCEDURES,05,DISEASES AND DISORDERS OF THE CIRCULATORY SYSTEM,1,Minor,Minor,Surgical,Medicaid,,,,,N,87010.15,20996.63
New York City,Manhattan,7002053,001463,NYU Langone Hospitals,30 to 49,103,F,White,Not Span/Hispanic,1,Elective,Home or Self Care,2020,CIR006,PERICARDITIS AND PERICARDIAL DISEASE,CAR017,PERICARDIAL PROCEDURES,180,OTHER CIRCULATORY SYSTEM PROCEDURES,05,DISEASES AND DISORDERS OF THE CIRCULATORY SYSTEM,2,Moderate,Minor,Surgical,Medicaid,,,,,N,117832.48,18570.7
New York City,Manhattan,7002053,001463,NYU Langone Hospitals,50 to 69,100,F,White,Not Span/Hispanic,28,Emergency,Home w/ Home Health Services,2020,CIR006,PERICARDITIS AND PERICARDIAL DISEASE,CAR017,PERICARDIAL PROCEDURES,180,OTHER CIRCULATORY SYSTEM PROCEDURES,05,DISEASES AND DISORDERS OF THE CIRCULATORY SYSTEM,4,Extreme,Major,Surgical,Private Health Insurance,,,,,Y,543069.51,131299.44
New York City,Manhattan,7002053,001463,NYU Langone Hospitals,30 to 49,115,M,White,Not Span/Hispanic,1,Elective,Home or Self Care,2020,INJ033,"COMPLICATION OF CARDIOVASCULAR DEVICE, IMPLANT OR GRAFT, INITIAL ENCOUNTER",CAR026,PACEMAKER AND DEFIBRILLATOR PROCEDURES,180,OTHER CIRCULATORY SYSTEM PROCEDURES,05,DISEASES AND DISORDERS OF THE CIRCULATORY SYSTEM,1,Minor,Moderate,Surgical,Private Health Insurance,,,,,N,162232.98,25511.16
New York City,Manhattan,7002053,001463,NYU Langone Hospitals,30 to 49,112,M,Other Race,Spanish/Hispanic,4,Emergency,Home or Self Care,2020,CIR039,OTHER SPECIFIED DISEASES OF VEINS AND LYMPHATICS,ADM001,TRANSFUSION OF BLOOD AND BLOOD PRODUCTS,180,OTHER CIRCULATORY SYSTEM PROCEDURES,05,DISEASES AND DISORDERS OF THE CIRCULATORY SYSTEM,3,Major,Major,Surgical,Self-Pay,,,,,Y,215641.94,42178.26
New York City,Manhattan,7002053,001463,NYU Langone Hospitals,50 to 69,113,M,White,Not Span/Hispanic,10,Emergency,Home w/ Home Health Services,2020,CIR006,PERICARDITIS AND PERICARDIAL DISEASE,CAR017,PERICARDIAL PROCEDURES,180,OTHER CIRCULATORY SYSTEM PROCEDURES,05,DISEASES AND DISORDERS OF THE CIRCULATORY SYSTEM,3,Major,Major,Surgical,Medicare,Medicaid,,,,Y,288206.63,68129.68
New York City,Manhattan,7002053,001463,NYU Langone Hospitals,30 to 49,112,F,Other Race,Not Span/Hispanic,2,Emergency,Home or Self Care,2020,INJ033,"COMPLICATION OF CARDIOVASCULAR DEVICE, IMPLANT OR GRAFT, INITIAL ENCOUNTER",CAR029,"CARDIOVASCULAR DEVICE PROCEDURES, NEC",180,OTHER CIRCULATORY SYSTEM PROCEDURES,05,DISEASES AND DISORDERS OF THE CIRCULATORY SYSTEM,3,Major,Moderate,Surgical,Medicaid,,,,,Y,97818.57,23467.08
New York City,Manhattan,7002053,001463,NYU Langone Hospitals,70 or Older,112,F,White,Not Span/Hispanic,3,Elective,Home w/ Home Health Services,2020,CIR006,PERICARDITIS AND PERICARDIAL DISEASE,CAR017,PERICARDIAL PROCEDURES,180,OTHER CIRCULATORY SYSTEM PROCEDURES,05,DISEASES AND DISORDERS OF THE CIRCULATORY SYSTEM,1,Minor,Minor,Surgical,Medicare,Medicaid,,,,N,87435.7,20970.46
New York City,Manhattan,7002053,001463,NYU Langone Hospitals,50 to 69,112,M,Black/African American,Not Span/Hispanic,2,Emergency,Home w/ Home Health Services,2020,INJ033,"COMPLICATION OF CARDIOVASCULAR DEVICE, IMPLANT OR GRAFT, INITIAL ENCOUNTER",CAR015,PERIPHERAL ARTERIOVENOUS FISTULA AND SHUNT PROCEDURES,180,OTHER CIRCULATORY SYSTEM PROCEDURES,05,DISEASES AND DISORDERS OF THE CIRCULATORY SYSTEM,2,Moderate,Moderate,Surgical,Medicare,Medicaid,,,,Y,91492.58,21554.26
New York City,Manhattan,7002053,001463,NYU Langone Hospitals,50 to 69,115,M,White,Not Span/Hispanic,8,Elective,Home or Self Care,2020,CIR038,POSTPROCEDURAL OR POSTOPERATIVE CIRCULATORY SYSTEM COMPLICATION,LYM002,LYMPH NODE EXCISION (THERAPEUTIC),180,OTHER CIRCULATORY SYSTEM PROCEDURES,05,DISEASES AND DISORDERS OF THE CIRCULATORY SYSTEM,1,Minor,Minor,Surgical,Private Health Insurance,,,,,N,346038.46,69371.38
New York City,Manhattan,7002053,001463,NYU Langone Hospitals,18 to 29,112,F,Other Race,Not Span/Hispanic,2,Elective,Home or Self Care,2020,CIR006,PERICARDITIS AND PERICARDIAL DISEASE,CAR017,PERICARDIAL PROCEDURES,180,OTHER CIRCULATORY SYSTEM PROCEDURES,05,DISEASES AND DISORDERS OF THE CIRCULATORY SYSTEM,2,Moderate,Moderate,Surgical,Medicaid,,,,,N,79493.33,16185.47
New York City,Manhattan,7002053,001463,NYU Langone Hospitals,50 to 69,112,M,Black/African American,Not Span/Hispanic,3,Emergency,Home or Self Care,2020,INJ033,"COMPLICATION OF CARDIOVASCULAR DEVICE, IMPLANT OR GRAFT, INITIAL ENCOUNTER",CAR029,"CARDIOVASCULAR DEVICE PROCEDURES, NEC",180,OTHER CIRCULATORY SYSTEM PROCEDURES,05,DISEASES AND DISORDERS OF THE CIRCULATORY SYSTEM,3,Major,Major,Surgical,Medicare,Private Health Insurance,,,,Y,106767.93,25648.73
New York City,Manhattan,7002053,001463,NYU Langone Hospitals,50 to 69,112,M,White,Not Span/Hispanic,2,Emergency,Home w/ Home Health Services,2020,CIR038,POSTPROCEDURAL OR POSTOPERATIVE CIRCULATORY SYSTEM COMPLICATION,CAR017,PERICARDIAL PROCEDURES,180,OTHER CIRCULATORY SYSTEM PROCEDURES,05,DISEASES AND DISORDERS OF THE CIRCULATORY SYSTEM,3,Major,Major,Surgical,Medicare,Medicaid,,,,Y,122448.49,25448.06
New York City,Manhattan,7002053,001463,NYU Langone Hospitals,50 to 69,100,F,White,Not Span/Hispanic,5,Emergency,Home or Self Care,2020,CIR038,POSTPROCEDURAL OR POSTOPERATIVE CIRCULATORY SYSTEM COMPLICATION,CAR017,PERICARDIAL PROCEDURES,180,OTHER CIRCULATORY SYSTEM PROCEDURES,05,DISEASES AND DISORDERS OF THE CIRCULATORY SYSTEM,3,Major,Major,Surgical,Blue Cross/Blue Shield,,,,,Y,135509.19,32607.4
New York City,Manhattan,7002053,001463,NYU Langone Hospitals,50 to 69,114,M,Other Race,Not Span/Hispanic,20,Emergency,Inpatient Rehabilitation Facility,2020,INJ033,"COMPLICATION OF CARDIOVASCULAR DEVICE, IMPLANT OR GRAFT, INITIAL ENCOUNTER",CAR026,PACEMAKER AND DEFIBRILLATOR PROCEDURES,180,OTHER CIRCULATORY SYSTEM PROCEDURES,05,DISEASES AND DISORDERS OF THE CIRCULATORY SYSTEM,4,Extreme,Extreme,Surgical,Private Health Insurance,,,,,Y,490902.18,156643.96
New York City,Manhattan,7002053,001463,NYU Langone Hospitals,50 to 69,113,M,Other Race,Not Span/Hispanic,5,Emergency,Home w/ Home Health Services,2020,CIR038,POSTPROCEDURAL OR POSTOPERATIVE CIRCULATORY SYSTEM COMPLICATION,CAR017,PERICARDIAL PROCEDURES,180,OTHER CIRCULATORY SYSTEM PROCEDURES,05,DISEASES AND DISORDERS OF THE CIRCULATORY SYSTEM,2,Moderate,Moderate,Surgical,Medicaid,,,,,Y,115567.03,31024.34
New York City,Manhattan,7002053,001463,NYU Langone Hospitals,30 to 49,113,F,Other Race,Spanish/Hispanic,4,Emergency,Home w/ Home Health Services,2020,CIR038,POSTPROCEDURAL OR POSTOPERATIVE CIRCULATORY SYSTEM COMPLICATION,CAR017,PERICARDIAL PROCEDURES,180,OTHER CIRCULATORY SYSTEM PROCEDURES,05,DISEASES AND DISORDERS OF THE CIRCULATORY SYSTEM,3,Major,Major,Surgical,Medicare,Medicaid,,,,Y,140618.13,43142.88
New York City,Manhattan,7002053,001463,NYU Langone Hospitals,50 to 69,114,M,Black/African American,Not Span/Hispanic,12,Emergency,Home w/ Home Health Services,2020,CIR035,VARICOSE VEINS OF LOWER EXTREMITY,MST025,ABOVE KNEE AND OTHER PROXIMAL LOWER EXTREMITY AMPUTATION,180,OTHER CIRCULATORY SYSTEM PROCEDURES,05,DISEASES AND DISORDERS OF THE CIRCULATORY SYSTEM,2,Moderate,Moderate,Surgical,Private Health Insurance,Medicare,,,,Y,207470.84,66144.34
New York City,Manhattan,7002053,001463,NYU Langone Hospitals,50 to 69,100,M,Other Race,Not Span/Hispanic,1,Elective,Home or Self Care,2020,INJ033,"COMPLICATION OF CARDIOVASCULAR DEVICE, IMPLANT OR GRAFT, INITIAL ENCOUNTER",CAR006,CAROTID ENDARTERECTOMY AND STENTING,180,OTHER CIRCULATORY SYSTEM PROCEDURES,05,DISEASES AND DISORDERS OF THE CIRCULATORY SYSTEM,1,Minor,Minor,Surgical,Medicaid,,,,,N,162198.06,25705.36
New York City,Manhattan,7002053,001463,NYU Langone Hospitals,50 to 69,104,M,Black/African American,Not Span/Hispanic,4,Elective,Home w/ Home Health Services,2020,CIR028,GANGRENE,MST026,FINGER AND OTHER UPPER EXTREMITY AMPUTATION,180,OTHER CIRCULATORY SYSTEM PROCEDURES,05,DISEASES AND DISORDERS OF THE CIRCULATORY SYSTEM,3,Major,Moderate,Surgical,Medicare,Medicaid,,,,N,81830.05,24942.27
New York City,Manhattan,7002053,001463,NYU Langone Hospitals,0 to 17,112,F,Black/African American,Unknown,6,Emergency,Home or Self Care,2020,CIR006,PERICARDITIS AND PERICARDIAL DISEASE,CAR017,PERICARDIAL PROCEDURES,180,OTHER CIRCULATORY SYSTEM PROCEDURES,05,DISEASES AND DISORDERS OF THE CIRCULATORY SYSTEM,1,Minor,Minor,Surgical,Medicaid,,,,,N,152862.71,43190.92
