Hospital Service Area,Hospital County,Operating Certificate Number,Permanent Facility Id,Facility Name,Age Group,Zip Code - 3 digits,Gender,Race,Ethnicity,Length of Stay,Type of Admission,Patient Disposition,Discharge Year,CCS Diagnosis Code,CCS Diagnosis Description,CCS Procedure Code,CCS Procedure Description,APR DRG Code,APR DRG Description,APR MDC Code,APR MDC Description,APR Severity of Illness Code,APR Severity of Illness Description,APR Risk of Mortality,APR Medical Surgical Description,Payment Typology 1,Payment Typology 2,Payment Typology 3,Birth Weight,Abortion Edit Indicator,Emergency Department Indicator,Total Charges,Total Costs
Capital/Adirond,Albany,0101000,000001,Albany Medical Center Hospital,50 to 69,120,M,White,Not Span/Hispanic,5,Emergency,Home or Self Care,2019,INJ033,"COMPLICATION OF CARDIOVASCULAR DEVICE, IMPLANT OR GRAFT, INITIAL ENCOUNTER",CAR007,"EMBOLECTOMY, ENDARTERECTOMY, AND RELATED VESSEL PROCEDURES (NON-ENDOVASCULAR; EXCLUDING CAROTID)",181,LOWER EXTREMITY ARTERIAL PROCEDURES,05,DISEASES AND DISORDERS OF THE CIRCULATORY SYSTEM,2,Moderate,Minor,Surgical,"Managed Care, Unspecified",,,,,true,57746.18,18791.07
Southern Tier,Broome,0303001,000058,United Health Services Hospitals Inc. - Wilson Medical Center,50 to 69,137,M,White,Not Span/Hispanic,3,Elective,Home or Self Care,2019,CIR026,PERIPHERAL AND VISCERAL VASCULAR DISEASE,CAR014,PERIPHERAL ARTERIAL BYPASS PROCEDURES,181,LOWER EXTREMITY ARTERIAL PROCEDURES,05,DISEASES AND DISORDERS OF THE CIRCULATORY SYSTEM,2,Moderate,Moderate,Surgical,Medicare,Medicare,,,,false,62462.4,28327.71
New York City,Manhattan,7002001,001438,Bellevue Hospital Center,50 to 69,100,M,Other Race,Not Span/Hispanic,1,Emergency,Home or Self Care,2019,CIR029,AORTIC; PERIPHERAL; AND VISCERAL ARTERY ANEURYSMS,CAR011,ANEURYSM REPAIR PROCEDURES,181,LOWER EXTREMITY ARTERIAL PROCEDURES,05,DISEASES AND DISORDERS OF THE CIRCULATORY SYSTEM,2,Moderate,Minor,Surgical,Medicaid,,,,,false,6941.4,4613.25
New York City,Manhattan,7002017,001450,Lenox Hill Hospital,70 or Older,100,F,White,Not Span/Hispanic,4,Emergency,Expired,2019,CIR026,PERIPHERAL AND VISCERAL VASCULAR DISEASE,CAR008,ANGIOPLASTY AND RELATED VESSEL PROCEDURES (ENDOVASCULAR; EXCLUDING CAROTID),181,LOWER EXTREMITY ARTERIAL PROCEDURES,05,DISEASES AND DISORDERS OF THE CIRCULATORY SYSTEM,4,Extreme,Extreme,Surgical,Blue Cross/Blue Shield,Medicare,,,,true,197019.1,60573.11
New York City,Manhattan,7002017,001450,Lenox Hill Hospital,50 to 69,112,F,Other Race,Unknown,9,Urgent,Home w/ Home Health Services,2019,END003,DIABETES MELLITUS WITH COMPLICATION,CAR008,ANGIOPLASTY AND RELATED VESSEL PROCEDURES (ENDOVASCULAR; EXCLUDING CAROTID),181,LOWER EXTREMITY ARTERIAL PROCEDURES,05,DISEASES AND DISORDERS OF THE CIRCULATORY SYSTEM,3,Major,Minor,Surgical,Private Health Insurance,,,,,false,197722.08,43271.82
Long Island,Suffolk,5151001,000245,Stony Brook University Hospital,50 to 69,117,M,White,Not Span/Hispanic,6,Elective,Skilled Nursing Home,2019,CIR030,AORTIC AND PERIPHERAL ARTERIAL EMBOLISM OR THROMBOSIS,CAR014,PERIPHERAL ARTERIAL BYPASS PROCEDURES,181,LOWER EXTREMITY ARTERIAL PROCEDURES,05,DISEASES AND DISORDERS OF THE CIRCULATORY SYSTEM,2,Moderate,Moderate,Surgical,Private Health Insurance,,,,,false,101058.83,41420.49
New York City,Manhattan,7002054,001458,New York-Presbyterian Hospital - New York Weill Cornell Center,50 to 69,112,F,Other Race,Not Span/Hispanic,7,Emergency,Home or Self Care,2019,END003,DIABETES MELLITUS WITH COMPLICATION,MST023,TOE AND MID FOOT AMPUTATION,181,LOWER EXTREMITY ARTERIAL PROCEDURES,05,DISEASES AND DISORDERS OF THE CIRCULATORY SYSTEM,3,Major,Moderate,Surgical,"Managed Care, Unspecified",Medicaid,Self-Pay,,,true,108116.67,27761.72
New York City,Bronx,7000002,001165,Jacobi Medical Center,30 to 49,104,M,Black/African American,Not Span/Hispanic,8,Emergency,Home or Self Care,2019,INJ016,"INJURY TO BLOOD VESSELS, INITIAL ENCOUNTER",CAR014,PERIPHERAL ARTERIAL BYPASS PROCEDURES,181,LOWER EXTREMITY ARTERIAL PROCEDURES,05,DISEASES AND DISORDERS OF THE CIRCULATORY SYSTEM,4,Extreme,Major,Surgical,Medicaid,Medicaid,,,,true,66431.83,39304.39
Long Island,Suffolk,5151001,000245,Stony Brook University Hospital,70 or Older,119,M,White,Not Span/Hispanic,1,Elective,Home w/ Home Health Services,2019,CIR026,PERIPHERAL AND VISCERAL VASCULAR DISEASE,CAR007,"EMBOLECTOMY, ENDARTERECTOMY, AND RELATED VESSEL PROCEDURES (NON-ENDOVASCULAR; EXCLUDING CAROTID)",181,LOWER EXTREMITY ARTERIAL PROCEDURES,05,DISEASES AND DISORDERS OF THE CIRCULATORY SYSTEM,1,Minor,Minor,Surgical,Medicare,,,,,false,41085.61,20212.71
Finger Lakes,Monroe,2701003,000411,Rochester General Hospital,70 or Older,145,M,Black/African American,Not Span/Hispanic,3,Elective,Home or Self Care,2019,INJ033,"COMPLICATION OF CARDIOVASCULAR DEVICE, IMPLANT OR GRAFT, INITIAL ENCOUNTER",CAR012,VESSEL REPAIR AND REPLACEMENT,181,LOWER EXTREMITY ARTERIAL PROCEDURES,05,DISEASES AND DISORDERS OF THE CIRCULATORY SYSTEM,3,Major,Major,Surgical,Medicare,,,,,false,40242.22,13026.17
Central NY,Onondaga,3301008,000636,Crouse Hospital,70 or Older,132,M,White,Not Span/Hispanic,7,Emergency,Skilled Nursing Home,2019,CIR026,PERIPHERAL AND VISCERAL VASCULAR DISEASE,CAR014,PERIPHERAL ARTERIAL BYPASS PROCEDURES,181,LOWER EXTREMITY ARTERIAL PROCEDURES,05,DISEASES AND DISORDERS OF THE CIRCULATORY SYSTEM,3,Major,Major,Surgical,Medicare,,,,,true,38296.51,16418.68
New York City,Manhattan,7002054,001458,New York-Presbyterian Hospital - New York Weill Cornell Center,70 or Older,112,F,Black/African American,Not Span/Hispanic,23,Emergency,Skilled Nursing Home,2019,CIR026,PERIPHERAL AND VISCERAL VASCULAR DISEASE,CAR014,PERIPHERAL ARTERIAL BYPASS PROCEDURES,181,LOWER EXTREMITY ARTERIAL PROCEDURES,05,DISEASES AND DISORDERS OF THE CIRCULATORY SYSTEM,4,Extreme,Major,Surgical,Medicare,Medicare,Self-Pay,,,true,311196.53,76467.8
Central NY,Onondaga,3301008,000636,Crouse Hospital,70 or Older,130,M,White,Not Span/Hispanic,5,Elective,Home w/ Home Health Services,2019,END003,DIABETES MELLITUS WITH COMPLICATION,CAR014,PERIPHERAL ARTERIAL BYPASS PROCEDURES,181,LOWER EXTREMITY ARTERIAL PROCEDURES,05,DISEASES AND DISORDERS OF THE CIRCULATORY SYSTEM,2,Moderate,Moderate,Surgical,Medicare,Medicare,Blue Cross/Blue Shield,,,false,24393.42,10451.85
Capital/Adirond,Albany,0101004,000005,St. Peter's Hospital,50 to 69,121,M,White,Not Span/Hispanic,2,Elective,Home or Self Care,2019,END003,DIABETES MELLITUS WITH COMPLICATION,CAR007,"EMBOLECTOMY, ENDARTERECTOMY, AND RELATED VESSEL PROCEDURES (NON-ENDOVASCULAR; EXCLUDING CAROTID)",181,LOWER EXTREMITY ARTERIAL PROCEDURES,05,DISEASES AND DISORDERS OF THE CIRCULATORY SYSTEM,1,Minor,Minor,Surgical,Medicare,Private Health Insurance,,,,false,48574.4,18825.67
New York City,Bronx,7000006,001169,Montefiore Medical Center - Henry & Lucy Moses Div,30 to 49,104,F,Black/African American,Not Span/Hispanic,4,Emergency,Home w/ Home Health Services,2019,INJ033,"COMPLICATION OF CARDIOVASCULAR DEVICE, IMPLANT OR GRAFT, INITIAL ENCOUNTER",CAR007,"EMBOLECTOMY, ENDARTERECTOMY, AND RELATED VESSEL PROCEDURES (NON-ENDOVASCULAR; EXCLUDING CAROTID)",181,LOWER EXTREMITY ARTERIAL PROCEDURES,05,DISEASES AND DISORDERS OF THE CIRCULATORY SYSTEM,2,Moderate,Minor,Surgical,Medicare,Medicaid,,,,true,99325.43,20416.62
Hudson Valley,Rockland,4329000,000779,Good Samaritan Hospital of Suffern,50 to 69,109,M,White,Unknown,9,Elective,Skilled Nursing Home,2019,END003,DIABETES MELLITUS WITH COMPLICATION,CAR008,ANGIOPLASTY AND RELATED VESSEL PROCEDURES (ENDOVASCULAR; EXCLUDING CAROTID),181,LOWER EXTREMITY ARTERIAL PROCEDURES,05,DISEASES AND DISORDERS OF THE CIRCULATORY SYSTEM,3,Major,Major,Surgical,Medicare,Medicaid,,,,true,259369.41,39636.12
New York City,Manhattan,7002024,001456,Mount Sinai Hospital,70 or Older,104,M,Black/African American,Not Span/Hispanic,1,Elective,Home or Self Care,2019,END003,DIABETES MELLITUS WITH COMPLICATION,CAR008,ANGIOPLASTY AND RELATED VESSEL PROCEDURES (ENDOVASCULAR; EXCLUDING CAROTID),181,LOWER EXTREMITY ARTERIAL PROCEDURES,05,DISEASES AND DISORDERS OF THE CIRCULATORY SYSTEM,2,Moderate,Minor,Surgical,Medicare,Medicaid,Self-Pay,,,false,32480.37,11952.1
New York City,Manhattan,7002054,001458,New York-Presbyterian Hospital - New York Weill Cornell Center,70 or Older,113,F,White,Not Span/Hispanic,5,Elective,Home w/ Home Health Services,2019,CIR029,AORTIC; PERIPHERAL; AND VISCERAL ARTERY ANEURYSMS,CAR011,ANEURYSM REPAIR PROCEDURES,181,LOWER EXTREMITY ARTERIAL PROCEDURES,05,DISEASES AND DISORDERS OF THE CIRCULATORY SYSTEM,2,Moderate,Major,Surgical,Medicare,Medicare,Self-Pay,,,false,261199.24,117027.62
Finger Lakes,Monroe,2701003,000411,Rochester General Hospital,50 to 69,146,M,White,Not Span/Hispanic,2,Elective,Home or Self Care,2019,CIR026,PERIPHERAL AND VISCERAL VASCULAR DISEASE,CAR014,PERIPHERAL ARTERIAL BYPASS PROCEDURES,181,LOWER EXTREMITY ARTERIAL PROCEDURES,05,DISEASES AND DISORDERS OF THE CIRCULATORY SYSTEM,2,Moderate,Moderate,Surgical,Private Health Insurance,,,,,false,12340.93,4826.03
New York City,Manhattan,7002054,001458,New York-Presbyterian Hospital - New York Weill Cornell Center,70 or Older,100,F,White,Not Span/Hispanic,7,Emergency,Inpatient Rehabilitation Facility,2019,CIR026,PERIPHERAL AND VISCERAL VASCULAR DISEASE,CAR008,ANGIOPLASTY AND RELATED VESSEL PROCEDURES (ENDOVASCULAR; EXCLUDING CAROTID),181,LOWER EXTREMITY ARTERIAL PROCEDURES,05,DISEASES AND DISORDERS OF THE CIRCULATORY SYSTEM,2,Moderate,Moderate,Surgical,Blue Cross/Blue Shield,Medicare,Self-Pay,,,false,113201.64,32719.32
Long Island,Suffolk,5154001,000925,Good Samaritan Hospital Medical Center,70 or Older,117,M,Black/African American,Not Span/Hispanic,3,Elective,Home w/ Home Health Services,2019,END003,DIABETES MELLITUS WITH COMPLICATION,CAR007,"EMBOLECTOMY, ENDARTERECTOMY, AND RELATED VESSEL PROCEDURES (NON-ENDOVASCULAR; EXCLUDING CAROTID)",181,LOWER EXTREMITY ARTERIAL PROCEDURES,05,DISEASES AND DISORDERS OF THE CIRCULATORY SYSTEM,2,Moderate,Major,Surgical,Medicare,Blue Cross/Blue Shield,,,,false,68284.99,13267.4
Long Island,Nassau,2951001,000541,North Shore University Hospital,50 to 69,114,M,White,Not Span/Hispanic,1,Urgent,Home or Self Care,2019,CIR026,PERIPHERAL AND VISCERAL VASCULAR DISEASE,CAR008,ANGIOPLASTY AND RELATED VESSEL PROCEDURES (ENDOVASCULAR; EXCLUDING CAROTID),181,LOWER EXTREMITY ARTERIAL PROCEDURES,05,DISEASES AND DISORDERS OF THE CIRCULATORY SYSTEM,1,Minor,Minor,Surgical,Private Health Insurance,,,,,false,87352,26200.12
New York City,Kings,7002053,001304,NYU Langone Hospital-Brooklyn,70 or Older,112,F,Other Race,Spanish/Hispanic,4,Emergency,Home w/ Home Health Services,2019,INJ033,"COMPLICATION OF CARDIOVASCULAR DEVICE, IMPLANT OR GRAFT, INITIAL ENCOUNTER",CAR008,ANGIOPLASTY AND RELATED VESSEL PROCEDURES (ENDOVASCULAR; EXCLUDING CAROTID),181,LOWER EXTREMITY ARTERIAL PROCEDURES,05,DISEASES AND DISORDERS OF THE CIRCULATORY SYSTEM,3,Major,Major,Surgical,Medicare,Medicaid,,,,true,188906.48,35032.67
Southern Tier,Broome,0303001,000058,United Health Services Hospitals Inc. - Wilson Medical Center,30 to 49,139,F,White,Not Span/Hispanic,5,Emergency,Home or Self Care,2019,GEN003,CHRONIC KIDNEY DISEASE,ADM013,PERITONEAL DIALYSIS,181,LOWER EXTREMITY ARTERIAL PROCEDURES,05,DISEASES AND DISORDERS OF THE CIRCULATORY SYSTEM,3,Major,Moderate,Surgical,Medicaid,Medicaid,,,,true,32361.2,16222.02
Southern Tier,Broome,0303001,000058,United Health Services Hospitals Inc. - Wilson Medical Center,70 or Older,138,F,White,Not Span/Hispanic,2,Emergency,Home or Self Care,2019,INJ033,"COMPLICATION OF CARDIOVASCULAR DEVICE, IMPLANT OR GRAFT, INITIAL ENCOUNTER",CAR007,"EMBOLECTOMY, ENDARTERECTOMY, AND RELATED VESSEL PROCEDURES (NON-ENDOVASCULAR; EXCLUDING CAROTID)",181,LOWER EXTREMITY ARTERIAL PROCEDURES,05,DISEASES AND DISORDERS OF THE CIRCULATORY SYSTEM,2,Moderate,Moderate,Surgical,Medicare,Medicare,,,,true,32578.4,15105.67
Hudson Valley,Dutchess,1302001,000181,Vassar Brothers Medical Center,50 to 69,125,F,White,Not Span/Hispanic,4,Elective,Home w/ Home Health Services,2019,END003,DIABETES MELLITUS WITH COMPLICATION,CAR014,PERIPHERAL ARTERIAL BYPASS PROCEDURES,181,LOWER EXTREMITY ARTERIAL PROCEDURES,05,DISEASES AND DISORDERS OF THE CIRCULATORY SYSTEM,2,Moderate,Minor,Surgical,Medicare,,,,,false,56593.11,23208.46
New York City,Kings,7001002,001286,Brookdale Hospital Medical Center,50 to 69,112,M,Black/African American,Not Span/Hispanic,12,Emergency,Home or Self Care,2019,END003,DIABETES MELLITUS WITH COMPLICATION,CAR008,ANGIOPLASTY AND RELATED VESSEL PROCEDURES (ENDOVASCULAR; EXCLUDING CAROTID),181,LOWER EXTREMITY ARTERIAL PROCEDURES,05,DISEASES AND DISORDERS OF THE CIRCULATORY SYSTEM,3,Major,Minor,Surgical,Medicaid,,,,,true,87830.97,57205
New York City,Manhattan,7002054,001437,New York-Presbyterian/Lower Manhattan Hospital,50 to 69,100,M,Other Race,Spanish/Hispanic,11,Elective,Home w/ Home Health Services,2019,CIR026,PERIPHERAL AND VISCERAL VASCULAR DISEASE,CAR014,PERIPHERAL ARTERIAL BYPASS PROCEDURES,181,LOWER EXTREMITY ARTERIAL PROCEDURES,05,DISEASES AND DISORDERS OF THE CIRCULATORY SYSTEM,2,Moderate,Minor,Surgical,"Managed Care, Unspecified",Medicaid,Self-Pay,,,false,174631.92,55022.23
New York City,Manhattan,7002024,001456,Mount Sinai Hospital,50 to 69,113,F,White,Not Span/Hispanic,1,Elective,Home or Self Care,2019,INJ033,"COMPLICATION OF CARDIOVASCULAR DEVICE, IMPLANT OR GRAFT, INITIAL ENCOUNTER",CAR008,ANGIOPLASTY AND RELATED VESSEL PROCEDURES (ENDOVASCULAR; EXCLUDING CAROTID),181,LOWER EXTREMITY ARTERIAL PROCEDURES,05,DISEASES AND DISORDERS OF THE CIRCULATORY SYSTEM,2,Moderate,Minor,Surgical,Private Health Insurance,Self-Pay,,,,false,66397.76,30106.5
New York City,Manhattan,7002024,001456,Mount Sinai Hospital,70 or Older,111,M,Other Race,Spanish/Hispanic,3,Emergency,Home w/ Home Health Services,2019,END003,DIABETES MELLITUS WITH COMPLICATION,CAR008,ANGIOPLASTY AND RELATED VESSEL PROCEDURES (ENDOVASCULAR; EXCLUDING CAROTID),181,LOWER EXTREMITY ARTERIAL PROCEDURES,05,DISEASES AND DISORDERS OF THE CIRCULATORY SYSTEM,3,Major,Moderate,Surgical,Medicare,Medicare,Medicaid,,,true,70447.66,24780.67
New York City,Manhattan,7002054,001458,New York-Presbyterian Hospital - New York Weill Cornell Center,70 or Older,100,F,Other Race,Not Span/Hispanic,8,Elective,Home w/ Home Health Services,2019,CIR026,PERIPHERAL AND VISCERAL VASCULAR DISEASE,CAR014,PERIPHERAL ARTERIAL BYPASS PROCEDURES,181,LOWER EXTREMITY ARTERIAL PROCEDURES,05,DISEASES AND DISORDERS OF THE CIRCULATORY SYSTEM,2,Moderate,Moderate,Surgical,Medicare,Private Health Insurance,Self-Pay,,,false,223946.64,95602.45
Capital/Adirond,Albany,0101004,000005,St. Peter's Hospital,50 to 69,121,M,Black/African American,Not Span/Hispanic,10,Elective,Home or Self Care,2019,END003,DIABETES MELLITUS WITH COMPLICATION,CAR014,PERIPHERAL ARTERIAL BYPASS PROCEDURES,181,LOWER EXTREMITY ARTERIAL PROCEDURES,05,DISEASES AND DISORDERS OF THE CIRCULATORY SYSTEM,3,Major,Moderate,Surgical,Medicaid,Medicaid,,,,false,99506.41,36018.45
Finger Lakes,Monroe,2701003,000411,Rochester General Hospital,50 to 69,146,F,Other Race,Spanish/Hispanic,2,Emergency,Home or Self Care,2019,END003,DIABETES MELLITUS WITH COMPLICATION,CAR008,ANGIOPLASTY AND RELATED VESSEL PROCEDURES (ENDOVASCULAR; EXCLUDING CAROTID),181,LOWER EXTREMITY ARTERIAL PROCEDURES,05,DISEASES AND DISORDERS OF THE CIRCULATORY SYSTEM,3,Major,Minor,Surgical,Medicaid,,,,,true,36895.83,11995.6
Hudson Valley,Orange,3529000,000704,St Anthony Community Hospital,30 to 49,109,F,Black/African American,Not Span/Hispanic,5,Elective,Home or Self Care,2019,CIR033,ACUTE PHLEBITIS; THROMBOPHLEBITIS AND THROMBOEMBOLISM,IMG002,FLUOROSCOPIC ANGIOGRAPHY (EXCLUDING CORONARY),181,LOWER EXTREMITY ARTERIAL PROCEDURES,05,DISEASES AND DISORDERS OF THE CIRCULATORY SYSTEM,2,Moderate,Minor,Surgical,Medicaid,,,,,false,167032.51,26883.06
New York City,Kings,7001020,001305,Maimonides Medical Center,70 or Older,112,F,Black/African American,Not Span/Hispanic,4,Elective,Home w/ Home Health Services,2019,CIR029,AORTIC; PERIPHERAL; AND VISCERAL ARTERY ANEURYSMS,CAR008,ANGIOPLASTY AND RELATED VESSEL PROCEDURES (ENDOVASCULAR; EXCLUDING CAROTID),181,LOWER EXTREMITY ARTERIAL PROCEDURES,05,DISEASES AND DISORDERS OF THE CIRCULATORY SYSTEM,2,Moderate,Minor,Surgical,Medicare,Medicaid,Self-Pay,,,false,57810.02,19139.26
New York City,Kings,7001020,001305,Maimonides Medical Center,70 or Older,112,M,White,Not Span/Hispanic,11,Emergency,Skilled Nursing Home,2019,END003,DIABETES MELLITUS WITH COMPLICATION,IMG002,FLUOROSCOPIC ANGIOGRAPHY (EXCLUDING CORONARY),181,LOWER EXTREMITY ARTERIAL PROCEDURES,05,DISEASES AND DISORDERS OF THE CIRCULATORY SYSTEM,4,Extreme,Major,Surgical,Medicare,Medicare,Self-Pay,,,true,155679.09,47970.4
Finger Lakes,Monroe,2701003,000411,Rochester General Hospital,50 to 69,146,M,White,Not Span/Hispanic,3,Emergency,Home or Self Care,2019,CIR029,AORTIC; PERIPHERAL; AND VISCERAL ARTERY ANEURYSMS,CAR011,ANEURYSM REPAIR PROCEDURES,181,LOWER EXTREMITY ARTERIAL PROCEDURES,05,DISEASES AND DISORDERS OF THE CIRCULATORY SYSTEM,3,Major,Moderate,Surgical,Medicaid,,,,,true,95763.7,27541.81
Long Island,Suffolk,5154001,000925,Good Samaritan Hospital Medical Center,70 or Older,117,M,White,Not Span/Hispanic,2,Emergency,Home or Self Care,2019,CIR026,PERIPHERAL AND VISCERAL VASCULAR DISEASE,CAR008,ANGIOPLASTY AND RELATED VESSEL PROCEDURES (ENDOVASCULAR; EXCLUDING CAROTID),181,LOWER EXTREMITY ARTERIAL PROCEDURES,05,DISEASES AND DISORDERS OF THE CIRCULATORY SYSTEM,2,Moderate,Minor,Surgical,Medicare,Private Health Insurance,,,,true,79066,13559.24
Southern Tier,Broome,0303001,000058,United Health Services Hospitals Inc. - Wilson Medical Center,70 or Older,138,M,White,Not Span/Hispanic,7,Elective,Home w/ Home Health Services,2019,INJ033,"COMPLICATION OF CARDIOVASCULAR DEVICE, IMPLANT OR GRAFT, INITIAL ENCOUNTER",CAR015,PERIPHERAL ARTERIOVENOUS FISTULA AND SHUNT PROCEDURES,181,LOWER EXTREMITY ARTERIAL PROCEDURES,05,DISEASES AND DISORDERS OF THE CIRCULATORY SYSTEM,2,Moderate,Minor,Surgical,Medicare,Medicare,,,,false,46565.4,25518.63
New York City,Kings,7001020,001305,Maimonides Medical Center,70 or Older,113,M,White,Not Span/Hispanic,1,Elective,Home or Self Care,2019,CIR029,AORTIC; PERIPHERAL; AND VISCERAL ARTERY ANEURYSMS,CAR011,ANEURYSM REPAIR PROCEDURES,181,LOWER EXTREMITY ARTERIAL PROCEDURES,05,DISEASES AND DISORDERS OF THE CIRCULATORY SYSTEM,1,Minor,Minor,Surgical,Medicare,Medicare,Self-Pay,,,false,31220,11345.65
New York City,Kings,7001021,001306,New York - Presbyterian Brooklyn Methodist Hospital,70 or Older,112,M,White,Not Span/Hispanic,2,Emergency,Home or Self Care,2019,CIR011,CORONARY ATHEROSCLEROSIS AND OTHER HEART DISEASE,CAR008,ANGIOPLASTY AND RELATED VESSEL PROCEDURES (ENDOVASCULAR; EXCLUDING CAROTID),181,LOWER EXTREMITY ARTERIAL PROCEDURES,05,DISEASES AND DISORDERS OF THE CIRCULATORY SYSTEM,3,Major,Moderate,Surgical,Medicare,Private Health Insurance,Self-Pay,,,true,75002.3,18152.25
Western NY,Erie,1401005,000210,Erie County Medical Center,50 to 69,142,F,Black/African American,Not Span/Hispanic,13,Elective,Inpatient Rehabilitation Facility,2019,END003,DIABETES MELLITUS WITH COMPLICATION,CAR014,PERIPHERAL ARTERIAL BYPASS PROCEDURES,181,LOWER EXTREMITY ARTERIAL PROCEDURES,05,DISEASES AND DISORDERS OF THE CIRCULATORY SYSTEM,3,Major,Moderate,Surgical,Medicare,Medicaid,Medicare,,,false,75167.26,44989.42
Central NY,Onondaga,3301007,000635,University Hospital SUNY Health Science Center,70 or Older,132,M,White,Not Span/Hispanic,27,Emergency,Skilled Nursing Home,2019,END003,DIABETES MELLITUS WITH COMPLICATION,CAR014,PERIPHERAL ARTERIAL BYPASS PROCEDURES,181,LOWER EXTREMITY ARTERIAL PROCEDURES,05,DISEASES AND DISORDERS OF THE CIRCULATORY SYSTEM,4,Extreme,Extreme,Surgical,Medicare,Private Health Insurance,,,,true,338977.07,96583.26
Long Island,Nassau,2950001,000527,Mount Sinai South Nassau,70 or Older,114,M,Black/African American,Not Span/Hispanic,11,Emergency,Home or Self Care,2019,END003,DIABETES MELLITUS WITH COMPLICATION,CAR008,ANGIOPLASTY AND RELATED VESSEL PROCEDURES (ENDOVASCULAR; EXCLUDING CAROTID),181,LOWER EXTREMITY ARTERIAL PROCEDURES,05,DISEASES AND DISORDERS OF THE CIRCULATORY SYSTEM,4,Extreme,Extreme,Surgical,Medicare,Private Health Insurance,,,,true,314217.19,56904.33
Long Island,Nassau,2950001,000527,Mount Sinai South Nassau,50 to 69,115,M,Black/African American,Not Span/Hispanic,22,Emergency,Home or Self Care,2019,END003,DIABETES MELLITUS WITH COMPLICATION,IMG003,FLUOROSCOPIC GUIDANCE FOR CIRCULATORY SYSTEM PROCEDURES,181,LOWER EXTREMITY ARTERIAL PROCEDURES,05,DISEASES AND DISORDERS OF THE CIRCULATORY SYSTEM,3,Major,Moderate,Surgical,Medicare,Blue Cross/Blue Shield,,,,true,340860.27,67421.3
Capital/Adirond,Schenectady,4601001,000829,Ellis Hospital,50 to 69,123,F,White,Not Span/Hispanic,1,Elective,Home or Self Care,2019,CIR026,PERIPHERAL AND VISCERAL VASCULAR DISEASE,CAR007,"EMBOLECTOMY, ENDARTERECTOMY, AND RELATED VESSEL PROCEDURES (NON-ENDOVASCULAR; EXCLUDING CAROTID)",181,LOWER EXTREMITY ARTERIAL PROCEDURES,05,DISEASES AND DISORDERS OF THE CIRCULATORY SYSTEM,2,Moderate,Moderate,Surgical,Medicare,Medicare,Medicaid,,,false,19845.02,5112.66
Long Island,Nassau,2950001,000527,Mount Sinai South Nassau,30 to 49,115,M,Black/African American,Not Span/Hispanic,8,Emergency,Home or Self Care,2019,CIR026,PERIPHERAL AND VISCERAL VASCULAR DISEASE,CAR008,ANGIOPLASTY AND RELATED VESSEL PROCEDURES (ENDOVASCULAR; EXCLUDING CAROTID),181,LOWER EXTREMITY ARTERIAL PROCEDURES,05,DISEASES AND DISORDERS OF THE CIRCULATORY SYSTEM,2,Moderate,Minor,Surgical,Medicaid,Medicaid,,,,true,249906.21,52073.69
Capital/Adirond,Albany,0101004,000005,St. Peter's Hospital,70 or Older,125,M,White,Not Span/Hispanic,1,Elective,Home or Self Care,2019,CIR026,PERIPHERAL AND VISCERAL VASCULAR DISEASE,CAR007,"EMBOLECTOMY, ENDARTERECTOMY, AND RELATED VESSEL PROCEDURES (NON-ENDOVASCULAR; EXCLUDING CAROTID)",181,LOWER EXTREMITY ARTERIAL PROCEDURES,05,DISEASES AND DISORDERS OF THE CIRCULATORY SYSTEM,1,Minor,Minor,Surgical,Medicare,Medicare,,,,false,26576.45,10326.76
New York City,Kings,7001020,001305,Maimonides Medical Center,50 to 69,112,F,White,Spanish/Hispanic,5,Emergency,Home or Self Care,2019,END003,DIABETES MELLITUS WITH COMPLICATION,CAR008,ANGIOPLASTY AND RELATED VESSEL PROCEDURES (ENDOVASCULAR; EXCLUDING CAROTID),181,LOWER EXTREMITY ARTERIAL PROCEDURES,05,DISEASES AND DISORDERS OF THE CIRCULATORY SYSTEM,2,Moderate,Minor,Surgical,Medicare,Medicare,Self-Pay,,,true,47835.05,13330.27
Hudson Valley,Westchester,5957001,001139,Westchester Medical Center,50 to 69,105,M,White,Not Span/Hispanic,36,Urgent,Short-term Hospital,2019,END003,DIABETES MELLITUS WITH COMPLICATION,CAR007,"EMBOLECTOMY, ENDARTERECTOMY, AND RELATED VESSEL PROCEDURES (NON-ENDOVASCULAR; EXCLUDING CAROTID)",181,LOWER EXTREMITY ARTERIAL PROCEDURES,05,DISEASES AND DISORDERS OF THE CIRCULATORY SYSTEM,3,Major,Major,Surgical,Medicare,Private Health Insurance,Medicaid,,,false,1003169.95,189340.04
Hudson Valley,Westchester,5957001,001139,Westchester Medical Center,70 or Older,105,F,White,Not Span/Hispanic,15,Urgent,Home or Self Care,2019,END003,DIABETES MELLITUS WITH COMPLICATION,CAR007,"EMBOLECTOMY, ENDARTERECTOMY, AND RELATED VESSEL PROCEDURES (NON-ENDOVASCULAR; EXCLUDING CAROTID)",181,LOWER EXTREMITY ARTERIAL PROCEDURES,05,DISEASES AND DISORDERS OF THE CIRCULATORY SYSTEM,3,Major,Moderate,Surgical,Medicare,Private Health Insurance,,,,false,367227.85,65114.04
Central NY,Oneida,3202003,000599,Faxton-St Lukes Healthcare St Lukes Division,50 to 69,133,M,White,Unknown,3,Elective,Home or Self Care,2019,CIR026,PERIPHERAL AND VISCERAL VASCULAR DISEASE,CAR007,"EMBOLECTOMY, ENDARTERECTOMY, AND RELATED VESSEL PROCEDURES (NON-ENDOVASCULAR; EXCLUDING CAROTID)",181,LOWER EXTREMITY ARTERIAL PROCEDURES,05,DISEASES AND DISORDERS OF THE CIRCULATORY SYSTEM,1,Minor,Minor,Surgical,Medicare,Blue Cross/Blue Shield,,,,false,62621.55,26265.63