Hospital Service Area,Hospital County,Operating Certificate Number,Permanent Facility Id,Facility Name,Age Group,Zip Code - 3 digits,Gender,Race,Ethnicity,Length of Stay,Type of Admission,Patient Disposition,Discharge Year,CCS Diagnosis Code,CCS Diagnosis Description,CCS Procedure Code,CCS Procedure Description,APR DRG Code,APR DRG Description,APR MDC Code,APR MDC Description,APR Severity of Illness Code,APR Severity of Illness Description,APR Risk of Mortality,APR Medical Surgical Description,Payment Typology 1,Payment Typology 2,Payment Typology 3,Birth Weight,Abortion Edit Indicator,Emergency Department Indicator,Total Charges,Total Costs
Long Island,Nassau,2908000,000511,NYU Langone Hospital-Long Island,50 to 69,110,M,White,Not Span/Hispanic,6,Emergency,Home or Self Care,2019,END003,DIABETES MELLITUS WITH COMPLICATION,CAR008,ANGIOPLASTY AND RELATED VESSEL PROCEDURES (ENDOVASCULAR; EXCLUDING CAROTID),181,LOWER EXTREMITY ARTERIAL PROCEDURES,05,DISEASES AND DISORDERS OF THE CIRCULATORY SYSTEM,3,Major,Minor,Surgical,Blue Cross/Blue Shield,,,,,true,204919.18,33515.8
Long Island,Nassau,2908000,000511,NYU Langone Hospital-Long Island,70 or Older,110,M,White,Not Span/Hispanic,11,Emergency,Home w/ Home Health Services,2019,END003,DIABETES MELLITUS WITH COMPLICATION,CAR008,ANGIOPLASTY AND RELATED VESSEL PROCEDURES (ENDOVASCULAR; EXCLUDING CAROTID),181,LOWER EXTREMITY ARTERIAL PROCEDURES,05,DISEASES AND DISORDERS OF THE CIRCULATORY SYSTEM,3,Major,Major,Surgical,Medicare,Medicare,Private Health Insurance,,,true,292438.41,46940.23
Long Island,Nassau,2908000,000511,NYU Langone Hospital-Long Island,70 or Older,117,M,White,Not Span/Hispanic,1,Elective,Home or Self Care,2019,CIR029,AORTIC; PERIPHERAL; AND VISCERAL ARTERY ANEURYSMS,CAR011,ANEURYSM REPAIR PROCEDURES,181,LOWER EXTREMITY ARTERIAL PROCEDURES,05,DISEASES AND DISORDERS OF THE CIRCULATORY SYSTEM,1,Minor,Minor,Surgical,Medicare,Medicare,Private Health Insurance,,,false,400310.65,64370.21
Long Island,Nassau,2908000,000511,NYU Langone Hospital-Long Island,30 to 49,117,M,White,Not Span/Hispanic,6,Urgent,Home or Self Care,2019,INJ033,"COMPLICATION OF CARDIOVASCULAR DEVICE, IMPLANT OR GRAFT, INITIAL ENCOUNTER",CAR007,"EMBOLECTOMY, ENDARTERECTOMY, AND RELATED VESSEL PROCEDURES (NON-ENDOVASCULAR; EXCLUDING CAROTID)",181,LOWER EXTREMITY ARTERIAL PROCEDURES,05,DISEASES AND DISORDERS OF THE CIRCULATORY SYSTEM,2,Moderate,Minor,Surgical,Private Health Insurance,,,,,false,320913.16,48626.33
Long Island,Nassau,2908000,000511,NYU Langone Hospital-Long Island,50 to 69,115,M,Other Race,Spanish/Hispanic,19,Emergency,Inpatient Rehabilitation Facility,2019,END003,DIABETES MELLITUS WITH COMPLICATION,CAR008,ANGIOPLASTY AND RELATED VESSEL PROCEDURES (ENDOVASCULAR; EXCLUDING CAROTID),181,LOWER EXTREMITY ARTERIAL PROCEDURES,05,DISEASES AND DISORDERS OF THE CIRCULATORY SYSTEM,3,Major,Minor,Surgical,Federal/State/Local/VA,,,,,true,368348.73,67429.99
Long Island,Nassau,2908000,000511,NYU Langone Hospital-Long Island,30 to 49,117,M,White,Not Span/Hispanic,18,Emergency,Inpatient Rehabilitation Facility,2019,INJ033,"COMPLICATION OF CARDIOVASCULAR DEVICE, IMPLANT OR GRAFT, INITIAL ENCOUNTER",MST024,BELOW KNEE AMPUTATION,181,LOWER EXTREMITY ARTERIAL PROCEDURES,05,DISEASES AND DISORDERS OF THE CIRCULATORY SYSTEM,3,Major,Major,Surgical,Private Health Insurance,,,,,true,703192.01,109917.96
Long Island,Nassau,2908000,000511,NYU Langone Hospital-Long Island,50 to 69,115,M,White,Spanish/Hispanic,1,Elective,Home or Self Care,2019,END003,DIABETES MELLITUS WITH COMPLICATION,CAR014,PERIPHERAL ARTERIAL BYPASS PROCEDURES,181,LOWER EXTREMITY ARTERIAL PROCEDURES,05,DISEASES AND DISORDERS OF THE CIRCULATORY SYSTEM,2,Moderate,Moderate,Surgical,Medicare,Medicare,,,,false,116938.76,18407.51
Long Island,Nassau,2908000,000511,NYU Langone Hospital-Long Island,50 to 69,115,M,White,Not Span/Hispanic,1,Elective,Home or Self Care,2019,END003,DIABETES MELLITUS WITH COMPLICATION,CAR014,PERIPHERAL ARTERIAL BYPASS PROCEDURES,181,LOWER EXTREMITY ARTERIAL PROCEDURES,05,DISEASES AND DISORDERS OF THE CIRCULATORY SYSTEM,1,Minor,Minor,Surgical,Blue Cross/Blue Shield,,,,,false,188594.02,29650.67
Long Island,Nassau,2908000,000511,NYU Langone Hospital-Long Island,50 to 69,114,M,Black/African American,Not Span/Hispanic,9,Emergency,Skilled Nursing Home,2019,END003,DIABETES MELLITUS WITH COMPLICATION,MST023,TOE AND MID FOOT AMPUTATION,181,LOWER EXTREMITY ARTERIAL PROCEDURES,05,DISEASES AND DISORDERS OF THE CIRCULATORY SYSTEM,3,Major,Moderate,Surgical,Private Health Insurance,,,,,true,181745.84,35602.41
Long Island,Nassau,2908000,000511,NYU Langone Hospital-Long Island,70 or Older,117,F,White,Not Span/Hispanic,3,Elective,Home w/ Home Health Services,2019,END003,DIABETES MELLITUS WITH COMPLICATION,CAR007,"EMBOLECTOMY, ENDARTERECTOMY, AND RELATED VESSEL PROCEDURES (NON-ENDOVASCULAR; EXCLUDING CAROTID)",181,LOWER EXTREMITY ARTERIAL PROCEDURES,05,DISEASES AND DISORDERS OF THE CIRCULATORY SYSTEM,3,Major,Major,Surgical,Medicare,Medicare,Private Health Insurance,,,false,185222.72,28895.46
Long Island,Nassau,2908000,000511,NYU Langone Hospital-Long Island,50 to 69,115,M,White,Not Span/Hispanic,1,Elective,Home or Self Care,2019,END003,DIABETES MELLITUS WITH COMPLICATION,CAR007,"EMBOLECTOMY, ENDARTERECTOMY, AND RELATED VESSEL PROCEDURES (NON-ENDOVASCULAR; EXCLUDING CAROTID)",181,LOWER EXTREMITY ARTERIAL PROCEDURES,05,DISEASES AND DISORDERS OF THE CIRCULATORY SYSTEM,2,Moderate,Moderate,Surgical,Medicare,Medicare,Blue Cross/Blue Shield,,,false,81954.47,12519.18
Long Island,Nassau,2908000,000511,NYU Langone Hospital-Long Island,50 to 69,115,M,White,Not Span/Hispanic,3,Emergency,Home or Self Care,2019,END003,DIABETES MELLITUS WITH COMPLICATION,CAR008,ANGIOPLASTY AND RELATED VESSEL PROCEDURES (ENDOVASCULAR; EXCLUDING CAROTID),181,LOWER EXTREMITY ARTERIAL PROCEDURES,05,DISEASES AND DISORDERS OF THE CIRCULATORY SYSTEM,3,Major,Moderate,Surgical,Medicare,Medicare,Private Health Insurance,,,true,96342.32,15708.09
Long Island,Nassau,2908000,000511,NYU Langone Hospital-Long Island,70 or Older,110,F,White,Not Span/Hispanic,9,Emergency,Skilled Nursing Home,2019,END003,DIABETES MELLITUS WITH COMPLICATION,CAR008,ANGIOPLASTY AND RELATED VESSEL PROCEDURES (ENDOVASCULAR; EXCLUDING CAROTID),181,LOWER EXTREMITY ARTERIAL PROCEDURES,05,DISEASES AND DISORDERS OF THE CIRCULATORY SYSTEM,3,Major,Major,Surgical,Medicare,Medicare,Blue Cross/Blue Shield,,,true,282338.34,47821.86
Long Island,Nassau,2908000,000511,NYU Langone Hospital-Long Island,50 to 69,116,M,White,Not Span/Hispanic,2,Elective,Home w/ Home Health Services,2019,INJ033,"COMPLICATION OF CARDIOVASCULAR DEVICE, IMPLANT OR GRAFT, INITIAL ENCOUNTER",CAR014,PERIPHERAL ARTERIAL BYPASS PROCEDURES,181,LOWER EXTREMITY ARTERIAL PROCEDURES,05,DISEASES AND DISORDERS OF THE CIRCULATORY SYSTEM,2,Moderate,Moderate,Surgical,Medicaid,Medicaid,,,,false,139765.26,22660.19
Long Island,Nassau,2908000,000511,NYU Langone Hospital-Long Island,70 or Older,117,M,Black/African American,Not Span/Hispanic,1,Elective,Home w/ Home Health Services,2019,INJ033,"COMPLICATION OF CARDIOVASCULAR DEVICE, IMPLANT OR GRAFT, INITIAL ENCOUNTER",CAR029,"CARDIOVASCULAR DEVICE PROCEDURES, NEC",181,LOWER EXTREMITY ARTERIAL PROCEDURES,05,DISEASES AND DISORDERS OF THE CIRCULATORY SYSTEM,2,Moderate,Moderate,Surgical,Medicare,Medicare,Private Health Insurance,,,false,35216.07,5743.13
Long Island,Nassau,2908000,000511,NYU Langone Hospital-Long Island,70 or Older,115,F,White,Not Span/Hispanic,8,Elective,Inpatient Rehabilitation Facility,2019,CIR026,PERIPHERAL AND VISCERAL VASCULAR DISEASE,CAR014,PERIPHERAL ARTERIAL BYPASS PROCEDURES,181,LOWER EXTREMITY ARTERIAL PROCEDURES,05,DISEASES AND DISORDERS OF THE CIRCULATORY SYSTEM,3,Major,Major,Surgical,Medicare,Medicare,,,,false,334231.51,55994.51
Long Island,Nassau,2908000,000511,NYU Langone Hospital-Long Island,70 or Older,117,M,White,Not Span/Hispanic,3,Elective,Home w/ Home Health Services,2019,END003,DIABETES MELLITUS WITH COMPLICATION,CAR007,"EMBOLECTOMY, ENDARTERECTOMY, AND RELATED VESSEL PROCEDURES (NON-ENDOVASCULAR; EXCLUDING CAROTID)",181,LOWER EXTREMITY ARTERIAL PROCEDURES,05,DISEASES AND DISORDERS OF THE CIRCULATORY SYSTEM,1,Minor,Moderate,Surgical,Medicare,Medicare,Private Health Insurance,,,false,161812.75,26419.9
Long Island,Nassau,2908000,000511,NYU Langone Hospital-Long Island,70 or Older,115,F,White,Not Span/Hispanic,2,Elective,Home or Self Care,2019,CIR026,PERIPHERAL AND VISCERAL VASCULAR DISEASE,CAR007,"EMBOLECTOMY, ENDARTERECTOMY, AND RELATED VESSEL PROCEDURES (NON-ENDOVASCULAR; EXCLUDING CAROTID)",181,LOWER EXTREMITY ARTERIAL PROCEDURES,05,DISEASES AND DISORDERS OF THE CIRCULATORY SYSTEM,3,Major,Major,Surgical,Medicare,Medicare,Private Health Insurance,,,false,120193.23,18988.72
Long Island,Nassau,2908000,000511,NYU Langone Hospital-Long Island,70 or Older,115,F,White,Not Span/Hispanic,11,Emergency,Skilled Nursing Home,2019,CIR026,PERIPHERAL AND VISCERAL VASCULAR DISEASE,CAR014,PERIPHERAL ARTERIAL BYPASS PROCEDURES,181,LOWER EXTREMITY ARTERIAL PROCEDURES,05,DISEASES AND DISORDERS OF THE CIRCULATORY SYSTEM,3,Major,Moderate,Surgical,Medicare,Medicare,Blue Cross/Blue Shield,,,true,404520.75,65445.83
Long Island,Nassau,2908000,000511,NYU Langone Hospital-Long Island,70 or Older,117,F,White,Not Span/Hispanic,3,Emergency,Home or Self Care,2019,CIR038,POSTPROCEDURAL OR POSTOPERATIVE CIRCULATORY SYSTEM COMPLICATION,CAR012,VESSEL REPAIR AND REPLACEMENT,181,LOWER EXTREMITY ARTERIAL PROCEDURES,05,DISEASES AND DISORDERS OF THE CIRCULATORY SYSTEM,2,Moderate,Moderate,Surgical,Medicare,Medicare,Blue Cross/Blue Shield,,,true,82542.25,13979.35
Long Island,Nassau,2908000,000511,NYU Langone Hospital-Long Island,70 or Older,115,M,White,Not Span/Hispanic,1,Elective,Home or Self Care,2019,CIR029,AORTIC; PERIPHERAL; AND VISCERAL ARTERY ANEURYSMS,CAR014,PERIPHERAL ARTERIAL BYPASS PROCEDURES,181,LOWER EXTREMITY ARTERIAL PROCEDURES,05,DISEASES AND DISORDERS OF THE CIRCULATORY SYSTEM,1,Minor,Minor,Surgical,Medicare,Medicare,Blue Cross/Blue Shield,,,false,78464.43,12185.41
Long Island,Nassau,2908000,000511,NYU Langone Hospital-Long Island,50 to 69,117,F,White,Not Span/Hispanic,9,Emergency,Home w/ Home Health Services,2019,END003,DIABETES MELLITUS WITH COMPLICATION,CAR008,ANGIOPLASTY AND RELATED VESSEL PROCEDURES (ENDOVASCULAR; EXCLUDING CAROTID),181,LOWER EXTREMITY ARTERIAL PROCEDURES,05,DISEASES AND DISORDERS OF THE CIRCULATORY SYSTEM,3,Major,Major,Surgical,Medicare,Medicare,Medicaid,,,true,229261.49,37544.8
Long Island,Nassau,2908000,000511,NYU Langone Hospital-Long Island,30 to 49,115,M,Other Race,Spanish/Hispanic,3,Emergency,Home or Self Care,2019,CIR033,ACUTE PHLEBITIS; THROMBOPHLEBITIS AND THROMBOEMBOLISM,ADM005,ADMINISTRATION OF THROMBOLYTICS AND PLATELET INHIBITORS,181,LOWER EXTREMITY ARTERIAL PROCEDURES,05,DISEASES AND DISORDERS OF THE CIRCULATORY SYSTEM,2,Moderate,Minor,Surgical,Medicaid,Medicaid,,,,true,163639.03,25410.18
Long Island,Nassau,2908000,000511,NYU Langone Hospital-Long Island,50 to 69,115,M,White,Not Span/Hispanic,12,Emergency,Home w/ Home Health Services,2019,END003,DIABETES MELLITUS WITH COMPLICATION,CAR014,PERIPHERAL ARTERIAL BYPASS PROCEDURES,181,LOWER EXTREMITY ARTERIAL PROCEDURES,05,DISEASES AND DISORDERS OF THE CIRCULATORY SYSTEM,3,Major,Major,Surgical,Federal/State/Local/VA,,,,,true,277675.97,48073.63
Long Island,Nassau,2908000,000511,NYU Langone Hospital-Long Island,70 or Older,115,M,White,Not Span/Hispanic,3,Urgent,Skilled Nursing Home,2019,CIR026,PERIPHERAL AND VISCERAL VASCULAR DISEASE,CAR007,"EMBOLECTOMY, ENDARTERECTOMY, AND RELATED VESSEL PROCEDURES (NON-ENDOVASCULAR; EXCLUDING CAROTID)",181,LOWER EXTREMITY ARTERIAL PROCEDURES,05,DISEASES AND DISORDERS OF THE CIRCULATORY SYSTEM,2,Moderate,Moderate,Surgical,Medicare,Medicare,Blue Cross/Blue Shield,,,false,121615.07,20065.02
Long Island,Nassau,2908000,000511,NYU Langone Hospital-Long Island,70 or Older,110,M,White,Not Span/Hispanic,2,Elective,Home w/ Home Health Services,2019,CIR026,PERIPHERAL AND VISCERAL VASCULAR DISEASE,CAR014,PERIPHERAL ARTERIAL BYPASS PROCEDURES,181,LOWER EXTREMITY ARTERIAL PROCEDURES,05,DISEASES AND DISORDERS OF THE CIRCULATORY SYSTEM,2,Moderate,Moderate,Surgical,Medicare,Medicare,,,,false,133303.77,21654.04
Long Island,Nassau,2908000,000511,NYU Langone Hospital-Long Island,50 to 69,115,M,White,Not Span/Hispanic,2,Elective,Home or Self Care,2019,CIR026,PERIPHERAL AND VISCERAL VASCULAR DISEASE,CAR014,PERIPHERAL ARTERIAL BYPASS PROCEDURES,181,LOWER EXTREMITY ARTERIAL PROCEDURES,05,DISEASES AND DISORDERS OF THE CIRCULATORY SYSTEM,1,Minor,Minor,Surgical,Blue Cross/Blue Shield,Medicare,,,,false,125806.83,20466.75
Long Island,Nassau,2908000,000511,NYU Langone Hospital-Long Island,70 or Older,115,F,White,Not Span/Hispanic,12,Emergency,Expired,2019,END003,DIABETES MELLITUS WITH COMPLICATION,CAR007,"EMBOLECTOMY, ENDARTERECTOMY, AND RELATED VESSEL PROCEDURES (NON-ENDOVASCULAR; EXCLUDING CAROTID)",181,LOWER EXTREMITY ARTERIAL PROCEDURES,05,DISEASES AND DISORDERS OF THE CIRCULATORY SYSTEM,3,Major,Major,Surgical,Medicare,Medicare,Private Health Insurance,,,true,246159.85,40902.5
Long Island,Nassau,2908000,000511,NYU Langone Hospital-Long Island,50 to 69,115,M,White,Not Span/Hispanic,6,Emergency,Home or Self Care,2019,CIR029,AORTIC; PERIPHERAL; AND VISCERAL ARTERY ANEURYSMS,CAR014,PERIPHERAL ARTERIAL BYPASS PROCEDURES,181,LOWER EXTREMITY ARTERIAL PROCEDURES,05,DISEASES AND DISORDERS OF THE CIRCULATORY SYSTEM,2,Moderate,Minor,Surgical,Medicare,Medicare,Blue Cross/Blue Shield,,,true,174058.14,29077.39
Long Island,Nassau,2908000,000511,NYU Langone Hospital-Long Island,70 or Older,115,M,White,Not Span/Hispanic,9,Emergency,Skilled Nursing Home,2019,END003,DIABETES MELLITUS WITH COMPLICATION,CAR014,PERIPHERAL ARTERIAL BYPASS PROCEDURES,181,LOWER EXTREMITY ARTERIAL PROCEDURES,05,DISEASES AND DISORDERS OF THE CIRCULATORY SYSTEM,3,Major,Major,Surgical,Medicare,Medicare,,,,true,248472.82,42669.05
Long Island,Nassau,2908000,000511,NYU Langone Hospital-Long Island,50 to 69,115,F,White,Spanish/Hispanic,1,Elective,Home or Self Care,2019,END003,DIABETES MELLITUS WITH COMPLICATION,CAR014,PERIPHERAL ARTERIAL BYPASS PROCEDURES,181,LOWER EXTREMITY ARTERIAL PROCEDURES,05,DISEASES AND DISORDERS OF THE CIRCULATORY SYSTEM,2,Moderate,Minor,Surgical,Medicare,Medicare,Medicaid,,,false,135952.63,29672.89
Long Island,Nassau,2908000,000511,NYU Langone Hospital-Long Island,70 or Older,117,F,White,Not Span/Hispanic,3,Elective,Home w/ Home Health Services,2019,END003,DIABETES MELLITUS WITH COMPLICATION,CAR008,ANGIOPLASTY AND RELATED VESSEL PROCEDURES (ENDOVASCULAR; EXCLUDING CAROTID),181,LOWER EXTREMITY ARTERIAL PROCEDURES,05,DISEASES AND DISORDERS OF THE CIRCULATORY SYSTEM,3,Major,Major,Surgical,Medicare,Medicare,Private Health Insurance,,,false,79231.88,14268.42
Long Island,Nassau,2908000,000511,NYU Langone Hospital-Long Island,70 or Older,117,F,White,Not Span/Hispanic,5,Elective,Skilled Nursing Home,2019,CIR026,PERIPHERAL AND VISCERAL VASCULAR DISEASE,CAR014,PERIPHERAL ARTERIAL BYPASS PROCEDURES,181,LOWER EXTREMITY ARTERIAL PROCEDURES,05,DISEASES AND DISORDERS OF THE CIRCULATORY SYSTEM,3,Major,Moderate,Surgical,Medicare,Medicare,Private Health Insurance,,,false,195152.68,31521.11
Long Island,Nassau,2908000,000511,NYU Langone Hospital-Long Island,50 to 69,115,F,Other Race,Spanish/Hispanic,10,Emergency,Home w/ Home Health Services,2019,END003,DIABETES MELLITUS WITH COMPLICATION,CAR008,ANGIOPLASTY AND RELATED VESSEL PROCEDURES (ENDOVASCULAR; EXCLUDING CAROTID),181,LOWER EXTREMITY ARTERIAL PROCEDURES,05,DISEASES AND DISORDERS OF THE CIRCULATORY SYSTEM,3,Major,Moderate,Surgical,Medicare,Medicare,,,,true,187304.99,37610.6
Long Island,Nassau,2908000,000511,NYU Langone Hospital-Long Island,50 to 69,115,M,White,Not Span/Hispanic,4,Emergency,Home or Self Care,2019,INJ033,"COMPLICATION OF CARDIOVASCULAR DEVICE, IMPLANT OR GRAFT, INITIAL ENCOUNTER",CAR007,"EMBOLECTOMY, ENDARTERECTOMY, AND RELATED VESSEL PROCEDURES (NON-ENDOVASCULAR; EXCLUDING CAROTID)",181,LOWER EXTREMITY ARTERIAL PROCEDURES,05,DISEASES AND DISORDERS OF THE CIRCULATORY SYSTEM,2,Moderate,Minor,Surgical,Medicaid,Medicaid,,,,true,157162.79,23638.38
Long Island,Nassau,2908000,000511,NYU Langone Hospital-Long Island,70 or Older,110,M,Other Race,Spanish/Hispanic,13,Emergency,Expired,2019,RSP011,"PLEURISY, PLEURAL EFFUSION AND PULMONARY COLLAPSE",IMG002,FLUOROSCOPIC ANGIOGRAPHY (EXCLUDING CORONARY),181,LOWER EXTREMITY ARTERIAL PROCEDURES,05,DISEASES AND DISORDERS OF THE CIRCULATORY SYSTEM,4,Extreme,Extreme,Surgical,Medicare,Medicare,,,,true,355051,55405.4
Long Island,Nassau,2908000,000511,NYU Langone Hospital-Long Island,70 or Older,113,M,Other Race,Not Span/Hispanic,9,Emergency,Home or Self Care,2019,INJ033,"COMPLICATION OF CARDIOVASCULAR DEVICE, IMPLANT OR GRAFT, INITIAL ENCOUNTER",CAR011,ANEURYSM REPAIR PROCEDURES,181,LOWER EXTREMITY ARTERIAL PROCEDURES,05,DISEASES AND DISORDERS OF THE CIRCULATORY SYSTEM,4,Extreme,Extreme,Surgical,Medicare,Medicaid,Medicare,,,true,441784.33,71127.61
Long Island,Nassau,2908000,000511,NYU Langone Hospital-Long Island,70 or Older,115,F,Black/African American,Not Span/Hispanic,13,Emergency,Home w/ Home Health Services,2019,CIR026,PERIPHERAL AND VISCERAL VASCULAR DISEASE,MST025,ABOVE KNEE AND OTHER PROXIMAL LOWER EXTREMITY AMPUTATION,181,LOWER EXTREMITY ARTERIAL PROCEDURES,05,DISEASES AND DISORDERS OF THE CIRCULATORY SYSTEM,4,Extreme,Extreme,Surgical,Medicare,Medicare,Blue Cross/Blue Shield,,,true,318563.86,52300.28
Long Island,Nassau,2908000,000511,NYU Langone Hospital-Long Island,70 or Older,115,F,White,Not Span/Hispanic,3,Trauma,Home w/ Home Health Services,2019,INJ016,"INJURY TO BLOOD VESSELS, INITIAL ENCOUNTER",MST028,"SUBCUTANEOUS TISSUE AND FASCIA PROCEDURES, NEC",181,LOWER EXTREMITY ARTERIAL PROCEDURES,05,DISEASES AND DISORDERS OF THE CIRCULATORY SYSTEM,3,Major,Major,Surgical,Medicare,Medicare,,,,true,271526.22,34272.61
Long Island,Nassau,2908000,000511,NYU Langone Hospital-Long Island,70 or Older,115,F,White,Not Span/Hispanic,3,Elective,Home w/ Home Health Services,2019,CIR026,PERIPHERAL AND VISCERAL VASCULAR DISEASE,CAR007,"EMBOLECTOMY, ENDARTERECTOMY, AND RELATED VESSEL PROCEDURES (NON-ENDOVASCULAR; EXCLUDING CAROTID)",181,LOWER EXTREMITY ARTERIAL PROCEDURES,05,DISEASES AND DISORDERS OF THE CIRCULATORY SYSTEM,2,Moderate,Moderate,Surgical,Medicare,Medicare,Blue Cross/Blue Shield,,,false,148446.17,24453.53
Long Island,Nassau,2908000,000511,NYU Langone Hospital-Long Island,50 to 69,115,F,White,Not Span/Hispanic,16,Emergency,Skilled Nursing Home,2019,END003,DIABETES MELLITUS WITH COMPLICATION,IMG002,FLUOROSCOPIC ANGIOGRAPHY (EXCLUDING CORONARY),181,LOWER EXTREMITY ARTERIAL PROCEDURES,05,DISEASES AND DISORDERS OF THE CIRCULATORY SYSTEM,3,Major,Major,Surgical,Private Health Insurance,,,,,true,436693.95,74799.35
Long Island,Nassau,2908000,000511,NYU Langone Hospital-Long Island,70 or Older,114,M,Other Race,Not Span/Hispanic,2,Elective,Home w/ Home Health Services,2019,END003,DIABETES MELLITUS WITH COMPLICATION,CAR014,PERIPHERAL ARTERIAL BYPASS PROCEDURES,181,LOWER EXTREMITY ARTERIAL PROCEDURES,05,DISEASES AND DISORDERS OF THE CIRCULATORY SYSTEM,3,Major,Moderate,Surgical,Medicare,Medicare,Medicaid,,,false,185443.03,28960.35
Long Island,Nassau,2908000,000511,NYU Langone Hospital-Long Island,70 or Older,115,F,White,Not Span/Hispanic,1,Elective,Home or Self Care,2019,CIR026,PERIPHERAL AND VISCERAL VASCULAR DISEASE,CAR012,VESSEL REPAIR AND REPLACEMENT,181,LOWER EXTREMITY ARTERIAL PROCEDURES,05,DISEASES AND DISORDERS OF THE CIRCULATORY SYSTEM,1,Minor,Minor,Surgical,Medicare,Medicare,Private Health Insurance,,,false,85020.82,13431.5
Long Island,Nassau,2908000,000511,NYU Langone Hospital-Long Island,70 or Older,110,F,White,Not Span/Hispanic,18,Emergency,Skilled Nursing Home,2019,CIR030,AORTIC AND PERIPHERAL ARTERIAL EMBOLISM OR THROMBOSIS,CAR007,"EMBOLECTOMY, ENDARTERECTOMY, AND RELATED VESSEL PROCEDURES (NON-ENDOVASCULAR; EXCLUDING CAROTID)",181,LOWER EXTREMITY ARTERIAL PROCEDURES,05,DISEASES AND DISORDERS OF THE CIRCULATORY SYSTEM,4,Extreme,Extreme,Surgical,Medicare,Medicare,,,,true,453042.01,76380.31
Long Island,Nassau,2908000,000511,NYU Langone Hospital-Long Island,70 or Older,117,M,White,Not Span/Hispanic,3,Elective,Home w/ Home Health Services,2019,CIR029,AORTIC; PERIPHERAL; AND VISCERAL ARTERY ANEURYSMS,CAR011,ANEURYSM REPAIR PROCEDURES,181,LOWER EXTREMITY ARTERIAL PROCEDURES,05,DISEASES AND DISORDERS OF THE CIRCULATORY SYSTEM,3,Major,Major,Surgical,Medicare,Medicare,Private Health Insurance,,,false,255498.7,38985.38
Long Island,Nassau,2908000,000511,NYU Langone Hospital-Long Island,70 or Older,115,M,White,Not Span/Hispanic,25,Emergency,Skilled Nursing Home,2019,CIR030,AORTIC AND PERIPHERAL ARTERIAL EMBOLISM OR THROMBOSIS,CAR007,"EMBOLECTOMY, ENDARTERECTOMY, AND RELATED VESSEL PROCEDURES (NON-ENDOVASCULAR; EXCLUDING CAROTID)",181,LOWER EXTREMITY ARTERIAL PROCEDURES,05,DISEASES AND DISORDERS OF THE CIRCULATORY SYSTEM,4,Extreme,Extreme,Surgical,Medicare,Medicare,Blue Cross/Blue Shield,,,true,736199.88,110050.86
Long Island,Nassau,2908000,000511,NYU Langone Hospital-Long Island,70 or Older,115,F,White,Not Span/Hispanic,12,Emergency,Skilled Nursing Home,2019,CIR026,PERIPHERAL AND VISCERAL VASCULAR DISEASE,CAR008,ANGIOPLASTY AND RELATED VESSEL PROCEDURES (ENDOVASCULAR; EXCLUDING CAROTID),181,LOWER EXTREMITY ARTERIAL PROCEDURES,05,DISEASES AND DISORDERS OF THE CIRCULATORY SYSTEM,3,Major,Moderate,Surgical,Medicare,Medicare,Private Health Insurance,,,true,249922.07,46231.48
Long Island,Nassau,2908000,000511,NYU Langone Hospital-Long Island,30 to 49,117,F,White,Not Span/Hispanic,2,Urgent,Home or Self Care,2019,INJ037,"COMPLICATION OF OTHER SURGICAL OR MEDICAL CARE, INJURY, INITIAL ENCOUNTER",CAR014,PERIPHERAL ARTERIAL BYPASS PROCEDURES,181,LOWER EXTREMITY ARTERIAL PROCEDURES,05,DISEASES AND DISORDERS OF THE CIRCULATORY SYSTEM,3,Major,Moderate,Surgical,Medicaid,Medicaid,,,,false,148554.85,23814.3
Long Island,Nassau,2908000,000511,NYU Langone Hospital-Long Island,70 or Older,117,F,Black/African American,Not Span/Hispanic,20,Emergency,Skilled Nursing Home,2019,CIR030,AORTIC AND PERIPHERAL ARTERIAL EMBOLISM OR THROMBOSIS,CAR007,"EMBOLECTOMY, ENDARTERECTOMY, AND RELATED VESSEL PROCEDURES (NON-ENDOVASCULAR; EXCLUDING CAROTID)",181,LOWER EXTREMITY ARTERIAL PROCEDURES,05,DISEASES AND DISORDERS OF THE CIRCULATORY SYSTEM,4,Extreme,Major,Surgical,Medicare,Medicare,Blue Cross/Blue Shield,,,true,321030.14,59786.41
Long Island,Nassau,2908000,000511,NYU Langone Hospital-Long Island,70 or Older,115,F,White,Not Span/Hispanic,6,Emergency,Expired,2019,CIR009,ACUTE MYOCARDIAL INFARCTION,CAR012,VESSEL REPAIR AND REPLACEMENT,181,LOWER EXTREMITY ARTERIAL PROCEDURES,05,DISEASES AND DISORDERS OF THE CIRCULATORY SYSTEM,4,Extreme,Extreme,Surgical,Medicare,Medicare,Private Health Insurance,,,true,326269.81,44581.21
Long Island,Nassau,2908000,000511,NYU Langone Hospital-Long Island,70 or Older,115,M,Black/African American,Not Span/Hispanic,9,Emergency,Home w/ Home Health Services,2019,INJ033,"COMPLICATION OF CARDIOVASCULAR DEVICE, IMPLANT OR GRAFT, INITIAL ENCOUNTER",CAR008,ANGIOPLASTY AND RELATED VESSEL PROCEDURES (ENDOVASCULAR; EXCLUDING CAROTID),181,LOWER EXTREMITY ARTERIAL PROCEDURES,05,DISEASES AND DISORDERS OF THE CIRCULATORY SYSTEM,3,Major,Major,Surgical,Medicare,Medicare,,,,true,247823.09,42709.72
Long Island,Nassau,2908000,000511,NYU Langone Hospital-Long Island,70 or Older,118,M,White,Unknown,3,Emergency,Home or Self Care,2019,CIR026,PERIPHERAL AND VISCERAL VASCULAR DISEASE,CAR008,ANGIOPLASTY AND RELATED VESSEL PROCEDURES (ENDOVASCULAR; EXCLUDING CAROTID),181,LOWER EXTREMITY ARTERIAL PROCEDURES,05,DISEASES AND DISORDERS OF THE CIRCULATORY SYSTEM,3,Major,Moderate,Surgical,Medicare,Medicare,,,,true,110715.02,17955.79