Hospital Service Area,Hospital County,Operating Certificate Number,Permanent Facility Id,Facility Name,Age Group,Zip Code - 3 digits,Gender,Race,Ethnicity,Length of Stay,Type of Admission,Patient Disposition,Discharge Year,CCS Diagnosis Code,CCS Diagnosis Description,CCS Procedure Code,CCS Procedure Description,APR DRG Code,APR DRG Description,APR MDC Code,APR MDC Description,APR Severity of Illness Code,APR Severity of Illness Description,APR Risk of Mortality,APR Medical Surgical Description,Payment Typology 1,Payment Typology 2,Payment Typology 3,Birth Weight,Abortion Edit Indicator,Emergency Department Indicator,Total Charges,Total Costs
Long Island,Suffolk,5123000,000885,Long Island Community Hospital,70 or Older,119,M,White,Not Span/Hispanic,15,Emergency,Home or Self Care,2020,END003,DIABETES MELLITUS WITH COMPLICATION,MST023,TOE AND MID FOOT AMPUTATION,181,LOWER EXTREMITY ARTERIAL PROCEDURES,05,DISEASES AND DISORDERS OF THE CIRCULATORY SYSTEM,3,Major,Major,Surgical,Medicare,Medicare,Private Health Insurance,,,Y,176517.16,38150.64
Long Island,Suffolk,5123000,000885,Long Island Community Hospital,70 or Older,119,M,White,Not Span/Hispanic,6,Emergency,Short-term Hospital,2020,INJ033,"COMPLICATION OF CARDIOVASCULAR DEVICE, IMPLANT OR GRAFT, INITIAL ENCOUNTER",CAR007,"EMBOLECTOMY, ENDARTERECTOMY, AND RELATED VESSEL PROCEDURES (NON-ENDOVASCULAR; EXCLUDING CAROTID)",181,LOWER EXTREMITY ARTERIAL PROCEDURES,05,DISEASES AND DISORDERS OF THE CIRCULATORY SYSTEM,2,Moderate,Major,Surgical,Medicare,Medicare,Private Health Insurance,,,Y,74540.82,15533.28
Long Island,Suffolk,5123000,000885,Long Island Community Hospital,70 or Older,119,F,White,Not Span/Hispanic,12,Emergency,Short-term Hospital,2020,CIR030,AORTIC AND PERIPHERAL ARTERIAL EMBOLISM OR THROMBOSIS,CAR008,ANGIOPLASTY AND RELATED VESSEL PROCEDURES (ENDOVASCULAR; EXCLUDING CAROTID),181,LOWER EXTREMITY ARTERIAL PROCEDURES,05,DISEASES AND DISORDERS OF THE CIRCULATORY SYSTEM,3,Major,Major,Surgical,Medicare,,,,,Y,175381.81,29886.39
Long Island,Suffolk,5123000,000885,Long Island Community Hospital,50 to 69,119,F,White,Not Span/Hispanic,1,Elective,Home or Self Care,2020,CIR026,PERIPHERAL AND VISCERAL VASCULAR DISEASE,CAR007,"EMBOLECTOMY, ENDARTERECTOMY, AND RELATED VESSEL PROCEDURES (NON-ENDOVASCULAR; EXCLUDING CAROTID)",181,LOWER EXTREMITY ARTERIAL PROCEDURES,05,DISEASES AND DISORDERS OF THE CIRCULATORY SYSTEM,1,Minor,Minor,Surgical,Blue Cross/Blue Shield,,,,,N,22659.96,6613.73
Long Island,Suffolk,5123000,000885,Long Island Community Hospital,70 or Older,119,M,Other Race,Not Span/Hispanic,6,Emergency,Home or Self Care,2020,CIR038,POSTPROCEDURAL OR POSTOPERATIVE CIRCULATORY SYSTEM COMPLICATION,CAR012,VESSEL REPAIR AND REPLACEMENT,181,LOWER EXTREMITY ARTERIAL PROCEDURES,05,DISEASES AND DISORDERS OF THE CIRCULATORY SYSTEM,2,Moderate,Moderate,Surgical,Medicare,Medicare,Blue Cross/Blue Shield,,,Y,70586.3,14532.65
Long Island,Suffolk,5123000,000885,Long Island Community Hospital,30 to 49,117,M,White,Not Span/Hispanic,1,Elective,Short-term Hospital,2020,INJ016,"INJURY TO BLOOD VESSELS, INITIAL ENCOUNTER",CAR024,VENOUS AND ARTERIAL CATHETER PLACEMENT,181,LOWER EXTREMITY ARTERIAL PROCEDURES,05,DISEASES AND DISORDERS OF THE CIRCULATORY SYSTEM,4,Extreme,Extreme,Surgical,Private Health Insurance,Medicaid,,,,N,216876.28,33978.16
Long Island,Suffolk,5123000,000885,Long Island Community Hospital,50 to 69,119,M,Other Race,Not Span/Hispanic,2,Elective,Home or Self Care,2020,END003,DIABETES MELLITUS WITH COMPLICATION,CAR007,"EMBOLECTOMY, ENDARTERECTOMY, AND RELATED VESSEL PROCEDURES (NON-ENDOVASCULAR; EXCLUDING CAROTID)",181,LOWER EXTREMITY ARTERIAL PROCEDURES,05,DISEASES AND DISORDERS OF THE CIRCULATORY SYSTEM,2,Moderate,Moderate,Surgical,Private Health Insurance,Medicare,Medicare,,,N,114712.41,18245.47
Long Island,Suffolk,5123000,000885,Long Island Community Hospital,30 to 49,117,M,Black/African American,Not Span/Hispanic,2,Emergency,Short-term Hospital,2020,INJ016,"INJURY TO BLOOD VESSELS, INITIAL ENCOUNTER",ADM001,TRANSFUSION OF BLOOD AND BLOOD PRODUCTS,181,LOWER EXTREMITY ARTERIAL PROCEDURES,05,DISEASES AND DISORDERS OF THE CIRCULATORY SYSTEM,3,Major,Major,Surgical,Self-Pay,,,,,Y,120792.38,21129.15
Long Island,Suffolk,5123000,000885,Long Island Community Hospital,70 or Older,119,F,White,Not Span/Hispanic,11,Emergency,Home w/ Home Health Services,2020,INJ033,"COMPLICATION OF CARDIOVASCULAR DEVICE, IMPLANT OR GRAFT, INITIAL ENCOUNTER",CAR008,ANGIOPLASTY AND RELATED VESSEL PROCEDURES (ENDOVASCULAR; EXCLUDING CAROTID),181,LOWER EXTREMITY ARTERIAL PROCEDURES,05,DISEASES AND DISORDERS OF THE CIRCULATORY SYSTEM,3,Major,Moderate,Surgical,Medicare,Medicare,,,,Y,210214.93,35984.8
Long Island,Suffolk,5123000,000885,Long Island Community Hospital,50 to 69,117,M,White,Not Span/Hispanic,16,Emergency,Home w/ Home Health Services,2020,END003,DIABETES MELLITUS WITH COMPLICATION,CAR014,PERIPHERAL ARTERIAL BYPASS PROCEDURES,181,LOWER EXTREMITY ARTERIAL PROCEDURES,05,DISEASES AND DISORDERS OF THE CIRCULATORY SYSTEM,3,Major,Moderate,Surgical,Medicare,Medicare,Private Health Insurance,,,Y,186843.07,37009.76
Long Island,Suffolk,5123000,000885,Long Island Community Hospital,70 or Older,119,M,White,Not Span/Hispanic,18,Elective,Skilled Nursing Home,2020,END003,DIABETES MELLITUS WITH COMPLICATION,CAR014,PERIPHERAL ARTERIAL BYPASS PROCEDURES,181,LOWER EXTREMITY ARTERIAL PROCEDURES,05,DISEASES AND DISORDERS OF THE CIRCULATORY SYSTEM,3,Major,Moderate,Surgical,Medicare,Medicare,Private Health Insurance,,,N,240224.94,45223.2
Long Island,Suffolk,5123000,000885,Long Island Community Hospital,50 to 69,119,F,White,Not Span/Hispanic,4,Elective,Home or Self Care,2020,CIR026,PERIPHERAL AND VISCERAL VASCULAR DISEASE,CAR014,PERIPHERAL ARTERIAL BYPASS PROCEDURES,181,LOWER EXTREMITY ARTERIAL PROCEDURES,05,DISEASES AND DISORDERS OF THE CIRCULATORY SYSTEM,2,Moderate,Minor,Surgical,Medicare,Medicare,Private Health Insurance,,,N,54682.29,12636.02
Long Island,Suffolk,5123000,000885,Long Island Community Hospital,50 to 69,119,M,White,Not Span/Hispanic,18,Emergency,Home w/ Home Health Services,2020,INJ033,"COMPLICATION OF CARDIOVASCULAR DEVICE, IMPLANT OR GRAFT, INITIAL ENCOUNTER",CAR014,PERIPHERAL ARTERIAL BYPASS PROCEDURES,181,LOWER EXTREMITY ARTERIAL PROCEDURES,05,DISEASES AND DISORDERS OF THE CIRCULATORY SYSTEM,3,Major,Moderate,Surgical,Private Health Insurance,,,,,Y,179872.51,42581.81
