Hospital Service Area,Hospital County,Operating Certificate Number,Permanent Facility Id,Facility Name,Age Group,Zip Code - 3 digits,Gender,Race,Ethnicity,Length of Stay,Type of Admission,Patient Disposition,Discharge Year,CCS Diagnosis Code,CCS Diagnosis Description,CCS Procedure Code,CCS Procedure Description,APR DRG Code,APR DRG Description,APR MDC Code,APR MDC Description,APR Severity of Illness Code,APR Severity of Illness Description,APR Risk of Mortality,APR Medical Surgical Description,Payment Typology 1,Payment Typology 2,Payment Typology 3,Birth Weight,Abortion Edit Indicator,Emergency Department Indicator,Total Charges,Total Costs
New York City,Manhattan,7002024,001456,Mount Sinai Hospital,70 or Older,100,M,White,Not Span/Hispanic,3,Emergency,Hospice - Medical Facility,2017,100,Acute myocardial infarction,216,RESP INTUB/MECH VENTIL,182,Other peripheral vascular procedures,05,Diseases and Disorders of the Circulatory System,4,Extreme,Extreme,Surgical,Medicare,Private Health Insurance,Self-Pay,,N,Y,65656.27,12886.17
New York City,Manhattan,7002032,001469,Mount Sinai St. Luke's,70 or Older,100,F,Other Race,Not Span/Hispanic,2,Emergency,Home or Self Care,2017,237,Complication of device; implant or graft,061,OT OR PRCS VES NOT HEAD,182,Other peripheral vascular procedures,05,Diseases and Disorders of the Circulatory System,2,Moderate,Moderate,Surgical,Medicare,Medicaid,Self-Pay,,N,Y,29627.40,10230.43
New York City,Bronx,7000006,001169,Montefiore Medical Center - Henry & Lucy Moses Div,70 or Older,104,F,Other Race,Spanish/Hispanic,1,Emergency,Home or Self Care,2017,237,Complication of device; implant or graft,048,CARDIAC PACEMAKER/DEFIB,182,Other peripheral vascular procedures,05,Diseases and Disorders of the Circulatory System,2,Moderate,Major,Surgical,Medicare,,,,N,N,114204.63,43360.05
New York City,Bronx,7000006,001169,Montefiore Medical Center - Henry & Lucy Moses Div,70 or Older,104,F,Black/African American,Not Span/Hispanic,28,Emergency,Skilled Nursing Home,2017,237,Complication of device; implant or graft,061,OT OR PRCS VES NOT HEAD,182,Other peripheral vascular procedures,05,Diseases and Disorders of the Circulatory System,3,Major,Major,Surgical,Medicare,Medicaid,,,N,Y,292857.15,61368.13
New York City,Bronx,7000006,003058,Montefiore Med Center - Jack D Weiler Hosp of A Einstein College Div,30 to 49,104,M,Other Race,Spanish/Hispanic,2,Emergency,Expired,2017,099,Hypertension with complications and secondary hypertension,231,OTHER THERAPEUTIC PRCS,182,Other peripheral vascular procedures,05,Diseases and Disorders of the Circulatory System,4,Extreme,Extreme,Surgical,Medicaid,,,,N,Y,73000.18,14811.14
New York City,Manhattan,7002002,001439,Mount Sinai Beth Israel,70 or Older,112,F,Black/African American,Spanish/Hispanic,4,Elective,Home or Self Care,2017,237,Complication of device; implant or graft,061,OT OR PRCS VES NOT HEAD,182,Other peripheral vascular procedures,05,Diseases and Disorders of the Circulatory System,2,Moderate,Moderate,Surgical,Medicare,Miscellaneous/Other,Medicaid,,N,N,77437.11,28584.70
New York City,Manhattan,7002024,001456,Mount Sinai Hospital,30 to 49,112,F,Black/African American,Not Span/Hispanic,2,Elective,Home or Self Care,2017,115,Aortic; peripheral; and visceral artery aneurysms,059,OT OR PRCS ON VES HEAD,182,Other peripheral vascular procedures,05,Diseases and Disorders of the Circulatory System,2,Moderate,Minor,Surgical,Blue Cross/Blue Shield,Self-Pay,,,N,N,59632.69,32075.60
New York City,Manhattan,7002024,001456,Mount Sinai Hospital,30 to 49,104,M,Other Race,Not Span/Hispanic,2,Urgent,Home or Self Care,2017,121,Other diseases of veins and lymphatics,061,OT OR PRCS VES NOT HEAD,182,Other peripheral vascular procedures,05,Diseases and Disorders of the Circulatory System,3,Major,Moderate,Surgical,Medicare,Medicare,Self-Pay,,N,N,83954.29,37821.92
New York City,Manhattan,7002024,001456,Mount Sinai Hospital,70 or Older,111,M,White,Not Span/Hispanic,9,Urgent,Expired,2017,100,Acute myocardial infarction,061,OT OR PRCS VES NOT HEAD,182,Other peripheral vascular procedures,05,Diseases and Disorders of the Circulatory System,3,Major,Major,Surgical,Medicare,Blue Cross/Blue Shield,Self-Pay,,N,N,170955.46,60772.13
New York City,Manhattan,7002024,001456,Mount Sinai Hospital,0 to 17,112,M,Other Race,Not Span/Hispanic,7,Urgent,Home or Self Care,2017,237,Complication of device; implant or graft,063,OT NON-OR THER CARDIO,182,Other peripheral vascular procedures,05,Diseases and Disorders of the Circulatory System,4,Extreme,Moderate,Surgical,Blue Cross/Blue Shield,Self-Pay,,,N,N,73159.34,43954.11
New York City,Manhattan,7002024,001456,Mount Sinai Hospital,70 or Older,100,M,Black/African American,Not Span/Hispanic,15,Emergency,Skilled Nursing Home,2017,106,Cardiac dysrhythmias,216,RESP INTUB/MECH VENTIL,182,Other peripheral vascular procedures,05,Diseases and Disorders of the Circulatory System,3,Major,Major,Surgical,Medicare,Medicare,Medicaid,,N,Y,148663.00,37901.16
New York City,Manhattan,7002032,001466,Mount Sinai West,70 or Older,100,M,Black/African American,Spanish/Hispanic,1,Elective,Home or Self Care,2017,115,Aortic; peripheral; and visceral artery aneurysms,061,OT OR PRCS VES NOT HEAD,182,Other peripheral vascular procedures,05,Diseases and Disorders of the Circulatory System,2,Moderate,Moderate,Surgical,Medicare,Medicare,Medicaid,,N,N,90730.57,35288.08
New York City,Manhattan,7002032,001466,Mount Sinai West,30 to 49,113,F,Other Race,Not Span/Hispanic,1,Emergency,Home or Self Care,2017,234,Crushing injury or internal injury,061,OT OR PRCS VES NOT HEAD,182,Other peripheral vascular procedures,05,Diseases and Disorders of the Circulatory System,1,Minor,Minor,Surgical,Medicaid,Self-Pay,,,N,Y,21976.12,9120.85
New York City,Manhattan,7002032,001469,Mount Sinai St. Luke's,50 to 69,100,F,White,Spanish/Hispanic,8,Urgent,Inpatient Rehabilitation Facility,2017,237,Complication of device; implant or graft,061,OT OR PRCS VES NOT HEAD,182,Other peripheral vascular procedures,05,Diseases and Disorders of the Circulatory System,3,Major,Moderate,Surgical,Medicaid,Medicaid,Self-Pay,,N,N,135554.93,47683.48
Hudson Valley,Orange,3523000,000699,Orange Regional Medical Center,70 or Older,109,M,White,Not Span/Hispanic,22,Emergency,Home w/ Home Health Services,2017,237,Complication of device; implant or graft,061,OT OR PRCS VES NOT HEAD,182,Other peripheral vascular procedures,05,Diseases and Disorders of the Circulatory System,4,Extreme,Extreme,Surgical,Medicare,Blue Cross/Blue Shield,,,N,Y,183947.98,47793.21
Hudson Valley,Orange,3523000,000699,Orange Regional Medical Center,50 to 69,109,M,White,Not Span/Hispanic,1,Elective,Home or Self Care,2017,115,Aortic; peripheral; and visceral artery aneurysms,061,OT OR PRCS VES NOT HEAD,182,Other peripheral vascular procedures,05,Diseases and Disorders of the Circulatory System,3,Major,Moderate,Surgical,Medicare,Private Health Insurance,,,N,N,80888.80,30534.95
Hudson Valley,Orange,3523000,000699,Orange Regional Medical Center,50 to 69,124,F,White,Not Span/Hispanic,1,Elective,Home or Self Care,2017,117,Other circulatory disease,061,OT OR PRCS VES NOT HEAD,182,Other peripheral vascular procedures,05,Diseases and Disorders of the Circulatory System,1,Minor,Minor,Surgical,Private Health Insurance,,,,N,N,18261.91,6715.41
Hudson Valley,Rockland,4329000,000779,Good Samaritan Hospital of Suffern,70 or Older,109,F,White,Not Span/Hispanic,1,Elective,Home or Self Care,2017,115,Aortic; peripheral; and visceral artery aneurysms,061,OT OR PRCS VES NOT HEAD,182,Other peripheral vascular procedures,05,Diseases and Disorders of the Circulatory System,2,Moderate,Moderate,Surgical,Medicare,Private Health Insurance,,,N,N,98933.47,17385.37
New York City,Bronx,7000006,001168,Montefiore Medical Center-Wakefield Hospital,70 or Older,104,F,Black/African American,Not Span/Hispanic,2,Emergency,Home w/ Home Health Services,2017,237,Complication of device; implant or graft,061,OT OR PRCS VES NOT HEAD,182,Other peripheral vascular procedures,05,Diseases and Disorders of the Circulatory System,3,Major,Major,Surgical,Medicare,Private Health Insurance,,,N,Y,38417.38,8155.80
New York City,Bronx,7000006,001168,Montefiore Medical Center-Wakefield Hospital,70 or Older,104,F,Black/African American,Not Span/Hispanic,2,Emergency,Skilled Nursing Home,2017,237,Complication of device; implant or graft,061,OT OR PRCS VES NOT HEAD,182,Other peripheral vascular procedures,05,Diseases and Disorders of the Circulatory System,3,Major,Moderate,Surgical,Medicare,Medicaid,,,N,Y,51557.01,12127.35
New York City,Bronx,7000006,001169,Montefiore Medical Center - Henry & Lucy Moses Div,70 or Older,104,F,Black/African American,Not Span/Hispanic,9,Emergency,Home w/ Home Health Services,2017,118,Phlebitis; thrombophlebitis and thromboembolism,231,OTHER THERAPEUTIC PRCS,182,Other peripheral vascular procedures,05,Diseases and Disorders of the Circulatory System,2,Moderate,Major,Surgical,Medicare,Medicaid,,,N,Y,146048.54,31223.45
New York City,Bronx,7000006,001169,Montefiore Medical Center - Henry & Lucy Moses Div,50 to 69,105,M,Black/African American,Not Span/Hispanic,13,Emergency,Home w/ Home Health Services,2017,099,Hypertension with complications and secondary hypertension,061,OT OR PRCS VES NOT HEAD,182,Other peripheral vascular procedures,05,Diseases and Disorders of the Circulatory System,3,Major,Major,Surgical,Private Health Insurance,,,,N,Y,146018.17,32017.70
New York City,Bronx,7000006,001169,Montefiore Medical Center - Henry & Lucy Moses Div,50 to 69,104,M,Black/African American,Not Span/Hispanic,4,Emergency,Expired,2017,099,Hypertension with complications and secondary hypertension,062,OT DX CARDIOVASC PRCS,182,Other peripheral vascular procedures,05,Diseases and Disorders of the Circulatory System,4,Extreme,Extreme,Surgical,Medicare,Medicaid,,,N,Y,89829.82,22312.05
New York City,Bronx,7000006,001169,Montefiore Medical Center - Henry & Lucy Moses Div,30 to 49,104,F,Other Race,Spanish/Hispanic,7,Emergency,Home or Self Care,2017,237,Complication of device; implant or graft,061,OT OR PRCS VES NOT HEAD,182,Other peripheral vascular procedures,05,Diseases and Disorders of the Circulatory System,2,Moderate,Minor,Surgical,Medicare,Medicaid,,,N,N,139969.42,33281.54
New York City,Manhattan,7002002,001439,Mount Sinai Beth Israel,70 or Older,112,F,Black/African American,Not Span/Hispanic,1,Urgent,Short-term Hospital,2017,115,Aortic; peripheral; and visceral artery aneurysms,193,DX ULTRASOUND HEART,182,Other peripheral vascular procedures,05,Diseases and Disorders of the Circulatory System,2,Moderate,Moderate,Surgical,Medicare,Miscellaneous/Other,Self-Pay,,N,N,15807.59,5176.51
New York City,Manhattan,7002024,001456,Mount Sinai Hospital,70 or Older,114,M,Black/African American,Not Span/Hispanic,23,Urgent,Skilled Nursing Home,2017,099,Hypertension with complications and secondary hypertension,054,OT VASC CATH; NOT HEART,182,Other peripheral vascular procedures,05,Diseases and Disorders of the Circulatory System,4,Extreme,Extreme,Surgical,Medicare,Medicare,Medicaid,,N,N,308472.94,73782.11
New York City,Manhattan,7002024,001456,Mount Sinai Hospital,0 to 17,117,M,Other Race,Not Span/Hispanic,5,Urgent,Short-term Hospital,2017,213,Cardiac and circulatory congenital anomalies,223,ENTERAL/PARENTERAL NUTR,182,Other peripheral vascular procedures,05,Diseases and Disorders of the Circulatory System,2,Moderate,Minor,Surgical,Private Health Insurance,Medicaid,Self-Pay,,N,N,73689.84,29754.53
New York City,Manhattan,7002024,001456,Mount Sinai Hospital,50 to 69,100,F,Other Race,Not Span/Hispanic,15,Emergency,Home w/ Home Health Services,2017,237,Complication of device; implant or graft,061,OT OR PRCS VES NOT HEAD,182,Other peripheral vascular procedures,05,Diseases and Disorders of the Circulatory System,3,Major,Major,Surgical,Private Health Insurance,Medicare,Self-Pay,,N,Y,142184.02,51280.30
New York City,Manhattan,7002024,001456,Mount Sinai Hospital,70 or Older,100,M,White,Not Span/Hispanic,9,Emergency,Home w/ Home Health Services,2017,114,Peripheral and visceral atherosclerosis,061,OT OR PRCS VES NOT HEAD,182,Other peripheral vascular procedures,05,Diseases and Disorders of the Circulatory System,4,Extreme,Extreme,Surgical,Medicare,Private Health Insurance,Self-Pay,,N,Y,144646.10,58349.87
New York City,Manhattan,7002024,001456,Mount Sinai Hospital,70 or Older,104,M,Other Race,Not Span/Hispanic,7,Emergency,Home or Self Care,2017,115,Aortic; peripheral; and visceral artery aneurysms,061,OT OR PRCS VES NOT HEAD,182,Other peripheral vascular procedures,05,Diseases and Disorders of the Circulatory System,3,Major,Major,Surgical,Medicare,Medicare,Self-Pay,,N,Y,109401.38,50358.63
New York City,Manhattan,7002032,001466,Mount Sinai West,50 to 69,OOS,M,White,Not Span/Hispanic,1,Elective,Home or Self Care,2017,118,Phlebitis; thrombophlebitis and thromboembolism,055,PERIPH VASCULAR BYPASS,182,Other peripheral vascular procedures,05,Diseases and Disorders of the Circulatory System,2,Moderate,Minor,Surgical,Blue Cross/Blue Shield,Self-Pay,,,N,N,25628.17,12406.32
New York City,Manhattan,7002032,001466,Mount Sinai West,70 or Older,100,M,White,Spanish/Hispanic,2,Emergency,Home or Self Care,2017,237,Complication of device; implant or graft,061,OT OR PRCS VES NOT HEAD,182,Other peripheral vascular procedures,05,Diseases and Disorders of the Circulatory System,2,Moderate,Moderate,Surgical,Medicare,Medicare,Medicaid,,N,Y,27762.63,11147.76
New York City,Bronx,7000006,001169,Montefiore Medical Center - Henry & Lucy Moses Div,70 or Older,104,F,Other Race,Not Span/Hispanic,11,Emergency,Home or Self Care,2017,099,Hypertension with complications and secondary hypertension,063,OT NON-OR THER CARDIO,182,Other peripheral vascular procedures,05,Diseases and Disorders of the Circulatory System,3,Major,Major,Surgical,Medicare,Medicaid,,,N,Y,142417.46,39598.11
New York City,Bronx,7000006,001169,Montefiore Medical Center - Henry & Lucy Moses Div,18 to 29,113,M,Other Race,Not Span/Hispanic,4,Emergency,Home or Self Care,2017,115,Aortic; peripheral; and visceral artery aneurysms,061,OT OR PRCS VES NOT HEAD,182,Other peripheral vascular procedures,05,Diseases and Disorders of the Circulatory System,2,Moderate,Minor,Surgical,Blue Cross/Blue Shield,,,,N,N,116440.64,25878.35
New York City,Bronx,7000006,001169,Montefiore Medical Center - Henry & Lucy Moses Div,0 to 17,104,F,Black/African American,Not Span/Hispanic,1,Elective,Home or Self Care,2017,213,Cardiac and circulatory congenital anomalies,047,DX CARDIAC CATHETERIZTN,182,Other peripheral vascular procedures,05,Diseases and Disorders of the Circulatory System,2,Moderate,Minor,Surgical,Medicaid,,,,N,N,13265.76,4263.97
New York City,Bronx,7000006,003058,Montefiore Med Center - Jack D Weiler Hosp of A Einstein College Div,70 or Older,104,M,White,Not Span/Hispanic,44,Emergency,Skilled Nursing Home,2017,099,Hypertension with complications and secondary hypertension,055,PERIPH VASCULAR BYPASS,182,Other peripheral vascular procedures,05,Diseases and Disorders of the Circulatory System,4,Extreme,Extreme,Surgical,Medicare,,,,N,Y,733616.69,209641.41
New York City,Bronx,7000006,003058,Montefiore Med Center - Jack D Weiler Hosp of A Einstein College Div,70 or Older,104,M,Other Race,Not Span/Hispanic,1,Elective,Home or Self Care,2017,115,Aortic; peripheral; and visceral artery aneurysms,061,OT OR PRCS VES NOT HEAD,182,Other peripheral vascular procedures,05,Diseases and Disorders of the Circulatory System,2,Moderate,Moderate,Surgical,Medicare,Private Health Insurance,,,N,N,99662.93,35345.63
New York City,Kings,7001003,001288,Brooklyn Hospital Center - Downtown Campus,50 to 69,112,M,Black/African American,Unknown,13,Emergency,Home w/ Home Health Services,2017,107,Cardiac arrest and ventricular fibrillation,216,RESP INTUB/MECH VENTIL,182,Other peripheral vascular procedures,05,Diseases and Disorders of the Circulatory System,4,Extreme,Extreme,Surgical,Medicaid,Medicaid,Self-Pay,,N,Y,167300.22,28577.33
New York City,Kings,7001037,001320,University Hospital of Brooklyn,30 to 49,112,M,Black/African American,Not Span/Hispanic,3,Emergency,Home or Self Care,2017,237,Complication of device; implant or graft,061,OT OR PRCS VES NOT HEAD,182,Other peripheral vascular procedures,05,Diseases and Disorders of the Circulatory System,2,Moderate,Moderate,Surgical,Medicaid,Self-Pay,,,N,Y,31657.75,20017.15
New York City,Kings,7001037,001320,University Hospital of Brooklyn,70 or Older,112,M,Black/African American,Not Span/Hispanic,7,Emergency,Home or Self Care,2017,237,Complication of device; implant or graft,054,OT VASC CATH; NOT HEART,182,Other peripheral vascular procedures,05,Diseases and Disorders of the Circulatory System,3,Major,Major,Surgical,Medicare,Medicare,Medicaid,,N,Y,62102.00,39271.66
New York City,Kings,7001037,001320,University Hospital of Brooklyn,30 to 49,112,M,Black/African American,Spanish/Hispanic,2,Emergency,Home or Self Care,2017,237,Complication of device; implant or graft,061,OT OR PRCS VES NOT HEAD,182,Other peripheral vascular procedures,05,Diseases and Disorders of the Circulatory System,2,Moderate,Moderate,Surgical,Medicaid,Self-Pay,,,N,Y,24626.00,16181.79
New York City,Manhattan,7002024,001456,Mount Sinai Hospital,50 to 69,100,M,Other Race,Not Span/Hispanic,4,Elective,Home w/ Home Health Services,2017,213,Cardiac and circulatory congenital anomalies,059,OT OR PRCS ON VES HEAD,182,Other peripheral vascular procedures,05,Diseases and Disorders of the Circulatory System,2,Moderate,Moderate,Surgical,Self-Pay,Self-Pay,,,N,N,116289.78,47001.29
New York City,Manhattan,7002024,001456,Mount Sinai Hospital,50 to 69,104,M,Other Race,Not Span/Hispanic,3,Elective,Skilled Nursing Home,2017,237,Complication of device; implant or graft,231,OTHER THERAPEUTIC PRCS,182,Other peripheral vascular procedures,05,Diseases and Disorders of the Circulatory System,2,Moderate,Moderate,Surgical,Medicare,Medicaid,Self-Pay,,N,N,36784.52,14410.85
New York City,Manhattan,7002024,001456,Mount Sinai Hospital,50 to 69,111,M,White,Not Span/Hispanic,1,Elective,Home or Self Care,2017,115,Aortic; peripheral; and visceral artery aneurysms,061,OT OR PRCS VES NOT HEAD,182,Other peripheral vascular procedures,05,Diseases and Disorders of the Circulatory System,2,Moderate,Minor,Surgical,Medicare,Medicare,Self-Pay,,N,N,42171.65,22062.42
New York City,Manhattan,7002024,001456,Mount Sinai Hospital,70 or Older,113,M,White,Not Span/Hispanic,2,Urgent,Home or Self Care,2017,115,Aortic; peripheral; and visceral artery aneurysms,061,OT OR PRCS VES NOT HEAD,182,Other peripheral vascular procedures,05,Diseases and Disorders of the Circulatory System,1,Minor,Moderate,Surgical,Medicare,Private Health Insurance,Self-Pay,,N,N,62978.70,33902.20
New York City,Manhattan,7002024,001456,Mount Sinai Hospital,50 to 69,100,M,Black/African American,Not Span/Hispanic,21,Emergency,Home or Self Care,2017,237,Complication of device; implant or graft,061,OT OR PRCS VES NOT HEAD,182,Other peripheral vascular procedures,05,Diseases and Disorders of the Circulatory System,3,Major,Major,Surgical,Medicare,Medicaid,Self-Pay,,N,Y,181664.83,62024.40
New York City,Manhattan,7002024,001456,Mount Sinai Hospital,50 to 69,100,F,White,Not Span/Hispanic,5,Emergency,Home or Self Care,2017,121,Other diseases of veins and lymphatics,061,OT OR PRCS VES NOT HEAD,182,Other peripheral vascular procedures,05,Diseases and Disorders of the Circulatory System,4,Extreme,Major,Surgical,Medicare,Private Health Insurance,Self-Pay,,N,Y,65222.00,23560.65
New York City,Manhattan,7002024,001456,Mount Sinai Hospital,30 to 49,112,M,Black/African American,Not Span/Hispanic,2,Emergency,Home or Self Care,2017,115,Aortic; peripheral; and visceral artery aneurysms,061,OT OR PRCS VES NOT HEAD,182,Other peripheral vascular procedures,05,Diseases and Disorders of the Circulatory System,3,Major,Moderate,Surgical,Medicaid,Medicaid,Self-Pay,,N,Y,53567.23,25708.19
New York City,Manhattan,7002024,001456,Mount Sinai Hospital,70 or Older,100,M,Other Race,Not Span/Hispanic,15,Emergency,Expired,2017,099,Hypertension with complications and secondary hypertension,058,HEMODIALYSIS,182,Other peripheral vascular procedures,05,Diseases and Disorders of the Circulatory System,3,Major,Extreme,Surgical,Medicare,Medicare,Medicaid,,N,Y,185021.45,43751.36
New York City,Manhattan,7002024,001456,Mount Sinai Hospital,70 or Older,103,M,White,Not Span/Hispanic,9,Emergency,Home or Self Care,2017,103,Pulmonary heart disease,061,OT OR PRCS VES NOT HEAD,182,Other peripheral vascular procedures,05,Diseases and Disorders of the Circulatory System,4,Extreme,Extreme,Surgical,Medicare,Private Health Insurance,Self-Pay,,N,Y,104748.32,37192.59
New York City,Manhattan,7002024,001456,Mount Sinai Hospital,70 or Older,100,F,Black/African American,Not Span/Hispanic,2,Emergency,Home w/ Home Health Services,2017,237,Complication of device; implant or graft,058,HEMODIALYSIS,182,Other peripheral vascular procedures,05,Diseases and Disorders of the Circulatory System,3,Major,Major,Surgical,Medicare,Medicaid,Self-Pay,,N,Y,28815.34,10840.17
New York City,Manhattan,7002053,001463,NYU Langone Hospitals,50 to 69,112,M,White,Not Span/Hispanic,6,Emergency,Home w/ Home Health Services,2017,237,Complication of device; implant or graft,061,OT OR PRCS VES NOT HEAD,182,Other peripheral vascular procedures,05,Diseases and Disorders of the Circulatory System,3,Major,Moderate,Surgical,Medicare,,,,N,Y,133024.44,40933.09
New York City,Manhattan,7002032,001466,Mount Sinai West,50 to 69,111,M,Other Race,Not Span/Hispanic,1,Elective,Home or Self Care,2017,115,Aortic; peripheral; and visceral artery aneurysms,061,OT OR PRCS VES NOT HEAD,182,Other peripheral vascular procedures,05,Diseases and Disorders of the Circulatory System,2,Moderate,Minor,Surgical,Medicaid,Medicaid,Self-Pay,,N,N,29141.59,14139.95
New York City,Manhattan,7002032,001469,Mount Sinai St. Luke's,50 to 69,100,M,White,Not Span/Hispanic,1,Elective,Home or Self Care,2017,118,Phlebitis; thrombophlebitis and thromboembolism,055,PERIPH VASCULAR BYPASS,182,Other peripheral vascular procedures,05,Diseases and Disorders of the Circulatory System,3,Major,Major,Surgical,Medicare,Medicare,Medicaid,,N,N,25722.51,12318.45
New York City,Manhattan,7002032,001469,Mount Sinai St. Luke's,70 or Older,100,F,Other Race,Unknown,7,Emergency,Home or Self Care,2017,118,Phlebitis; thrombophlebitis and thromboembolism,231,OTHER THERAPEUTIC PRCS,182,Other peripheral vascular procedures,05,Diseases and Disorders of the Circulatory System,3,Major,Major,Surgical,Blue Cross/Blue Shield,Self-Pay,,,N,Y,123105.16,45363.50
New York City,Kings,7001021,001306,New York - Presbyterian Brooklyn Methodist Hospital,50 to 69,112,F,White,Not Span/Hispanic,1,Elective,Home or Self Care,2017,115,Aortic; peripheral; and visceral artery aneurysms,061,OT OR PRCS VES NOT HEAD,182,Other peripheral vascular procedures,05,Diseases and Disorders of the Circulatory System,2,Moderate,Moderate,Surgical,Medicare,Blue Cross/Blue Shield,Self-Pay,,N,N,62744.81,31847.12
New York City,Kings,7001021,001306,New York - Presbyterian Brooklyn Methodist Hospital,30 to 49,112,M,Black/African American,Not Span/Hispanic,12,Emergency,Home w/ Home Health Services,2017,099,Hypertension with complications and secondary hypertension,062,OT DX CARDIOVASC PRCS,182,Other peripheral vascular procedures,05,Diseases and Disorders of the Circulatory System,3,Major,Major,Surgical,Medicaid,Self-Pay,,,N,Y,98607.66,32456.04
New York City,Kings,7001021,001306,New York - Presbyterian Brooklyn Methodist Hospital,50 to 69,116,F,Black/African American,Not Span/Hispanic,14,Emergency,Skilled Nursing Home,2017,099,Hypertension with complications and secondary hypertension,061,OT OR PRCS VES NOT HEAD,182,Other peripheral vascular procedures,05,Diseases and Disorders of the Circulatory System,3,Major,Moderate,Surgical,Medicaid,Self-Pay,,,N,Y,89077.40,33598.16