Hospital Service Area,Hospital County,Operating Certificate Number,Permanent Facility Id,Facility Name,Age Group,Zip Code - 3 digits,Gender,Race,Ethnicity,Length of Stay,Type of Admission,Patient Disposition,Discharge Year,CCS Diagnosis Code,CCS Diagnosis Description,CCS Procedure Code,CCS Procedure Description,APR DRG Code,APR DRG Description,APR MDC Code,APR MDC Description,APR Severity of Illness Code,APR Severity of Illness Description,APR Risk of Mortality,APR Medical Surgical Description,Payment Typology 1,Payment Typology 2,Payment Typology 3,Birth Weight,Abortion Edit Indicator,Emergency Department Indicator,Total Charges,Total Costs
New York City,Bronx,7000006,001169,Montefiore Medical Center - Henry & Lucy Moses Div,50 to 69,104,F,Black/African American,Not Span/Hispanic,2,Emergency,Skilled Nursing Home,2018,INJ033,"COMPLICATION OF CARDIOVASCULAR DEVICE, IMPLANT OR GRAFT, INITIAL ENCOUNTER",CAR008,ANGIOPLASTY AND RELATED VESSEL PROCEDURES (ENDOVASCULAR; EXCLUDING CAROTID),182,OTHER PERIPHERAL VASCULAR PROCEDURES,05,DISEASES AND DISORDERS OF THE CIRCULATORY SYSTEM,3,Major,Major,Surgical,Medicare,Medicaid,,,,true,46497.05,12908.82
New York City,Manhattan,7002054,001464,New York-Presbyterian Hospital - Columbia Presbyterian Center,30 to 49,OOS,F,White,Not Span/Hispanic,1,Urgent,Home or Self Care,2018,CIR014,PULMONARY HEART DISEASE,CAR008,ANGIOPLASTY AND RELATED VESSEL PROCEDURES (ENDOVASCULAR; EXCLUDING CAROTID),182,OTHER PERIPHERAL VASCULAR PROCEDURES,05,DISEASES AND DISORDERS OF THE CIRCULATORY SYSTEM,2,Moderate,Minor,Surgical,Private Health Insurance,Medicare,Self-Pay,,,false,42556.75,17527.29
New York City,Queens,7003010,001637,New York - Presbyterian/Queens,70 or Older,113,F,Black/African American,Not Span/Hispanic,40,Emergency,Home w/ Home Health Services,2018,INJ033,"COMPLICATION OF CARDIOVASCULAR DEVICE, IMPLANT OR GRAFT, INITIAL ENCOUNTER",CAR020,SAPHENOUS VEIN HARVEST AND OTHER THERAPEUTIC VESSEL REMOVAL,182,OTHER PERIPHERAL VASCULAR PROCEDURES,05,DISEASES AND DISORDERS OF THE CIRCULATORY SYSTEM,4,Extreme,Extreme,Surgical,Medicare,Medicare,Medicaid,,,true,345790.91,91019.17
Capital/Adirond,Albany,0101004,000005,St. Peter's Hospital,70 or Older,121,M,White,Not Span/Hispanic,12,Emergency,Home or Self Care,2018,CIR029,AORTIC; PERIPHERAL; AND VISCERAL ARTERY ANEURYSMS,CAR011,ANEURYSM REPAIR PROCEDURES,182,OTHER PERIPHERAL VASCULAR PROCEDURES,05,DISEASES AND DISORDERS OF THE CIRCULATORY SYSTEM,3,Major,Major,Surgical,Medicare,Private Health Insurance,,,,true,147899.95,59465.34
Southern Tier,Broome,0303001,000058,United Health Services Hospitals Inc. - Wilson Medical Center,70 or Older,137,F,White,Not Span/Hispanic,2,Elective,Home w/ Home Health Services,2018,CIR029,AORTIC; PERIPHERAL; AND VISCERAL ARTERY ANEURYSMS,CAR011,ANEURYSM REPAIR PROCEDURES,182,OTHER PERIPHERAL VASCULAR PROCEDURES,05,DISEASES AND DISORDERS OF THE CIRCULATORY SYSTEM,2,Moderate,Moderate,Surgical,Medicare,Medicare,Private Health Insurance,,,false,102473.5,43932.28
New York City,Manhattan,7002024,001456,Mount Sinai Hospital,70 or Older,112,M,Other Race,Unknown,14,Emergency,Home or Self Care,2018,GEN003,CHRONIC KIDNEY DISEASE,CAR015,PERIPHERAL ARTERIOVENOUS FISTULA AND SHUNT PROCEDURES,182,OTHER PERIPHERAL VASCULAR PROCEDURES,05,DISEASES AND DISORDERS OF THE CIRCULATORY SYSTEM,4,Extreme,Extreme,Surgical,Medicare,Private Health Insurance,Self-Pay,,,true,173290.48,51438.57
Western NY,Erie,1401014,000207,Buffalo General Medical Center,50 to 69,142,M,White,Not Span/Hispanic,1,Elective,Home or Self Care,2018,CIR029,AORTIC; PERIPHERAL; AND VISCERAL ARTERY ANEURYSMS,CAR011,ANEURYSM REPAIR PROCEDURES,182,OTHER PERIPHERAL VASCULAR PROCEDURES,05,DISEASES AND DISORDERS OF THE CIRCULATORY SYSTEM,1,Minor,Minor,Surgical,Medicare,Self-Pay,,,,false,86181.62,33689.47
New York City,Queens,7003004,001630,Long Island Jewish Medical Center,70 or Older,115,M,White,Not Span/Hispanic,1,Urgent,Home or Self Care,2018,CIR029,AORTIC; PERIPHERAL; AND VISCERAL ARTERY ANEURYSMS,CAR011,ANEURYSM REPAIR PROCEDURES,182,OTHER PERIPHERAL VASCULAR PROCEDURES,05,DISEASES AND DISORDERS OF THE CIRCULATORY SYSTEM,2,Moderate,Minor,Surgical,Medicare,Private Health Insurance,Self-Pay,,,false,124746.95,37866.64
Long Island,Nassau,2951001,000541,North Shore University Hospital,50 to 69,115,F,Other Race,Spanish/Hispanic,20,Emergency,Home or Self Care,2018,CIR039,OTHER SPECIFIED DISEASES OF VEINS AND LYMPHATICS,CAR010,LIGATION AND EMBOLIZATION OF VESSELS,182,OTHER PERIPHERAL VASCULAR PROCEDURES,05,DISEASES AND DISORDERS OF THE CIRCULATORY SYSTEM,3,Major,Extreme,Surgical,Medicare,Blue Cross/Blue Shield,,,,true,312539.78,67181.76
New York City,Manhattan,7002024,001456,Mount Sinai Hospital,30 to 49,,F,White,Not Span/Hispanic,2,Elective,Home or Self Care,2018,CIR029,AORTIC; PERIPHERAL; AND VISCERAL ARTERY ANEURYSMS,CAR010,LIGATION AND EMBOLIZATION OF VESSELS,182,OTHER PERIPHERAL VASCULAR PROCEDURES,05,DISEASES AND DISORDERS OF THE CIRCULATORY SYSTEM,2,Moderate,Minor,Surgical,Private Health Insurance,Self-Pay,,,,false,76031.99,34427.82
New York City,Kings,7001020,001305,Maimonides Medical Center,50 to 69,100,M,Black/African American,Not Span/Hispanic,9,Urgent,Home or Self Care,2018,INJ033,"COMPLICATION OF CARDIOVASCULAR DEVICE, IMPLANT OR GRAFT, INITIAL ENCOUNTER",CAR011,ANEURYSM REPAIR PROCEDURES,182,OTHER PERIPHERAL VASCULAR PROCEDURES,05,DISEASES AND DISORDERS OF THE CIRCULATORY SYSTEM,2,Moderate,Moderate,Surgical,Medicaid,Medicaid,Self-Pay,,,false,199977.01,57304.31
New York City,Manhattan,7002054,001458,New York-Presbyterian Hospital - New York Weill Cornell Center,70 or Older,113,F,Other Race,Not Span/Hispanic,8,Emergency,Home w/ Home Health Services,2018,MAL001,CARDIAC AND CIRCULATORY CONGENITAL ANOMALIES,CAR010,LIGATION AND EMBOLIZATION OF VESSELS,182,OTHER PERIPHERAL VASCULAR PROCEDURES,05,DISEASES AND DISORDERS OF THE CIRCULATORY SYSTEM,2,Moderate,Major,Surgical,Medicare,Blue Cross/Blue Shield,Self-Pay,,,true,171202.78,65508.78
Capital/Adirond,Otsego,3824000,000746,Mary Imogene Bassett Hospital,30 to 49,138,F,White,Not Span/Hispanic,7,Emergency,Home w/ Home Health Services,2018,CIR029,AORTIC; PERIPHERAL; AND VISCERAL ARTERY ANEURYSMS,CAR014,PERIPHERAL ARTERIAL BYPASS PROCEDURES,182,OTHER PERIPHERAL VASCULAR PROCEDURES,05,DISEASES AND DISORDERS OF THE CIRCULATORY SYSTEM,3,Major,Moderate,Surgical,Medicaid,,,,,true,59692.16,38336.25
Long Island,Suffolk,5155000,000938,Peconic Bay Medical Center,70 or Older,119,F,White,Spanish/Hispanic,1,Elective,Home or Self Care,2018,CIR029,AORTIC; PERIPHERAL; AND VISCERAL ARTERY ANEURYSMS,CAR011,ANEURYSM REPAIR PROCEDURES,182,OTHER PERIPHERAL VASCULAR PROCEDURES,05,DISEASES AND DISORDERS OF THE CIRCULATORY SYSTEM,2,Moderate,Moderate,Surgical,Medicare,Blue Cross/Blue Shield,,,,false,162994.89,29852.04
New York City,Richmond,7004003,001740,Staten Island University Hosp-North,70 or Older,103,M,White,Not Span/Hispanic,8,Emergency,Home w/ Home Health Services,2018,CIR019,HEART FAILURE,IMG009,PLAIN RADIOGRAPHY,182,OTHER PERIPHERAL VASCULAR PROCEDURES,05,DISEASES AND DISORDERS OF THE CIRCULATORY SYSTEM,4,Extreme,Extreme,Surgical,Medicare,Blue Cross/Blue Shield,,,,true,118859,34961.23
Hudson Valley,Westchester,5902001,001045,White Plains Hospital Center,50 to 69,105,M,Other Race,Not Span/Hispanic,1,Emergency,Short-term Hospital,2018,CIR032,OTHER SPECIFIED AND UNSPECIFIED CIRCULATORY DISEASE,ADM001,TRANSFUSION OF BLOOD AND BLOOD PRODUCTS,182,OTHER PERIPHERAL VASCULAR PROCEDURES,05,DISEASES AND DISORDERS OF THE CIRCULATORY SYSTEM,3,Major,Major,Surgical,Medicaid,,,,,true,146474,37103.12
New York City,Kings,7001020,001305,Maimonides Medical Center,50 to 69,112,F,Other Race,Not Span/Hispanic,1,Elective,Home or Self Care,2018,CIR029,AORTIC; PERIPHERAL; AND VISCERAL ARTERY ANEURYSMS,CAR006,CAROTID ENDARTERECTOMY AND STENTING,182,OTHER PERIPHERAL VASCULAR PROCEDURES,05,DISEASES AND DISORDERS OF THE CIRCULATORY SYSTEM,1,Minor,Minor,Surgical,Medicaid,Medicaid,Self-Pay,,,false,114886.01,38486.3
Central NY,Onondaga,3301007,000635,University Hospital SUNY Health Science Center,70 or Older,132,M,Black/African American,Not Span/Hispanic,4,Emergency,Skilled Nursing Home,2018,INJ033,"COMPLICATION OF CARDIOVASCULAR DEVICE, IMPLANT OR GRAFT, INITIAL ENCOUNTER",ADM005,ADMINISTRATION OF THROMBOLYTICS AND PLATELET INHIBITORS,182,OTHER PERIPHERAL VASCULAR PROCEDURES,05,DISEASES AND DISORDERS OF THE CIRCULATORY SYSTEM,2,Moderate,Moderate,Surgical,Medicare,Medicaid,,,,true,103980.42,30758.65
New York City,Kings,7001009,001294,Coney Island Hospital,70 or Older,112,F,White,Not Span/Hispanic,9,Emergency,Home w/ Home Health Services,2018,INJ033,"COMPLICATION OF CARDIOVASCULAR DEVICE, IMPLANT OR GRAFT, INITIAL ENCOUNTER",CAR008,ANGIOPLASTY AND RELATED VESSEL PROCEDURES (ENDOVASCULAR; EXCLUDING CAROTID),182,OTHER PERIPHERAL VASCULAR PROCEDURES,05,DISEASES AND DISORDERS OF THE CIRCULATORY SYSTEM,4,Extreme,Extreme,Surgical,Medicare,Medicare,Medicaid,,,true,62882.5,35197.16
New York City,Manhattan,7002024,001456,Mount Sinai Hospital,30 to 49,101,M,Other Race,Spanish/Hispanic,4,Emergency,Home w/ Home Health Services,2018,INJ033,"COMPLICATION OF CARDIOVASCULAR DEVICE, IMPLANT OR GRAFT, INITIAL ENCOUNTER",CAR015,PERIPHERAL ARTERIOVENOUS FISTULA AND SHUNT PROCEDURES,182,OTHER PERIPHERAL VASCULAR PROCEDURES,05,DISEASES AND DISORDERS OF THE CIRCULATORY SYSTEM,3,Major,Moderate,Surgical,Medicare,Medicaid,Self-Pay,,,true,71801.46,23094.73
Central NY,Onondaga,3301003,000630,St. Joseph's Hospital Health Center,70 or Older,132,F,Other Race,Not Span/Hispanic,3,Emergency,Home w/ Home Health Services,2018,CIR030,AORTIC AND PERIPHERAL ARTERIAL EMBOLISM OR THROMBOSIS,CAR007,"EMBOLECTOMY, ENDARTERECTOMY, AND RELATED VESSEL PROCEDURES (NON-ENDOVASCULAR; EXCLUDING CAROTID)",182,OTHER PERIPHERAL VASCULAR PROCEDURES,05,DISEASES AND DISORDERS OF THE CIRCULATORY SYSTEM,2,Moderate,Moderate,Surgical,Medicare,,,,,true,23369.24,9596.47
Central NY,Onondaga,3301007,000635,University Hospital SUNY Health Science Center,30 to 49,130,F,White,Not Span/Hispanic,2,Trauma,Home or Self Care,2018,INJ016,"INJURY TO BLOOD VESSELS, INITIAL ENCOUNTER",CAR010,LIGATION AND EMBOLIZATION OF VESSELS,182,OTHER PERIPHERAL VASCULAR PROCEDURES,05,DISEASES AND DISORDERS OF THE CIRCULATORY SYSTEM,2,Moderate,Minor,Surgical,Private Health Insurance,,,,,true,46485.52,11894.07
New York City,Queens,7002024,001639,Mount Sinai Hospital - Mount Sinai Hospital of Queens,70 or Older,111,M,White,Not Span/Hispanic,7,Emergency,Home or Self Care,2018,CIR033,ACUTE PHLEBITIS; THROMBOPHLEBITIS AND THROMBOEMBOLISM,CAR008,ANGIOPLASTY AND RELATED VESSEL PROCEDURES (ENDOVASCULAR; EXCLUDING CAROTID),182,OTHER PERIPHERAL VASCULAR PROCEDURES,05,DISEASES AND DISORDERS OF THE CIRCULATORY SYSTEM,2,Moderate,Major,Surgical,Medicaid,,,,,true,106463.97,35098.55
Capital/Adirond,Albany,0101000,000001,Albany Medical Center Hospital,50 to 69,120,M,Other Race,Spanish/Hispanic,8,Emergency,Home w/ Home Health Services,2018,END003,DIABETES MELLITUS WITH COMPLICATION,CAR014,PERIPHERAL ARTERIAL BYPASS PROCEDURES,182,OTHER PERIPHERAL VASCULAR PROCEDURES,05,DISEASES AND DISORDERS OF THE CIRCULATORY SYSTEM,3,Major,Major,Surgical,Medicare,,,,,true,63737.54,21283.04
Long Island,Nassau,2951001,000541,North Shore University Hospital,18 to 29,112,M,White,Not Span/Hispanic,3,Urgent,Home or Self Care,2018,CIR033,ACUTE PHLEBITIS; THROMBOPHLEBITIS AND THROMBOEMBOLISM,CAR008,ANGIOPLASTY AND RELATED VESSEL PROCEDURES (ENDOVASCULAR; EXCLUDING CAROTID),182,OTHER PERIPHERAL VASCULAR PROCEDURES,05,DISEASES AND DISORDERS OF THE CIRCULATORY SYSTEM,2,Moderate,Minor,Surgical,Private Health Insurance,,,,,false,136420.88,39689.5
Capital/Adirond,Warren,5601000,001005,Glens Falls Hospital,70 or Older,128,M,White,Not Span/Hispanic,1,Elective,Home w/ Home Health Services,2018,CIR029,AORTIC; PERIPHERAL; AND VISCERAL ARTERY ANEURYSMS,CAR011,ANEURYSM REPAIR PROCEDURES,182,OTHER PERIPHERAL VASCULAR PROCEDURES,05,DISEASES AND DISORDERS OF THE CIRCULATORY SYSTEM,1,Minor,Minor,Surgical,Medicare,Medicaid,,,,false,74439.1,26019.58
New York City,Bronx,7000006,003058,Montefiore Med Center - Jack D Weiler Hosp of A Einstein College Div,70 or Older,104,M,Black/African American,Not Span/Hispanic,16,Emergency,Skilled Nursing Home,2018,INJ033,"COMPLICATION OF CARDIOVASCULAR DEVICE, IMPLANT OR GRAFT, INITIAL ENCOUNTER",CAR020,SAPHENOUS VEIN HARVEST AND OTHER THERAPEUTIC VESSEL REMOVAL,182,OTHER PERIPHERAL VASCULAR PROCEDURES,05,DISEASES AND DISORDERS OF THE CIRCULATORY SYSTEM,3,Major,Major,Surgical,Medicare,Private Health Insurance,,,,true,230591.9,46388.37
Hudson Valley,Orange,3523000,000699,Garnet Health Medical Center,50 to 69,125,F,White,Not Span/Hispanic,2,Emergency,Home or Self Care,2018,CIR030,AORTIC AND PERIPHERAL ARTERIAL EMBOLISM OR THROMBOSIS,CAR007,"EMBOLECTOMY, ENDARTERECTOMY, AND RELATED VESSEL PROCEDURES (NON-ENDOVASCULAR; EXCLUDING CAROTID)",182,OTHER PERIPHERAL VASCULAR PROCEDURES,05,DISEASES AND DISORDERS OF THE CIRCULATORY SYSTEM,3,Major,Minor,Surgical,Medicare,,,,,true,31280.9,9000.27
Long Island,Nassau,2950001,000527,Mount Sinai South Nassau,70 or Older,115,M,White,Not Span/Hispanic,11,Emergency,Skilled Nursing Home,2018,INJ033,"COMPLICATION OF CARDIOVASCULAR DEVICE, IMPLANT OR GRAFT, INITIAL ENCOUNTER",CAR008,ANGIOPLASTY AND RELATED VESSEL PROCEDURES (ENDOVASCULAR; EXCLUDING CAROTID),182,OTHER PERIPHERAL VASCULAR PROCEDURES,05,DISEASES AND DISORDERS OF THE CIRCULATORY SYSTEM,3,Major,Major,Surgical,Medicare,Medicare,,,,true,113821.79,21844.2
Hudson Valley,Orange,3523000,000699,Garnet Health Medical Center,50 to 69,125,M,White,Not Span/Hispanic,1,Elective,Home or Self Care,2018,CIR029,AORTIC; PERIPHERAL; AND VISCERAL ARTERY ANEURYSMS,CAR011,ANEURYSM REPAIR PROCEDURES,182,OTHER PERIPHERAL VASCULAR PROCEDURES,05,DISEASES AND DISORDERS OF THE CIRCULATORY SYSTEM,2,Moderate,Moderate,Surgical,Medicare,Private Health Insurance,,,,false,118675.49,48703.67
Central NY,Onondaga,3301007,000635,University Hospital SUNY Health Science Center,30 to 49,136,F,White,Not Span/Hispanic,4,Emergency,Home w/ Home Health Services,2018,INJ033,"COMPLICATION OF CARDIOVASCULAR DEVICE, IMPLANT OR GRAFT, INITIAL ENCOUNTER",GNR005,CONTROL OF BLEEDING (NON-ENDOSCOPIC),182,OTHER PERIPHERAL VASCULAR PROCEDURES,05,DISEASES AND DISORDERS OF THE CIRCULATORY SYSTEM,3,Major,Moderate,Surgical,Medicare,Blue Cross/Blue Shield,,,,true,46481.6,12748.87
New York City,Kings,7001021,001306,New York - Presbyterian Brooklyn Methodist Hospital,50 to 69,112,F,Other Race,Not Span/Hispanic,4,Emergency,Home w/ Home Health Services,2018,CIR029,AORTIC; PERIPHERAL; AND VISCERAL ARTERY ANEURYSMS,CAR011,ANEURYSM REPAIR PROCEDURES,182,OTHER PERIPHERAL VASCULAR PROCEDURES,05,DISEASES AND DISORDERS OF THE CIRCULATORY SYSTEM,2,Moderate,Minor,Surgical,Medicare,Medicaid,Self-Pay,,,true,65725.49,21635.64
Capital/Adirond,Albany,0101000,000001,Albany Medical Center Hospital,50 to 69,128,M,White,Not Span/Hispanic,10,Emergency,Home w/ Home Health Services,2018,INJ016,"INJURY TO BLOOD VESSELS, INITIAL ENCOUNTER",CAR007,"EMBOLECTOMY, ENDARTERECTOMY, AND RELATED VESSEL PROCEDURES (NON-ENDOVASCULAR; EXCLUDING CAROTID)",182,OTHER PERIPHERAL VASCULAR PROCEDURES,05,DISEASES AND DISORDERS OF THE CIRCULATORY SYSTEM,3,Major,Minor,Surgical,Medicare,,,,,true,112212.44,35111.4
Capital/Adirond,Albany,0101000,000001,Albany Medical Center Hospital,30 to 49,123,M,Black/African American,Not Span/Hispanic,6,Emergency,Home or Self Care,2018,INJ033,"COMPLICATION OF CARDIOVASCULAR DEVICE, IMPLANT OR GRAFT, INITIAL ENCOUNTER",CAR024,VENOUS AND ARTERIAL CATHETER PLACEMENT,182,OTHER PERIPHERAL VASCULAR PROCEDURES,05,DISEASES AND DISORDERS OF THE CIRCULATORY SYSTEM,2,Moderate,Moderate,Surgical,Medicare,Blue Cross/Blue Shield,,,,true,65108.12,21971.25
Long Island,Nassau,2951001,000541,North Shore University Hospital,70 or Older,117,M,White,Not Span/Hispanic,2,Elective,Home or Self Care,2018,CIR029,AORTIC; PERIPHERAL; AND VISCERAL ARTERY ANEURYSMS,CAR011,ANEURYSM REPAIR PROCEDURES,182,OTHER PERIPHERAL VASCULAR PROCEDURES,05,DISEASES AND DISORDERS OF THE CIRCULATORY SYSTEM,1,Minor,Minor,Surgical,Medicare,Medicare,,,,false,137543.14,40536.85
Long Island,Nassau,2951001,000541,North Shore University Hospital,70 or Older,113,F,White,Not Span/Hispanic,85,Emergency,Skilled Nursing Home,2018,CIR009,ACUTE MYOCARDIAL INFARCTION,CAR010,LIGATION AND EMBOLIZATION OF VESSELS,182,OTHER PERIPHERAL VASCULAR PROCEDURES,05,DISEASES AND DISORDERS OF THE CIRCULATORY SYSTEM,4,Extreme,Extreme,Surgical,Medicare,Medicare,,,,true,1468229.81,290019.05
Capital/Adirond,Albany,0101004,000005,St. Peter's Hospital,70 or Older,121,M,White,Not Span/Hispanic,3,Elective,Home w/ Home Health Services,2018,CIR029,AORTIC; PERIPHERAL; AND VISCERAL ARTERY ANEURYSMS,CAR011,ANEURYSM REPAIR PROCEDURES,182,OTHER PERIPHERAL VASCULAR PROCEDURES,05,DISEASES AND DISORDERS OF THE CIRCULATORY SYSTEM,3,Major,Major,Surgical,Medicare,Medicare,,,,false,91819.82,34796.34
New York City,Manhattan,7002054,001464,New York-Presbyterian Hospital - Columbia Presbyterian Center,18 to 29,OOS,M,Black/African American,Not Span/Hispanic,1,Urgent,Home or Self Care,2018,INJ033,"COMPLICATION OF CARDIOVASCULAR DEVICE, IMPLANT OR GRAFT, INITIAL ENCOUNTER",CAR020,SAPHENOUS VEIN HARVEST AND OTHER THERAPEUTIC VESSEL REMOVAL,182,OTHER PERIPHERAL VASCULAR PROCEDURES,05,DISEASES AND DISORDERS OF THE CIRCULATORY SYSTEM,2,Moderate,Minor,Surgical,Blue Cross/Blue Shield,Self-Pay,,,,false,34247.91,10709.87
New York City,Bronx,7000006,001169,Montefiore Medical Center - Henry & Lucy Moses Div,50 to 69,104,F,White,Not Span/Hispanic,1,Emergency,Home or Self Care,2018,CIR029,AORTIC; PERIPHERAL; AND VISCERAL ARTERY ANEURYSMS,CAR006,CAROTID ENDARTERECTOMY AND STENTING,182,OTHER PERIPHERAL VASCULAR PROCEDURES,05,DISEASES AND DISORDERS OF THE CIRCULATORY SYSTEM,1,Minor,Minor,Surgical,Medicare,,,,,false,89022.33,33468.52
Western NY,Erie,1401013,000218,Sisters of Charity Hospital,50 to 69,143,M,White,Not Span/Hispanic,5,Urgent,Home or Self Care,2018,CIR030,AORTIC AND PERIPHERAL ARTERIAL EMBOLISM OR THROMBOSIS,CAR007,"EMBOLECTOMY, ENDARTERECTOMY, AND RELATED VESSEL PROCEDURES (NON-ENDOVASCULAR; EXCLUDING CAROTID)",182,OTHER PERIPHERAL VASCULAR PROCEDURES,05,DISEASES AND DISORDERS OF THE CIRCULATORY SYSTEM,2,Moderate,Minor,Surgical,Private Health Insurance,,,,,false,42696.24,19321.22
New York City,Manhattan,7002024,001456,Mount Sinai Hospital,50 to 69,112,M,Other Race,Not Span/Hispanic,14,Emergency,Skilled Nursing Home,2018,CIR033,ACUTE PHLEBITIS; THROMBOPHLEBITIS AND THROMBOEMBOLISM,CAR008,ANGIOPLASTY AND RELATED VESSEL PROCEDURES (ENDOVASCULAR; EXCLUDING CAROTID),182,OTHER PERIPHERAL VASCULAR PROCEDURES,05,DISEASES AND DISORDERS OF THE CIRCULATORY SYSTEM,4,Extreme,Major,Surgical,Medicare,Medicaid,Self-Pay,,,true,180645.4,61246.24
New York City,Manhattan,7002053,001463,NYU Langone Hospitals,0 to 17,112,F,Black/African American,Not Span/Hispanic,1,Elective,Home or Self Care,2018,MAL001,CARDIAC AND CIRCULATORY CONGENITAL ANOMALIES,CAR010,LIGATION AND EMBOLIZATION OF VESSELS,182,OTHER PERIPHERAL VASCULAR PROCEDURES,05,DISEASES AND DISORDERS OF THE CIRCULATORY SYSTEM,2,Moderate,Moderate,Surgical,Medicaid,,,,,false,78154.64,14650.23
Central NY,Onondaga,3301003,000630,St. Joseph's Hospital Health Center,70 or Older,131,F,White,Not Span/Hispanic,6,Elective,Skilled Nursing Home,2018,CIR029,AORTIC; PERIPHERAL; AND VISCERAL ARTERY ANEURYSMS,CAR014,PERIPHERAL ARTERIAL BYPASS PROCEDURES,182,OTHER PERIPHERAL VASCULAR PROCEDURES,05,DISEASES AND DISORDERS OF THE CIRCULATORY SYSTEM,2,Moderate,Major,Surgical,Medicare,,,,,false,39057.99,15362.55
Central NY,Onondaga,3301003,000630,St. Joseph's Hospital Health Center,70 or Older,132,F,White,Not Span/Hispanic,13,Urgent,Home w/ Home Health Services,2018,CIR019,HEART FAILURE,CAR008,ANGIOPLASTY AND RELATED VESSEL PROCEDURES (ENDOVASCULAR; EXCLUDING CAROTID),182,OTHER PERIPHERAL VASCULAR PROCEDURES,05,DISEASES AND DISORDERS OF THE CIRCULATORY SYSTEM,3,Major,Major,Surgical,Medicare,Private Health Insurance,,,,false,50808.66,20651.92
Capital/Adirond,Albany,0101000,000001,Albany Medical Center Hospital,50 to 69,124,F,White,Not Span/Hispanic,3,Emergency,Home or Self Care,2018,CIR029,AORTIC; PERIPHERAL; AND VISCERAL ARTERY ANEURYSMS,CAR011,ANEURYSM REPAIR PROCEDURES,182,OTHER PERIPHERAL VASCULAR PROCEDURES,05,DISEASES AND DISORDERS OF THE CIRCULATORY SYSTEM,1,Minor,Minor,Surgical,"Managed Care, Unspecified",,,,,true,80761.2,46679.23
Capital/Adirond,Albany,0101000,000001,Albany Medical Center Hospital,70 or Older,120,M,White,Not Span/Hispanic,2,Elective,Home or Self Care,2018,CIR029,AORTIC; PERIPHERAL; AND VISCERAL ARTERY ANEURYSMS,CAR011,ANEURYSM REPAIR PROCEDURES,182,OTHER PERIPHERAL VASCULAR PROCEDURES,05,DISEASES AND DISORDERS OF THE CIRCULATORY SYSTEM,2,Moderate,Major,Surgical,Medicare,,,,,false,60421.89,35250.26
Capital/Adirond,Albany,0101000,000001,Albany Medical Center Hospital,70 or Older,120,M,White,Not Span/Hispanic,5,Elective,Skilled Nursing Home,2018,CIR029,AORTIC; PERIPHERAL; AND VISCERAL ARTERY ANEURYSMS,CAR011,ANEURYSM REPAIR PROCEDURES,182,OTHER PERIPHERAL VASCULAR PROCEDURES,05,DISEASES AND DISORDERS OF THE CIRCULATORY SYSTEM,3,Major,Major,Surgical,Medicare,Private Health Insurance,,,,false,64567.25,35344.97
Capital/Adirond,Albany,0101000,000001,Albany Medical Center Hospital,70 or Older,128,F,White,Not Span/Hispanic,7,Urgent,Home w/ Home Health Services,2018,CIR036,POSTTHROMBOTIC SYNDROME AND VENOUS INSUFFICIENCY/HYPERTENSION,CAR008,ANGIOPLASTY AND RELATED VESSEL PROCEDURES (ENDOVASCULAR; EXCLUDING CAROTID),182,OTHER PERIPHERAL VASCULAR PROCEDURES,05,DISEASES AND DISORDERS OF THE CIRCULATORY SYSTEM,3,Major,Moderate,Surgical,Medicare,,,,,false,57383.63,19771.61
Capital/Adirond,Albany,0101000,000001,Albany Medical Center Hospital,30 to 49,123,F,White,Not Span/Hispanic,9,Elective,Home or Self Care,2018,CIR036,POSTTHROMBOTIC SYNDROME AND VENOUS INSUFFICIENCY/HYPERTENSION,CAR021,"ARTERY, VEIN, AND GREAT VESSEL PROCEDURES, NEC",182,OTHER PERIPHERAL VASCULAR PROCEDURES,05,DISEASES AND DISORDERS OF THE CIRCULATORY SYSTEM,2,Moderate,Minor,Surgical,Blue Cross/Blue Shield,,,,,false,76813.58,27294.84
Long Island,Nassau,2908000,000511,NYU Langone Hospital-Long Island,50 to 69,118,M,White,Not Span/Hispanic,6,Emergency,Home w/ Home Health Services,2018,INJ033,"COMPLICATION OF CARDIOVASCULAR DEVICE, IMPLANT OR GRAFT, INITIAL ENCOUNTER",CAR010,LIGATION AND EMBOLIZATION OF VESSELS,182,OTHER PERIPHERAL VASCULAR PROCEDURES,05,DISEASES AND DISORDERS OF THE CIRCULATORY SYSTEM,3,Major,Major,Surgical,Medicare,Medicare,,,,true,111883.02,19366.06
Long Island,Suffolk,5155000,000938,Peconic Bay Medical Center,50 to 69,117,F,White,Spanish/Hispanic,7,Emergency,Home or Self Care,2018,CIR030,AORTIC AND PERIPHERAL ARTERIAL EMBOLISM OR THROMBOSIS,CAR007,"EMBOLECTOMY, ENDARTERECTOMY, AND RELATED VESSEL PROCEDURES (NON-ENDOVASCULAR; EXCLUDING CAROTID)",182,OTHER PERIPHERAL VASCULAR PROCEDURES,05,DISEASES AND DISORDERS OF THE CIRCULATORY SYSTEM,3,Major,Major,Surgical,Medicaid,Medicaid,,,,true,102252.11,16112.34
New York City,Kings,7001021,001306,New York - Presbyterian Brooklyn Methodist Hospital,50 to 69,112,F,Other Race,Not Span/Hispanic,2,Emergency,Home or Self Care,2018,INJ033,"COMPLICATION OF CARDIOVASCULAR DEVICE, IMPLANT OR GRAFT, INITIAL ENCOUNTER",CAR008,ANGIOPLASTY AND RELATED VESSEL PROCEDURES (ENDOVASCULAR; EXCLUDING CAROTID),182,OTHER PERIPHERAL VASCULAR PROCEDURES,05,DISEASES AND DISORDERS OF THE CIRCULATORY SYSTEM,2,Moderate,Moderate,Surgical,Private Health Insurance,Medicaid,Self-Pay,,,true,24182.46,9909.12