Hospital Service Area,Hospital County,Operating Certificate Number,Permanent Facility Id,Facility Name,Age Group,Zip Code - 3 digits,Gender,Race,Ethnicity,Length of Stay,Type of Admission,Patient Disposition,Discharge Year,CCS Diagnosis Code,CCS Diagnosis Description,CCS Procedure Code,CCS Procedure Description,APR DRG Code,APR DRG Description,APR MDC Code,APR MDC Description,APR Severity of Illness Code,APR Severity of Illness Description,APR Risk of Mortality,APR Medical Surgical Description,Payment Typology 1,Payment Typology 2,Payment Typology 3,Birth Weight,Abortion Edit Indicator,Emergency Department Indicator,Total Charges,Total Costs
New York City,Manhattan,7002053,001463,NYU Langone Hospitals,50 to 69,100,M,White,Not Span/Hispanic,5,Emergency,Home or Self Care,2019,CIR027,ARTERIAL DISSECTIONS,CAR011,ANEURYSM REPAIR PROCEDURES,182,OTHER PERIPHERAL VASCULAR PROCEDURES,05,DISEASES AND DISORDERS OF THE CIRCULATORY SYSTEM,2,Moderate,Moderate,Surgical,Medicare,Private Health Insurance,,,,false,338682.98,70474.35
New York City,Manhattan,7002001,001438,Bellevue Hospital Center,50 to 69,OOS,M,White,Not Span/Hispanic,38,Emergency,Home or Self Care,2019,CIR029,AORTIC; PERIPHERAL; AND VISCERAL ARTERY ANEURYSMS,CAR011,ANEURYSM REPAIR PROCEDURES,182,OTHER PERIPHERAL VASCULAR PROCEDURES,05,DISEASES AND DISORDERS OF THE CIRCULATORY SYSTEM,2,Moderate,Minor,Surgical,Medicare,,,,,true,207324.1,137787.6
New York City,Manhattan,7002017,001450,Lenox Hill Hospital,50 to 69,100,M,Black/African American,Not Span/Hispanic,2,Emergency,Home or Self Care,2019,INJ033,"COMPLICATION OF CARDIOVASCULAR DEVICE, IMPLANT OR GRAFT, INITIAL ENCOUNTER",CAR008,ANGIOPLASTY AND RELATED VESSEL PROCEDURES (ENDOVASCULAR; EXCLUDING CAROTID),182,OTHER PERIPHERAL VASCULAR PROCEDURES,05,DISEASES AND DISORDERS OF THE CIRCULATORY SYSTEM,2,Moderate,Minor,Surgical,Blue Cross/Blue Shield,,,,,true,125150.43,36433.95
Long Island,Suffolk,5151001,000245,Stony Brook University Hospital,70 or Older,117,M,White,Not Span/Hispanic,23,Emergency,Skilled Nursing Home,2019,CIR030,AORTIC AND PERIPHERAL ARTERIAL EMBOLISM OR THROMBOSIS,CAR007,"EMBOLECTOMY, ENDARTERECTOMY, AND RELATED VESSEL PROCEDURES (NON-ENDOVASCULAR; EXCLUDING CAROTID)",182,OTHER PERIPHERAL VASCULAR PROCEDURES,05,DISEASES AND DISORDERS OF THE CIRCULATORY SYSTEM,4,Extreme,Extreme,Surgical,Medicare,Medicare,,,,true,424841.25,132095.77
Long Island,Suffolk,5151001,000245,Stony Brook University Hospital,50 to 69,117,M,White,Not Span/Hispanic,8,Elective,Home w/ Home Health Services,2019,CIR029,AORTIC; PERIPHERAL; AND VISCERAL ARTERY ANEURYSMS,CAR011,ANEURYSM REPAIR PROCEDURES,182,OTHER PERIPHERAL VASCULAR PROCEDURES,05,DISEASES AND DISORDERS OF THE CIRCULATORY SYSTEM,3,Major,Extreme,Surgical,Medicare,,,,,false,230377.96,89239.51
New York City,Kings,7001016,001301,Kings County Hospital Center,50 to 69,112,F,Black/African American,Not Span/Hispanic,3,Emergency,Home w/ Home Health Services,2019,GEN003,CHRONIC KIDNEY DISEASE,ADM005,ADMINISTRATION OF THROMBOLYTICS AND PLATELET INHIBITORS,182,OTHER PERIPHERAL VASCULAR PROCEDURES,05,DISEASES AND DISORDERS OF THE CIRCULATORY SYSTEM,3,Major,Major,Surgical,Medicare,Blue Cross/Blue Shield,,,,true,24390.26,17325.89
Finger Lakes,Monroe,2701003,000411,Rochester General Hospital,70 or Older,144,F,White,Not Span/Hispanic,16,Emergency,Skilled Nursing Home,2019,CIR027,ARTERIAL DISSECTIONS,CAR011,ANEURYSM REPAIR PROCEDURES,182,OTHER PERIPHERAL VASCULAR PROCEDURES,05,DISEASES AND DISORDERS OF THE CIRCULATORY SYSTEM,4,Extreme,Extreme,Surgical,Medicare,,,,,true,166932.18,59384.61
New York City,Manhattan,7002054,001458,New York-Presbyterian Hospital - New York Weill Cornell Center,70 or Older,112,M,Other Race,Not Span/Hispanic,1,Elective,Home w/ Home Health Services,2019,INJ033,"COMPLICATION OF CARDIOVASCULAR DEVICE, IMPLANT OR GRAFT, INITIAL ENCOUNTER",CAR011,ANEURYSM REPAIR PROCEDURES,182,OTHER PERIPHERAL VASCULAR PROCEDURES,05,DISEASES AND DISORDERS OF THE CIRCULATORY SYSTEM,2,Moderate,Moderate,Surgical,Medicare,Medicaid,Self-Pay,,,false,48730.31,17064.88
Long Island,Nassau,2908000,000511,NYU Langone Hospital-Long Island,50 to 69,117,M,White,Not Span/Hispanic,1,Elective,Home or Self Care,2019,CIR029,AORTIC; PERIPHERAL; AND VISCERAL ARTERY ANEURYSMS,CAR011,ANEURYSM REPAIR PROCEDURES,182,OTHER PERIPHERAL VASCULAR PROCEDURES,05,DISEASES AND DISORDERS OF THE CIRCULATORY SYSTEM,2,Moderate,Minor,Surgical,Medicare,Medicare,Blue Cross/Blue Shield,,,false,266483.17,42891.24
Central NY,Onondaga,3301007,000635,University Hospital SUNY Health Science Center,70 or Older,134,M,White,Not Span/Hispanic,2,Emergency,Home or Self Care,2019,CIR029,AORTIC; PERIPHERAL; AND VISCERAL ARTERY ANEURYSMS,CAR011,ANEURYSM REPAIR PROCEDURES,182,OTHER PERIPHERAL VASCULAR PROCEDURES,05,DISEASES AND DISORDERS OF THE CIRCULATORY SYSTEM,1,Minor,Moderate,Surgical,Medicare,,,,,true,138846.03,50012.25
New York City,Manhattan,7002054,001458,New York-Presbyterian Hospital - New York Weill Cornell Center,0 to 17,113,M,Other Race,Spanish/Hispanic,6,Emergency,Home or Self Care,2019,MAL001,CARDIAC AND CIRCULATORY CONGENITAL ANOMALIES,CAR010,LIGATION AND EMBOLIZATION OF VESSELS,182,OTHER PERIPHERAL VASCULAR PROCEDURES,05,DISEASES AND DISORDERS OF THE CIRCULATORY SYSTEM,4,Extreme,Major,Surgical,"Managed Care, Unspecified",Medicaid,Self-Pay,,,false,169366.29,73621.75
New York City,Kings,7001002,001286,Brookdale Hospital Medical Center,50 to 69,112,M,Black/African American,Not Span/Hispanic,10,Emergency,Home or Self Care,2019,CIR029,AORTIC; PERIPHERAL; AND VISCERAL ARTERY ANEURYSMS,CAR011,ANEURYSM REPAIR PROCEDURES,182,OTHER PERIPHERAL VASCULAR PROCEDURES,05,DISEASES AND DISORDERS OF THE CIRCULATORY SYSTEM,4,Extreme,Extreme,Surgical,Medicaid,,,,,true,65357.73,37238.71
New York City,Manhattan,7002001,001438,Bellevue Hospital Center,50 to 69,100,M,Black/African American,Not Span/Hispanic,1,Emergency,Home or Self Care,2019,CIR031,HYPOTENSION,CAR010,LIGATION AND EMBOLIZATION OF VESSELS,182,OTHER PERIPHERAL VASCULAR PROCEDURES,05,DISEASES AND DISORDERS OF THE CIRCULATORY SYSTEM,3,Major,Major,Surgical,Self-Pay,,,,,true,8089.34,5376.18
Finger Lakes,Monroe,2701003,000411,Rochester General Hospital,70 or Older,145,M,White,Not Span/Hispanic,2,Elective,Home or Self Care,2019,CIR029,AORTIC; PERIPHERAL; AND VISCERAL ARTERY ANEURYSMS,CAR011,ANEURYSM REPAIR PROCEDURES,182,OTHER PERIPHERAL VASCULAR PROCEDURES,05,DISEASES AND DISORDERS OF THE CIRCULATORY SYSTEM,2,Moderate,Minor,Surgical,Medicare,,,,,false,85375.26,22086.1
New York City,Kings,7001021,001306,New York - Presbyterian Brooklyn Methodist Hospital,30 to 49,103,M,Black/African American,Not Span/Hispanic,2,Emergency,Home or Self Care,2019,INJ016,"INJURY TO BLOOD VESSELS, INITIAL ENCOUNTER",CAR010,LIGATION AND EMBOLIZATION OF VESSELS,182,OTHER PERIPHERAL VASCULAR PROCEDURES,05,DISEASES AND DISORDERS OF THE CIRCULATORY SYSTEM,2,Moderate,Moderate,Surgical,Blue Cross/Blue Shield,Self-Pay,,,,true,33586.71,12891.3
New York City,Kings,7002053,001304,NYU Langone Hospital-Brooklyn,70 or Older,112,F,White,Not Span/Hispanic,4,Emergency,Home w/ Home Health Services,2019,INJ033,"COMPLICATION OF CARDIOVASCULAR DEVICE, IMPLANT OR GRAFT, INITIAL ENCOUNTER",CAR011,ANEURYSM REPAIR PROCEDURES,182,OTHER PERIPHERAL VASCULAR PROCEDURES,05,DISEASES AND DISORDERS OF THE CIRCULATORY SYSTEM,3,Major,Major,Surgical,Medicare,Medicaid,,,,true,220888.82,41140.17
Hudson Valley,Dutchess,1302001,000181,Vassar Brothers Medical Center,30 to 49,127,F,White,Not Span/Hispanic,3,Emergency,Home or Self Care,2019,CIR033,ACUTE PHLEBITIS; THROMBOPHLEBITIS AND THROMBOEMBOLISM,CAR008,ANGIOPLASTY AND RELATED VESSEL PROCEDURES (ENDOVASCULAR; EXCLUDING CAROTID),182,OTHER PERIPHERAL VASCULAR PROCEDURES,05,DISEASES AND DISORDERS OF THE CIRCULATORY SYSTEM,3,Major,Major,Surgical,Medicare,Medicaid,,,,true,28558.89,8669.61
Capital/Adirond,Albany,0101000,000001,Albany Medical Center Hospital,70 or Older,120,M,Other Race,Unknown,4,Emergency,Federal Health Care Facility,2019,CIR029,AORTIC; PERIPHERAL; AND VISCERAL ARTERY ANEURYSMS,CAR011,ANEURYSM REPAIR PROCEDURES,182,OTHER PERIPHERAL VASCULAR PROCEDURES,05,DISEASES AND DISORDERS OF THE CIRCULATORY SYSTEM,3,Major,Major,Surgical,Private Health Insurance,,,,,true,124407.02,69628.35
New York City,Manhattan,7002054,001458,New York-Presbyterian Hospital - New York Weill Cornell Center,0 to 17,112,F,Black/African American,Not Span/Hispanic,1,Emergency,Home or Self Care,2019,MAL001,CARDIAC AND CIRCULATORY CONGENITAL ANOMALIES,MAM005,MEASUREMENT DURING CARDIAC CATHETERIZATION,182,OTHER PERIPHERAL VASCULAR PROCEDURES,05,DISEASES AND DISORDERS OF THE CIRCULATORY SYSTEM,3,Major,Minor,Surgical,Private Health Insurance,Self-Pay,,,,false,54726.23,21489.53
Long Island,Suffolk,5154001,000925,Good Samaritan Hospital Medical Center,50 to 69,117,F,White,Not Span/Hispanic,1,Emergency,Left Against Medical Advice,2019,INJ033,"COMPLICATION OF CARDIOVASCULAR DEVICE, IMPLANT OR GRAFT, INITIAL ENCOUNTER",CAR007,"EMBOLECTOMY, ENDARTERECTOMY, AND RELATED VESSEL PROCEDURES (NON-ENDOVASCULAR; EXCLUDING CAROTID)",182,OTHER PERIPHERAL VASCULAR PROCEDURES,05,DISEASES AND DISORDERS OF THE CIRCULATORY SYSTEM,2,Moderate,Moderate,Surgical,Medicare,Medicaid,,,,true,36118,6952.97
New York City,Kings,7001002,001286,Brookdale Hospital Medical Center,30 to 49,112,M,Black/African American,Not Span/Hispanic,5,Emergency,Home or Self Care,2019,INJ033,"COMPLICATION OF CARDIOVASCULAR DEVICE, IMPLANT OR GRAFT, INITIAL ENCOUNTER",CAR008,ANGIOPLASTY AND RELATED VESSEL PROCEDURES (ENDOVASCULAR; EXCLUDING CAROTID),182,OTHER PERIPHERAL VASCULAR PROCEDURES,05,DISEASES AND DISORDERS OF THE CIRCULATORY SYSTEM,2,Moderate,Moderate,Surgical,Medicaid,,,,,true,36285.18,21209.35
New York City,Kings,7001021,001306,New York - Presbyterian Brooklyn Methodist Hospital,50 to 69,112,F,Other Race,Not Span/Hispanic,16,Emergency,Home w/ Home Health Services,2019,INJ033,"COMPLICATION OF CARDIOVASCULAR DEVICE, IMPLANT OR GRAFT, INITIAL ENCOUNTER",CAR008,ANGIOPLASTY AND RELATED VESSEL PROCEDURES (ENDOVASCULAR; EXCLUDING CAROTID),182,OTHER PERIPHERAL VASCULAR PROCEDURES,05,DISEASES AND DISORDERS OF THE CIRCULATORY SYSTEM,3,Major,Moderate,Surgical,"Managed Care, Unspecified",Medicaid,Self-Pay,,,true,138492.74,43853.2
Southern Tier,Broome,0303001,000058,United Health Services Hospitals Inc. - Wilson Medical Center,70 or Older,137,M,White,Not Span/Hispanic,15,Emergency,Home w/ Home Health Services,2019,CIR039,OTHER SPECIFIED DISEASES OF VEINS AND LYMPHATICS,CAR010,LIGATION AND EMBOLIZATION OF VESSELS,182,OTHER PERIPHERAL VASCULAR PROCEDURES,05,DISEASES AND DISORDERS OF THE CIRCULATORY SYSTEM,4,Extreme,Extreme,Surgical,Medicare,Medicare,Private Health Insurance,,,true,103535.7,38967.48
New York City,Manhattan,7002053,001463,NYU Langone Hospitals,70 or Older,109,F,White,Not Span/Hispanic,4,Elective,Home or Self Care,2019,CIR038,POSTPROCEDURAL OR POSTOPERATIVE CIRCULATORY SYSTEM COMPLICATION,CAR011,ANEURYSM REPAIR PROCEDURES,182,OTHER PERIPHERAL VASCULAR PROCEDURES,05,DISEASES AND DISORDERS OF THE CIRCULATORY SYSTEM,3,Major,Major,Surgical,Medicare,Private Health Insurance,,,,false,363922.7,71851.04
New York City,Manhattan,7002053,001463,NYU Langone Hospitals,50 to 69,OOS,F,White,Not Span/Hispanic,5,Elective,Home w/ Home Health Services,2019,CIR029,AORTIC; PERIPHERAL; AND VISCERAL ARTERY ANEURYSMS,CAR011,ANEURYSM REPAIR PROCEDURES,182,OTHER PERIPHERAL VASCULAR PROCEDURES,05,DISEASES AND DISORDERS OF THE CIRCULATORY SYSTEM,3,Major,Moderate,Surgical,Private Health Insurance,,,,,false,285403.7,52549.82
New York City,Manhattan,7002053,001463,NYU Langone Hospitals,70 or Older,103,M,Other Race,Not Span/Hispanic,2,Elective,Home or Self Care,2019,CIR032,OTHER SPECIFIED AND UNSPECIFIED CIRCULATORY DISEASE,CAR010,LIGATION AND EMBOLIZATION OF VESSELS,182,OTHER PERIPHERAL VASCULAR PROCEDURES,05,DISEASES AND DISORDERS OF THE CIRCULATORY SYSTEM,3,Major,Moderate,Surgical,Federal/State/Local/VA,,,,,false,199341.55,35783.09
New York City,Queens,7003004,001630,Long Island Jewish Medical Center,70 or Older,117,F,White,Not Span/Hispanic,12,Urgent,Home or Self Care,2019,CIR029,AORTIC; PERIPHERAL; AND VISCERAL ARTERY ANEURYSMS,CAR010,LIGATION AND EMBOLIZATION OF VESSELS,182,OTHER PERIPHERAL VASCULAR PROCEDURES,05,DISEASES AND DISORDERS OF THE CIRCULATORY SYSTEM,4,Extreme,Major,Surgical,Medicare,Private Health Insurance,Self-Pay,,,false,211751.08,45532.82
Hudson Valley,Westchester,5957001,001139,Westchester Medical Center,50 to 69,105,M,White,Not Span/Hispanic,2,Elective,Home or Self Care,2019,CIR029,AORTIC; PERIPHERAL; AND VISCERAL ARTERY ANEURYSMS,CAR011,ANEURYSM REPAIR PROCEDURES,182,OTHER PERIPHERAL VASCULAR PROCEDURES,05,DISEASES AND DISORDERS OF THE CIRCULATORY SYSTEM,1,Minor,Minor,Surgical,Medicare,Medicare,,,,false,209007.97,40535.85
New York City,Bronx,7000002,001165,Jacobi Medical Center,70 or Older,104,M,White,Spanish/Hispanic,4,Emergency,Home w/ Home Health Services,2019,INJ033,"COMPLICATION OF CARDIOVASCULAR DEVICE, IMPLANT OR GRAFT, INITIAL ENCOUNTER",ESA001,HEMODIALYSIS,182,OTHER PERIPHERAL VASCULAR PROCEDURES,05,DISEASES AND DISORDERS OF THE CIRCULATORY SYSTEM,3,Major,Major,Surgical,Medicare,Medicare,Medicaid,,,false,31386.16,18569.62
New York City,Queens,7003004,001630,Long Island Jewish Medical Center,70 or Older,114,M,White,Not Span/Hispanic,1,Elective,Home or Self Care,2019,CIR029,AORTIC; PERIPHERAL; AND VISCERAL ARTERY ANEURYSMS,CAR011,ANEURYSM REPAIR PROCEDURES,182,OTHER PERIPHERAL VASCULAR PROCEDURES,05,DISEASES AND DISORDERS OF THE CIRCULATORY SYSTEM,2,Moderate,Moderate,Surgical,Private Health Insurance,Self-Pay,,,,false,10736.9,1981.92
Hudson Valley,Dutchess,5957001,000180,Mid-Hudson Valley Division of Westchester Medical Center,70 or Older,125,M,Black/African American,Not Span/Hispanic,2,Elective,Home or Self Care,2019,INJ033,"COMPLICATION OF CARDIOVASCULAR DEVICE, IMPLANT OR GRAFT, INITIAL ENCOUNTER",CAR008,ANGIOPLASTY AND RELATED VESSEL PROCEDURES (ENDOVASCULAR; EXCLUDING CAROTID),182,OTHER PERIPHERAL VASCULAR PROCEDURES,05,DISEASES AND DISORDERS OF THE CIRCULATORY SYSTEM,2,Moderate,Moderate,Surgical,Medicare,Medicaid,,,,false,48485.91,9282.47
New York City,Manhattan,7002054,001464,New York-Presbyterian Hospital - Columbia Presbyterian Center,70 or Older,112,M,Other Race,Not Span/Hispanic,9,Emergency,Home w/ Home Health Services,2019,GEN003,CHRONIC KIDNEY DISEASE,CAR008,ANGIOPLASTY AND RELATED VESSEL PROCEDURES (ENDOVASCULAR; EXCLUDING CAROTID),182,OTHER PERIPHERAL VASCULAR PROCEDURES,05,DISEASES AND DISORDERS OF THE CIRCULATORY SYSTEM,3,Major,Moderate,Surgical,Medicare,Medicaid,Self-Pay,,,true,181033.68,80158.99
New York City,Kings,7001002,001286,Brookdale Hospital Medical Center,70 or Older,112,M,Black/African American,Not Span/Hispanic,2,Emergency,Skilled Nursing Home,2019,INJ033,"COMPLICATION OF CARDIOVASCULAR DEVICE, IMPLANT OR GRAFT, INITIAL ENCOUNTER",CAR008,ANGIOPLASTY AND RELATED VESSEL PROCEDURES (ENDOVASCULAR; EXCLUDING CAROTID),182,OTHER PERIPHERAL VASCULAR PROCEDURES,05,DISEASES AND DISORDERS OF THE CIRCULATORY SYSTEM,2,Moderate,Moderate,Surgical,Medicare,Medicaid,,,,true,18501.38,11650.6
Central NY,Oneida,3202003,000599,Faxton-St Lukes Healthcare St Lukes Division,30 to 49,134,F,White,Not Span/Hispanic,6,Emergency,Home or Self Care,2019,INJ033,"COMPLICATION OF CARDIOVASCULAR DEVICE, IMPLANT OR GRAFT, INITIAL ENCOUNTER",CAR008,ANGIOPLASTY AND RELATED VESSEL PROCEDURES (ENDOVASCULAR; EXCLUDING CAROTID),182,OTHER PERIPHERAL VASCULAR PROCEDURES,05,DISEASES AND DISORDERS OF THE CIRCULATORY SYSTEM,3,Major,Major,Surgical,Medicaid,,,,,true,34561.4,8505.7
Long Island,Suffolk,5151001,000245,Stony Brook University Hospital,50 to 69,117,M,Black/African American,Not Span/Hispanic,6,Emergency,Home w/ Home Health Services,2019,CIR034,CHRONIC PHLEBITIS; THROMBOPHLEBITIS AND THROMBOEMBOLISM,CAR008,ANGIOPLASTY AND RELATED VESSEL PROCEDURES (ENDOVASCULAR; EXCLUDING CAROTID),182,OTHER PERIPHERAL VASCULAR PROCEDURES,05,DISEASES AND DISORDERS OF THE CIRCULATORY SYSTEM,3,Major,Major,Surgical,Medicare,Blue Cross/Blue Shield,,,,true,92172.47,29444.51
Hudson Valley,Dutchess,5957001,000180,Mid-Hudson Valley Division of Westchester Medical Center,50 to 69,126,F,White,Not Span/Hispanic,1,Elective,Home or Self Care,2019,CIR029,AORTIC; PERIPHERAL; AND VISCERAL ARTERY ANEURYSMS,CAR011,ANEURYSM REPAIR PROCEDURES,182,OTHER PERIPHERAL VASCULAR PROCEDURES,05,DISEASES AND DISORDERS OF THE CIRCULATORY SYSTEM,1,Minor,Moderate,Surgical,Blue Cross/Blue Shield,,,,,false,106860.47,20209.35
Finger Lakes,Monroe,2701005,000413,Strong Memorial Hospital,70 or Older,146,F,Black/African American,Not Span/Hispanic,2,Emergency,Home or Self Care,2019,INJ033,"COMPLICATION OF CARDIOVASCULAR DEVICE, IMPLANT OR GRAFT, INITIAL ENCOUNTER",CAR008,ANGIOPLASTY AND RELATED VESSEL PROCEDURES (ENDOVASCULAR; EXCLUDING CAROTID),182,OTHER PERIPHERAL VASCULAR PROCEDURES,05,DISEASES AND DISORDERS OF THE CIRCULATORY SYSTEM,2,Moderate,Moderate,Surgical,Medicare,,,,,true,27148,9519.02
New York City,Manhattan,7002054,001464,New York-Presbyterian Hospital - Columbia Presbyterian Center,70 or Older,100,M,White,Spanish/Hispanic,9,Emergency,Home w/ Home Health Services,2019,CIR019,HEART FAILURE,CAR008,ANGIOPLASTY AND RELATED VESSEL PROCEDURES (ENDOVASCULAR; EXCLUDING CAROTID),182,OTHER PERIPHERAL VASCULAR PROCEDURES,05,DISEASES AND DISORDERS OF THE CIRCULATORY SYSTEM,4,Extreme,Extreme,Surgical,Medicare,Medicaid,Self-Pay,,,true,138782.93,34826.72
New York City,Kings,7001021,001306,New York - Presbyterian Brooklyn Methodist Hospital,50 to 69,112,F,Black/African American,Not Span/Hispanic,2,Emergency,Home or Self Care,2019,INJ033,"COMPLICATION OF CARDIOVASCULAR DEVICE, IMPLANT OR GRAFT, INITIAL ENCOUNTER",CAR007,"EMBOLECTOMY, ENDARTERECTOMY, AND RELATED VESSEL PROCEDURES (NON-ENDOVASCULAR; EXCLUDING CAROTID)",182,OTHER PERIPHERAL VASCULAR PROCEDURES,05,DISEASES AND DISORDERS OF THE CIRCULATORY SYSTEM,3,Major,Major,Surgical,Medicare,Medicare,Self-Pay,,,true,34895.02,16221.28
Long Island,Nassau,2953000,000563,St. Francis Hospital & Heart Center,50 to 69,117,M,White,Not Span/Hispanic,5,Emergency,Home or Self Care,2019,CIR029,AORTIC; PERIPHERAL; AND VISCERAL ARTERY ANEURYSMS,CAR011,ANEURYSM REPAIR PROCEDURES,182,OTHER PERIPHERAL VASCULAR PROCEDURES,05,DISEASES AND DISORDERS OF THE CIRCULATORY SYSTEM,1,Minor,Minor,Surgical,Medicare,Medicare,,,,true,203472.11,33937.57
Southern Tier,Broome,0303001,000058,United Health Services Hospitals Inc. - Wilson Medical Center,70 or Older,139,F,White,Not Span/Hispanic,3,Emergency,Home or Self Care,2019,CIR008,HYPERTENSION WITH COMPLICATIONS AND SECONDARY HYPERTENSION,CAR021,"ARTERY, VEIN, AND GREAT VESSEL PROCEDURES, NEC",182,OTHER PERIPHERAL VASCULAR PROCEDURES,05,DISEASES AND DISORDERS OF THE CIRCULATORY SYSTEM,2,Moderate,Moderate,Surgical,Medicare,Medicare,Medicaid,,,true,23865.4,11267.33
Hudson Valley,Westchester,5957001,001139,Westchester Medical Center,50 to 69,109,M,Black/African American,Not Span/Hispanic,4,Emergency,Expired,2019,CIR029,AORTIC; PERIPHERAL; AND VISCERAL ARTERY ANEURYSMS,CAR011,ANEURYSM REPAIR PROCEDURES,182,OTHER PERIPHERAL VASCULAR PROCEDURES,05,DISEASES AND DISORDERS OF THE CIRCULATORY SYSTEM,4,Extreme,Extreme,Surgical,Medicaid,,,,,true,364242.77,70230.45
Capital/Adirond,Warren,5601000,001005,Glens Falls Hospital,50 to 69,131,M,White,Not Span/Hispanic,3,Elective,Home or Self Care,2019,CIR008,HYPERTENSION WITH COMPLICATIONS AND SECONDARY HYPERTENSION,CAR008,ANGIOPLASTY AND RELATED VESSEL PROCEDURES (ENDOVASCULAR; EXCLUDING CAROTID),182,OTHER PERIPHERAL VASCULAR PROCEDURES,05,DISEASES AND DISORDERS OF THE CIRCULATORY SYSTEM,3,Major,Major,Surgical,Blue Cross/Blue Shield,,,,,false,125657.39,45831.87
Capital/Adirond,Albany,0101004,000005,St. Peter's Hospital,70 or Older,121,M,White,Not Span/Hispanic,1,Elective,Home or Self Care,2019,CIR029,AORTIC; PERIPHERAL; AND VISCERAL ARTERY ANEURYSMS,CAR011,ANEURYSM REPAIR PROCEDURES,182,OTHER PERIPHERAL VASCULAR PROCEDURES,05,DISEASES AND DISORDERS OF THE CIRCULATORY SYSTEM,2,Moderate,Minor,Surgical,Medicare,Blue Cross/Blue Shield,,,,false,72793.5,28214.1
Capital/Adirond,Warren,5601000,001005,Glens Falls Hospital,70 or Older,129,F,White,Not Span/Hispanic,2,Elective,Home w/ Home Health Services,2019,CIR029,AORTIC; PERIPHERAL; AND VISCERAL ARTERY ANEURYSMS,CAR011,ANEURYSM REPAIR PROCEDURES,182,OTHER PERIPHERAL VASCULAR PROCEDURES,05,DISEASES AND DISORDERS OF THE CIRCULATORY SYSTEM,1,Minor,Minor,Surgical,Medicare,Blue Cross/Blue Shield,,,,false,120849.14,47294.74
Long Island,Nassau,2953000,000563,St. Francis Hospital & Heart Center,70 or Older,117,M,White,Not Span/Hispanic,1,Elective,Home or Self Care,2019,CIR026,PERIPHERAL AND VISCERAL VASCULAR DISEASE,CAR008,ANGIOPLASTY AND RELATED VESSEL PROCEDURES (ENDOVASCULAR; EXCLUDING CAROTID),182,OTHER PERIPHERAL VASCULAR PROCEDURES,05,DISEASES AND DISORDERS OF THE CIRCULATORY SYSTEM,2,Moderate,Moderate,Surgical,Medicare,Medicare,Blue Cross/Blue Shield,,,false,54945.62,9956.71
Western NY,Erie,1401008,000213,Mercy Hospital of Buffalo,70 or Older,142,M,White,Not Span/Hispanic,1,Elective,Home or Self Care,2019,CIR029,AORTIC; PERIPHERAL; AND VISCERAL ARTERY ANEURYSMS,CAR011,ANEURYSM REPAIR PROCEDURES,182,OTHER PERIPHERAL VASCULAR PROCEDURES,05,DISEASES AND DISORDERS OF THE CIRCULATORY SYSTEM,2,Moderate,Moderate,Surgical,Medicare,Medicare,,,,false,47748.53,28795.39
Western NY,Erie,1401008,000213,Mercy Hospital of Buffalo,70 or Older,140,M,White,Not Span/Hispanic,2,Elective,Home or Self Care,2019,CIR029,AORTIC; PERIPHERAL; AND VISCERAL ARTERY ANEURYSMS,CAR011,ANEURYSM REPAIR PROCEDURES,182,OTHER PERIPHERAL VASCULAR PROCEDURES,05,DISEASES AND DISORDERS OF THE CIRCULATORY SYSTEM,1,Minor,Moderate,Surgical,Medicare,Medicare,,,,false,60215.53,35709.51
Hudson Valley,Westchester,5957001,001139,Westchester Medical Center,70 or Older,113,M,Other Race,Unknown,5,Emergency,Home or Self Care,2019,CIR027,ARTERIAL DISSECTIONS,CAR011,ANEURYSM REPAIR PROCEDURES,182,OTHER PERIPHERAL VASCULAR PROCEDURES,05,DISEASES AND DISORDERS OF THE CIRCULATORY SYSTEM,3,Major,Major,Surgical,Medicare,Medicare,,,,true,230052.32,43470.43
Capital/Adirond,Schenectady,4601001,000829,Ellis Hospital,70 or Older,123,F,White,Not Span/Hispanic,14,Emergency,Skilled Nursing Home,2019,INJ033,"COMPLICATION OF CARDIOVASCULAR DEVICE, IMPLANT OR GRAFT, INITIAL ENCOUNTER",CAR020,SAPHENOUS VEIN HARVEST AND OTHER THERAPEUTIC VESSEL REMOVAL,182,OTHER PERIPHERAL VASCULAR PROCEDURES,05,DISEASES AND DISORDERS OF THE CIRCULATORY SYSTEM,4,Extreme,Extreme,Surgical,Medicare,Medicare,,,,true,83410.89,26654.42
New York City,Manhattan,7002054,001464,New York-Presbyterian Hospital - Columbia Presbyterian Center,70 or Older,100,M,Other Race,Spanish/Hispanic,4,Emergency,Home w/ Home Health Services,2019,INJ033,"COMPLICATION OF CARDIOVASCULAR DEVICE, IMPLANT OR GRAFT, INITIAL ENCOUNTER",CAR008,ANGIOPLASTY AND RELATED VESSEL PROCEDURES (ENDOVASCULAR; EXCLUDING CAROTID),182,OTHER PERIPHERAL VASCULAR PROCEDURES,05,DISEASES AND DISORDERS OF THE CIRCULATORY SYSTEM,3,Major,Major,Surgical,Medicare,Medicare,Medicaid,,,false,62850.27,16466.22
New York City,Manhattan,7002054,001464,New York-Presbyterian Hospital - Columbia Presbyterian Center,70 or Older,OOS,F,Other Race,Not Span/Hispanic,15,Urgent,Home w/ Home Health Services,2019,CIR036,POSTTHROMBOTIC SYNDROME AND VENOUS INSUFFICIENCY/HYPERTENSION,CAR008,ANGIOPLASTY AND RELATED VESSEL PROCEDURES (ENDOVASCULAR; EXCLUDING CAROTID),182,OTHER PERIPHERAL VASCULAR PROCEDURES,05,DISEASES AND DISORDERS OF THE CIRCULATORY SYSTEM,4,Extreme,Major,Surgical,Medicare,Private Health Insurance,Self-Pay,,,false,286988.27,125847.96