Hospital Service Area,Hospital County,Operating Certificate Number,Permanent Facility Id,Facility Name,Age Group,Zip Code - 3 digits,Gender,Race,Ethnicity,Length of Stay,Type of Admission,Patient Disposition,Discharge Year,CCS Diagnosis Code,CCS Diagnosis Description,CCS Procedure Code,CCS Procedure Description,APR DRG Code,APR DRG Description,APR MDC Code,APR MDC Description,APR Severity of Illness Code,APR Severity of Illness Description,APR Risk of Mortality,APR Medical Surgical Description,Payment Typology 1,Payment Typology 2,Payment Typology 3,Birth Weight,Abortion Edit Indicator,Emergency Department Indicator,Total Charges,Total Costs
New York City,Manhattan,7002001,001438,Bellevue Hospital Center,50 to 69,OOS,M,White,Not Span/Hispanic,38,Emergency,Home or Self Care,2019,CIR029,AORTIC; PERIPHERAL; AND VISCERAL ARTERY ANEURYSMS,CAR011,ANEURYSM REPAIR PROCEDURES,182,OTHER PERIPHERAL VASCULAR PROCEDURES,05,DISEASES AND DISORDERS OF THE CIRCULATORY SYSTEM,2,Moderate,Minor,Surgical,Medicare,,,,,true,207324.1,137787.6
New York City,Manhattan,7002001,001438,Bellevue Hospital Center,50 to 69,100,M,Black/African American,Not Span/Hispanic,1,Emergency,Home or Self Care,2019,CIR031,HYPOTENSION,CAR010,LIGATION AND EMBOLIZATION OF VESSELS,182,OTHER PERIPHERAL VASCULAR PROCEDURES,05,DISEASES AND DISORDERS OF THE CIRCULATORY SYSTEM,3,Major,Major,Surgical,Self-Pay,,,,,true,8089.34,5376.18
New York City,Manhattan,7002001,001438,Bellevue Hospital Center,30 to 49,104,M,Other Race,Spanish/Hispanic,1,Emergency,Home or Self Care,2019,MAL001,CARDIAC AND CIRCULATORY CONGENITAL ANOMALIES,CAR010,LIGATION AND EMBOLIZATION OF VESSELS,182,OTHER PERIPHERAL VASCULAR PROCEDURES,05,DISEASES AND DISORDERS OF THE CIRCULATORY SYSTEM,1,Minor,Minor,Surgical,Medicaid,,,,,false,7006.08,4656.24
New York City,Manhattan,7002001,001438,Bellevue Hospital Center,50 to 69,114,F,Black/African American,Not Span/Hispanic,10,Emergency,Home or Self Care,2019,MAL001,CARDIAC AND CIRCULATORY CONGENITAL ANOMALIES,GIS011,SMALL BOWEL RESECTION,182,OTHER PERIPHERAL VASCULAR PROCEDURES,05,DISEASES AND DISORDERS OF THE CIRCULATORY SYSTEM,3,Major,Major,Surgical,Private Health Insurance,,,,,false,79475.06,52819.12
New York City,Manhattan,7002001,001438,Bellevue Hospital Center,50 to 69,112,M,White,Not Span/Hispanic,68,Emergency,Home w/ Home Health Services,2019,CIR030,AORTIC AND PERIPHERAL ARTERIAL EMBOLISM OR THROMBOSIS,MST026,FINGER AND OTHER UPPER EXTREMITY AMPUTATION,182,OTHER PERIPHERAL VASCULAR PROCEDURES,05,DISEASES AND DISORDERS OF THE CIRCULATORY SYSTEM,4,Extreme,Major,Surgical,Medicaid,Medicaid,,,,false,385094.18,255933.59
New York City,Manhattan,7002001,001438,Bellevue Hospital Center,50 to 69,112,M,Other Race,Spanish/Hispanic,4,Emergency,Home or Self Care,2019,INJ033,"COMPLICATION OF CARDIOVASCULAR DEVICE, IMPLANT OR GRAFT, INITIAL ENCOUNTER",CAR010,LIGATION AND EMBOLIZATION OF VESSELS,182,OTHER PERIPHERAL VASCULAR PROCEDURES,05,DISEASES AND DISORDERS OF THE CIRCULATORY SYSTEM,2,Moderate,Moderate,Surgical,Medicare,Medicaid,,,,true,43069.54,28624.02
New York City,Manhattan,7002001,001438,Bellevue Hospital Center,70 or Older,104,M,White,Not Span/Hispanic,3,Elective,Home or Self Care,2019,CIR029,AORTIC; PERIPHERAL; AND VISCERAL ARTERY ANEURYSMS,CAR011,ANEURYSM REPAIR PROCEDURES,182,OTHER PERIPHERAL VASCULAR PROCEDURES,05,DISEASES AND DISORDERS OF THE CIRCULATORY SYSTEM,2,Moderate,Moderate,Surgical,Medicare,,,,,false,88324.47,58700.44
New York City,Manhattan,7002001,001438,Bellevue Hospital Center,30 to 49,100,M,Black/African American,Not Span/Hispanic,35,Emergency,Home or Self Care,2019,CIR036,POSTTHROMBOTIC SYNDROME AND VENOUS INSUFFICIENCY/HYPERTENSION,CAR008,ANGIOPLASTY AND RELATED VESSEL PROCEDURES (ENDOVASCULAR; EXCLUDING CAROTID),182,OTHER PERIPHERAL VASCULAR PROCEDURES,05,DISEASES AND DISORDERS OF THE CIRCULATORY SYSTEM,3,Major,Moderate,Surgical,Medicaid,,,,,true,259403.18,172399.35
New York City,Manhattan,7002001,001438,Bellevue Hospital Center,50 to 69,100,F,Black/African American,Not Span/Hispanic,9,Urgent,Home or Self Care,2019,CIR027,ARTERIAL DISSECTIONS,CAR011,ANEURYSM REPAIR PROCEDURES,182,OTHER PERIPHERAL VASCULAR PROCEDURES,05,DISEASES AND DISORDERS OF THE CIRCULATORY SYSTEM,2,Moderate,Major,Surgical,Medicare,,,,,false,155615.94,103422.35
New York City,Manhattan,7002001,001438,Bellevue Hospital Center,50 to 69,112,F,Black/African American,Not Span/Hispanic,33,Urgent,Hospice - Home,2019,CIR029,AORTIC; PERIPHERAL; AND VISCERAL ARTERY ANEURYSMS,CAR011,ANEURYSM REPAIR PROCEDURES,182,OTHER PERIPHERAL VASCULAR PROCEDURES,05,DISEASES AND DISORDERS OF THE CIRCULATORY SYSTEM,4,Extreme,Extreme,Surgical,Medicare,Medicaid,,,,false,401654.29,266939.44
New York City,Manhattan,7002001,001438,Bellevue Hospital Center,70 or Older,114,M,Other Race,Spanish/Hispanic,6,Emergency,Home w/ Home Health Services,2019,CIR029,AORTIC; PERIPHERAL; AND VISCERAL ARTERY ANEURYSMS,CAR011,ANEURYSM REPAIR PROCEDURES,182,OTHER PERIPHERAL VASCULAR PROCEDURES,05,DISEASES AND DISORDERS OF THE CIRCULATORY SYSTEM,3,Major,Minor,Surgical,Medicaid,,,,,true,213305.78,141763.02
New York City,Manhattan,7002001,001438,Bellevue Hospital Center,50 to 69,100,M,Other Race,Unknown,12,Emergency,Home or Self Care,2019,GEN003,CHRONIC KIDNEY DISEASE,CAR016,PORTAL AND OTHER VENOUS BYPASS PROCEDURES,182,OTHER PERIPHERAL VASCULAR PROCEDURES,05,DISEASES AND DISORDERS OF THE CIRCULATORY SYSTEM,4,Extreme,Major,Surgical,Medicaid,,,,,true,122957.52,81717.57
New York City,Manhattan,7002001,001438,Bellevue Hospital Center,50 to 69,104,M,Other Race,Spanish/Hispanic,7,Trauma,Home or Self Care,2019,CIR029,AORTIC; PERIPHERAL; AND VISCERAL ARTERY ANEURYSMS,CAR006,CAROTID ENDARTERECTOMY AND STENTING,182,OTHER PERIPHERAL VASCULAR PROCEDURES,05,DISEASES AND DISORDERS OF THE CIRCULATORY SYSTEM,2,Moderate,Minor,Surgical,Self-Pay,,,,,false,88514.31,58826.61
New York City,Manhattan,7002001,001438,Bellevue Hospital Center,0 to 17,104,M,Black/African American,Not Span/Hispanic,11,Urgent,Short-term Hospital,2019,MAL001,CARDIAC AND CIRCULATORY CONGENITAL ANOMALIES,CAR010,LIGATION AND EMBOLIZATION OF VESSELS,182,OTHER PERIPHERAL VASCULAR PROCEDURES,05,DISEASES AND DISORDERS OF THE CIRCULATORY SYSTEM,4,Extreme,Moderate,Surgical,Medicaid,,,,,false,106638.63,70872.03
New York City,Manhattan,7002001,001438,Bellevue Hospital Center,30 to 49,104,M,Black/African American,Not Span/Hispanic,4,Emergency,Court/Law Enforcement,2019,INJ033,"COMPLICATION OF CARDIOVASCULAR DEVICE, IMPLANT OR GRAFT, INITIAL ENCOUNTER",MST028,"SUBCUTANEOUS TISSUE AND FASCIA PROCEDURES, NEC",182,OTHER PERIPHERAL VASCULAR PROCEDURES,05,DISEASES AND DISORDERS OF THE CIRCULATORY SYSTEM,3,Major,Major,Surgical,Self-Pay,,,,,true,60521.74,40222.75
New York City,Manhattan,7002001,001438,Bellevue Hospital Center,30 to 49,112,F,White,Spanish/Hispanic,20,Emergency,Home w/ Home Health Services,2019,CIR029,AORTIC; PERIPHERAL; AND VISCERAL ARTERY ANEURYSMS,CAR010,LIGATION AND EMBOLIZATION OF VESSELS,182,OTHER PERIPHERAL VASCULAR PROCEDURES,05,DISEASES AND DISORDERS OF THE CIRCULATORY SYSTEM,3,Major,Major,Surgical,Private Health Insurance,,,,,true,191495.48,127267.9
New York City,Manhattan,7002001,001438,Bellevue Hospital Center,50 to 69,112,M,Black/African American,Not Span/Hispanic,22,Emergency,Home or Self Care,2019,CIR027,ARTERIAL DISSECTIONS,CAR011,ANEURYSM REPAIR PROCEDURES,182,OTHER PERIPHERAL VASCULAR PROCEDURES,05,DISEASES AND DISORDERS OF THE CIRCULATORY SYSTEM,3,Major,Major,Surgical,Medicaid,,,,,true,207464.53,137880.93
New York City,Manhattan,7002001,001438,Bellevue Hospital Center,70 or Older,112,F,Other Race,Spanish/Hispanic,1,Elective,Home or Self Care,2019,CIR026,PERIPHERAL AND VISCERAL VASCULAR DISEASE,CAR029,"CARDIOVASCULAR DEVICE PROCEDURES, NEC",182,OTHER PERIPHERAL VASCULAR PROCEDURES,05,DISEASES AND DISORDERS OF THE CIRCULATORY SYSTEM,2,Moderate,Moderate,Surgical,Medicare,,,,,false,26420.24,17558.89
New York City,Manhattan,7002001,001438,Bellevue Hospital Center,50 to 69,112,M,Other Race,Spanish/Hispanic,1,Elective,Home or Self Care,2019,INJ033,"COMPLICATION OF CARDIOVASCULAR DEVICE, IMPLANT OR GRAFT, INITIAL ENCOUNTER",CAR008,ANGIOPLASTY AND RELATED VESSEL PROCEDURES (ENDOVASCULAR; EXCLUDING CAROTID),182,OTHER PERIPHERAL VASCULAR PROCEDURES,05,DISEASES AND DISORDERS OF THE CIRCULATORY SYSTEM,2,Moderate,Moderate,Surgical,Medicare,Medicaid,,,,false,23665.43,15728.04
New York City,Manhattan,7002001,001438,Bellevue Hospital Center,30 to 49,104,M,Other Race,Spanish/Hispanic,1,Elective,Home or Self Care,2019,INJ033,"COMPLICATION OF CARDIOVASCULAR DEVICE, IMPLANT OR GRAFT, INITIAL ENCOUNTER",CAR006,CAROTID ENDARTERECTOMY AND STENTING,182,OTHER PERIPHERAL VASCULAR PROCEDURES,05,DISEASES AND DISORDERS OF THE CIRCULATORY SYSTEM,1,Minor,Minor,Surgical,Medicaid,,,,,false,21287.33,14147.56
New York City,Manhattan,7002001,001438,Bellevue Hospital Center,50 to 69,114,F,Black/African American,Not Span/Hispanic,14,Emergency,Home or Self Care,2019,INJ033,"COMPLICATION OF CARDIOVASCULAR DEVICE, IMPLANT OR GRAFT, INITIAL ENCOUNTER",CAR010,LIGATION AND EMBOLIZATION OF VESSELS,182,OTHER PERIPHERAL VASCULAR PROCEDURES,05,DISEASES AND DISORDERS OF THE CIRCULATORY SYSTEM,4,Extreme,Extreme,Surgical,Medicaid,,,,,true,154432.86,102636.08
New York City,Manhattan,7002001,001438,Bellevue Hospital Center,50 to 69,113,M,Other Race,Spanish/Hispanic,3,Elective,Home or Self Care,2019,CIR029,AORTIC; PERIPHERAL; AND VISCERAL ARTERY ANEURYSMS,CAR011,ANEURYSM REPAIR PROCEDURES,182,OTHER PERIPHERAL VASCULAR PROCEDURES,05,DISEASES AND DISORDERS OF THE CIRCULATORY SYSTEM,1,Minor,Minor,Surgical,Medicaid,,,,,false,91031.62,60499.61
New York City,Manhattan,7002001,001438,Bellevue Hospital Center,70 or Older,111,F,Other Race,Spanish/Hispanic,2,Emergency,Home or Self Care,2019,INJ033,"COMPLICATION OF CARDIOVASCULAR DEVICE, IMPLANT OR GRAFT, INITIAL ENCOUNTER",IMG002,FLUOROSCOPIC ANGIOGRAPHY (EXCLUDING CORONARY),182,OTHER PERIPHERAL VASCULAR PROCEDURES,05,DISEASES AND DISORDERS OF THE CIRCULATORY SYSTEM,3,Major,Major,Surgical,Medicaid,,,,,true,50137.5,33321.38
New York City,Manhattan,7002001,001438,Bellevue Hospital Center,30 to 49,112,M,Other Race,Spanish/Hispanic,1,Elective,Home or Self Care,2019,MAL001,CARDIAC AND CIRCULATORY CONGENITAL ANOMALIES,CAR020,SAPHENOUS VEIN HARVEST AND OTHER THERAPEUTIC VESSEL REMOVAL,182,OTHER PERIPHERAL VASCULAR PROCEDURES,05,DISEASES AND DISORDERS OF THE CIRCULATORY SYSTEM,1,Minor,Minor,Surgical,Medicaid,,,,,false,19989.78,13285.21
New York City,Manhattan,7002001,001438,Bellevue Hospital Center,30 to 49,112,F,Other Race,Unknown,12,Emergency,Home or Self Care,2019,INJ033,"COMPLICATION OF CARDIOVASCULAR DEVICE, IMPLANT OR GRAFT, INITIAL ENCOUNTER",CAR008,ANGIOPLASTY AND RELATED VESSEL PROCEDURES (ENDOVASCULAR; EXCLUDING CAROTID),182,OTHER PERIPHERAL VASCULAR PROCEDURES,05,DISEASES AND DISORDERS OF THE CIRCULATORY SYSTEM,3,Major,Major,Surgical,Medicaid,,,,,true,105096.33,69847.02
New York City,Manhattan,7002001,001438,Bellevue Hospital Center,30 to 49,112,M,Other Race,Not Span/Hispanic,14,Emergency,Home w/ Home Health Services,2019,CIR027,ARTERIAL DISSECTIONS,CAR011,ANEURYSM REPAIR PROCEDURES,182,OTHER PERIPHERAL VASCULAR PROCEDURES,05,DISEASES AND DISORDERS OF THE CIRCULATORY SYSTEM,3,Major,Moderate,Surgical,Medicaid,,,,,true,197653.67,131360.63
New York City,Manhattan,7002001,001438,Bellevue Hospital Center,70 or Older,100,M,Black/African American,Not Span/Hispanic,16,Emergency,Home or Self Care,2019,CIR029,AORTIC; PERIPHERAL; AND VISCERAL ARTERY ANEURYSMS,CAR011,ANEURYSM REPAIR PROCEDURES,182,OTHER PERIPHERAL VASCULAR PROCEDURES,05,DISEASES AND DISORDERS OF THE CIRCULATORY SYSTEM,3,Major,Major,Surgical,Medicare,Medicaid,,,,true,170276.18,113165.55
