Hospital Service Area,Hospital County,Operating Certificate Number,Permanent Facility Id,Facility Name,Age Group,Zip Code - 3 digits,Gender,Race,Ethnicity,Length of Stay,Type of Admission,Patient Disposition,Discharge Year,CCS Diagnosis Code,CCS Diagnosis Description,CCS Procedure Code,CCS Procedure Description,APR DRG Code,APR DRG Description,APR MDC Code,APR MDC Description,APR Severity of Illness Code,APR Severity of Illness Description,APR Risk of Mortality,APR Medical Surgical Description,Payment Typology 1,Payment Typology 2,Payment Typology 3,Birth Weight,Abortion Edit Indicator,Emergency Department Indicator,Total Charges,Total Costs
Long Island,Nassau,2908000,000511,NYU Langone Hospital-Long Island,50 to 69,117,M,White,Not Span/Hispanic,1,Elective,Home or Self Care,2019,CIR029,AORTIC; PERIPHERAL; AND VISCERAL ARTERY ANEURYSMS,CAR011,ANEURYSM REPAIR PROCEDURES,182,OTHER PERIPHERAL VASCULAR PROCEDURES,05,DISEASES AND DISORDERS OF THE CIRCULATORY SYSTEM,2,Moderate,Minor,Surgical,Medicare,Medicare,Blue Cross/Blue Shield,,,false,266483.17,42891.24
Long Island,Nassau,2908000,000511,NYU Langone Hospital-Long Island,70 or Older,117,M,White,Not Span/Hispanic,1,Elective,Home or Self Care,2019,CIR029,AORTIC; PERIPHERAL; AND VISCERAL ARTERY ANEURYSMS,CAR011,ANEURYSM REPAIR PROCEDURES,182,OTHER PERIPHERAL VASCULAR PROCEDURES,05,DISEASES AND DISORDERS OF THE CIRCULATORY SYSTEM,2,Moderate,Moderate,Surgical,Medicare,Medicare,,,,false,339791.2,54717.66
Long Island,Nassau,2908000,000511,NYU Langone Hospital-Long Island,70 or Older,117,F,White,Not Span/Hispanic,5,Emergency,Home or Self Care,2019,GEN003,CHRONIC KIDNEY DISEASE,CAR008,ANGIOPLASTY AND RELATED VESSEL PROCEDURES (ENDOVASCULAR; EXCLUDING CAROTID),182,OTHER PERIPHERAL VASCULAR PROCEDURES,05,DISEASES AND DISORDERS OF THE CIRCULATORY SYSTEM,3,Major,Major,Surgical,Medicare,Medicare,Private Health Insurance,,,true,159303.81,25614.61
Long Island,Nassau,2908000,000511,NYU Langone Hospital-Long Island,70 or Older,115,F,Black/African American,Not Span/Hispanic,2,Emergency,Home or Self Care,2019,INJ033,"COMPLICATION OF CARDIOVASCULAR DEVICE, IMPLANT OR GRAFT, INITIAL ENCOUNTER",CAR008,ANGIOPLASTY AND RELATED VESSEL PROCEDURES (ENDOVASCULAR; EXCLUDING CAROTID),182,OTHER PERIPHERAL VASCULAR PROCEDURES,05,DISEASES AND DISORDERS OF THE CIRCULATORY SYSTEM,3,Major,Moderate,Surgical,Medicare,Medicare,Blue Cross/Blue Shield,,,true,73274.13,11728.73
Long Island,Nassau,2908000,000511,NYU Langone Hospital-Long Island,50 to 69,115,F,Black/African American,Not Span/Hispanic,2,Emergency,Home or Self Care,2019,INJ033,"COMPLICATION OF CARDIOVASCULAR DEVICE, IMPLANT OR GRAFT, INITIAL ENCOUNTER",CAR007,"EMBOLECTOMY, ENDARTERECTOMY, AND RELATED VESSEL PROCEDURES (NON-ENDOVASCULAR; EXCLUDING CAROTID)",182,OTHER PERIPHERAL VASCULAR PROCEDURES,05,DISEASES AND DISORDERS OF THE CIRCULATORY SYSTEM,3,Major,Major,Surgical,Private Health Insurance,Medicare,,,,true,141133.98,22115.02
Long Island,Nassau,2908000,000511,NYU Langone Hospital-Long Island,50 to 69,117,F,White,Not Span/Hispanic,1,Elective,Home or Self Care,2019,MAL001,CARDIAC AND CIRCULATORY CONGENITAL ANOMALIES,CAR010,LIGATION AND EMBOLIZATION OF VESSELS,182,OTHER PERIPHERAL VASCULAR PROCEDURES,05,DISEASES AND DISORDERS OF THE CIRCULATORY SYSTEM,1,Minor,Minor,Surgical,Medicare,Medicare,,,,false,123214.49,21445.09
Long Island,Nassau,2908000,000511,NYU Langone Hospital-Long Island,70 or Older,117,F,White,Not Span/Hispanic,9,Emergency,Skilled Nursing Home,2019,CIR030,AORTIC AND PERIPHERAL ARTERIAL EMBOLISM OR THROMBOSIS,CAR007,"EMBOLECTOMY, ENDARTERECTOMY, AND RELATED VESSEL PROCEDURES (NON-ENDOVASCULAR; EXCLUDING CAROTID)",182,OTHER PERIPHERAL VASCULAR PROCEDURES,05,DISEASES AND DISORDERS OF THE CIRCULATORY SYSTEM,3,Major,Major,Surgical,Medicare,Medicare,Blue Cross/Blue Shield,,,true,136546.42,26106.61
Long Island,Nassau,2908000,000511,NYU Langone Hospital-Long Island,70 or Older,115,F,Other Race,Spanish/Hispanic,5,Emergency,Home w/ Home Health Services,2019,CIR012,NONSPECIFIC CHEST PAIN,CAR021,"ARTERY, VEIN, AND GREAT VESSEL PROCEDURES, NEC",182,OTHER PERIPHERAL VASCULAR PROCEDURES,05,DISEASES AND DISORDERS OF THE CIRCULATORY SYSTEM,3,Major,Major,Surgical,Medicare,Medicare,Medicaid,,,true,118030.21,14612.7
Long Island,Nassau,2908000,000511,NYU Langone Hospital-Long Island,70 or Older,110,M,White,Not Span/Hispanic,9,Elective,Skilled Nursing Home,2019,CIR029,AORTIC; PERIPHERAL; AND VISCERAL ARTERY ANEURYSMS,CAR011,ANEURYSM REPAIR PROCEDURES,182,OTHER PERIPHERAL VASCULAR PROCEDURES,05,DISEASES AND DISORDERS OF THE CIRCULATORY SYSTEM,4,Extreme,Extreme,Surgical,Medicare,Medicare,,,,false,318710.78,50032.27
Long Island,Nassau,2908000,000511,NYU Langone Hospital-Long Island,30 to 49,115,F,Other Race,Spanish/Hispanic,5,Emergency,Home or Self Care,2019,INJ033,"COMPLICATION OF CARDIOVASCULAR DEVICE, IMPLANT OR GRAFT, INITIAL ENCOUNTER",CAR007,"EMBOLECTOMY, ENDARTERECTOMY, AND RELATED VESSEL PROCEDURES (NON-ENDOVASCULAR; EXCLUDING CAROTID)",182,OTHER PERIPHERAL VASCULAR PROCEDURES,05,DISEASES AND DISORDERS OF THE CIRCULATORY SYSTEM,3,Major,Major,Surgical,Medicaid,Medicaid,,,,true,118442.5,19961.11
Long Island,Nassau,2908000,000511,NYU Langone Hospital-Long Island,50 to 69,115,F,White,Not Span/Hispanic,1,Elective,Home or Self Care,2019,MAL001,CARDIAC AND CIRCULATORY CONGENITAL ANOMALIES,CAR010,LIGATION AND EMBOLIZATION OF VESSELS,182,OTHER PERIPHERAL VASCULAR PROCEDURES,05,DISEASES AND DISORDERS OF THE CIRCULATORY SYSTEM,2,Moderate,Minor,Surgical,Private Health Insurance,,,,,false,132869.93,19743.57
Long Island,Nassau,2908000,000511,NYU Langone Hospital-Long Island,70 or Older,115,M,White,Not Span/Hispanic,7,Emergency,Expired,2019,INJ033,"COMPLICATION OF CARDIOVASCULAR DEVICE, IMPLANT OR GRAFT, INITIAL ENCOUNTER",CAR008,ANGIOPLASTY AND RELATED VESSEL PROCEDURES (ENDOVASCULAR; EXCLUDING CAROTID),182,OTHER PERIPHERAL VASCULAR PROCEDURES,05,DISEASES AND DISORDERS OF THE CIRCULATORY SYSTEM,4,Extreme,Major,Surgical,Medicare,Medicare,Private Health Insurance,,,true,204199.4,33338.54
Long Island,Nassau,2908000,000511,NYU Langone Hospital-Long Island,50 to 69,117,F,Black/African American,Not Span/Hispanic,9,Urgent,Skilled Nursing Home,2019,CIR029,AORTIC; PERIPHERAL; AND VISCERAL ARTERY ANEURYSMS,CAR012,VESSEL REPAIR AND REPLACEMENT,182,OTHER PERIPHERAL VASCULAR PROCEDURES,05,DISEASES AND DISORDERS OF THE CIRCULATORY SYSTEM,3,Major,Moderate,Surgical,Federal/State/Local/VA,,,,,false,196236.95,33525.42
Long Island,Nassau,2908000,000511,NYU Langone Hospital-Long Island,50 to 69,117,M,White,Not Span/Hispanic,1,Elective,Home or Self Care,2019,INJ033,"COMPLICATION OF CARDIOVASCULAR DEVICE, IMPLANT OR GRAFT, INITIAL ENCOUNTER",CAR021,"ARTERY, VEIN, AND GREAT VESSEL PROCEDURES, NEC",182,OTHER PERIPHERAL VASCULAR PROCEDURES,05,DISEASES AND DISORDERS OF THE CIRCULATORY SYSTEM,2,Moderate,Minor,Surgical,Medicare,Medicare,Private Health Insurance,,,false,137289.43,21236.62
Long Island,Nassau,2908000,000511,NYU Langone Hospital-Long Island,50 to 69,115,F,White,Not Span/Hispanic,29,Emergency,Expired,2019,INJ033,"COMPLICATION OF CARDIOVASCULAR DEVICE, IMPLANT OR GRAFT, INITIAL ENCOUNTER",CAR011,ANEURYSM REPAIR PROCEDURES,182,OTHER PERIPHERAL VASCULAR PROCEDURES,05,DISEASES AND DISORDERS OF THE CIRCULATORY SYSTEM,4,Extreme,Extreme,Surgical,Medicare,Medicare,Private Health Insurance,,,true,1520176.62,213818.24
Long Island,Nassau,2908000,000511,NYU Langone Hospital-Long Island,50 to 69,115,M,White,Not Span/Hispanic,52,Emergency,Skilled Nursing Home,2019,INJ033,"COMPLICATION OF CARDIOVASCULAR DEVICE, IMPLANT OR GRAFT, INITIAL ENCOUNTER",CAR014,PERIPHERAL ARTERIAL BYPASS PROCEDURES,182,OTHER PERIPHERAL VASCULAR PROCEDURES,05,DISEASES AND DISORDERS OF THE CIRCULATORY SYSTEM,3,Major,Moderate,Surgical,Medicaid,Medicaid,,,,true,681513.47,142479.65
Long Island,Nassau,2908000,000511,NYU Langone Hospital-Long Island,70 or Older,115,M,Black/African American,Not Span/Hispanic,33,Emergency,Home w/ Home Health Services,2019,GEN003,CHRONIC KIDNEY DISEASE,CAR008,ANGIOPLASTY AND RELATED VESSEL PROCEDURES (ENDOVASCULAR; EXCLUDING CAROTID),182,OTHER PERIPHERAL VASCULAR PROCEDURES,05,DISEASES AND DISORDERS OF THE CIRCULATORY SYSTEM,3,Major,Major,Surgical,Medicare,Medicare,,,,true,455649.63,91975.23
Long Island,Nassau,2908000,000511,NYU Langone Hospital-Long Island,70 or Older,115,F,Other Race,Spanish/Hispanic,2,Emergency,Home or Self Care,2019,INJ033,"COMPLICATION OF CARDIOVASCULAR DEVICE, IMPLANT OR GRAFT, INITIAL ENCOUNTER",CAR021,"ARTERY, VEIN, AND GREAT VESSEL PROCEDURES, NEC",182,OTHER PERIPHERAL VASCULAR PROCEDURES,05,DISEASES AND DISORDERS OF THE CIRCULATORY SYSTEM,2,Moderate,Moderate,Surgical,Medicaid,,,,,true,54246.14,8745.39
Long Island,Nassau,2908000,000511,NYU Langone Hospital-Long Island,30 to 49,115,F,Other Race,Spanish/Hispanic,1,Emergency,Home or Self Care,2019,INJ033,"COMPLICATION OF CARDIOVASCULAR DEVICE, IMPLANT OR GRAFT, INITIAL ENCOUNTER",CAR008,ANGIOPLASTY AND RELATED VESSEL PROCEDURES (ENDOVASCULAR; EXCLUDING CAROTID),182,OTHER PERIPHERAL VASCULAR PROCEDURES,05,DISEASES AND DISORDERS OF THE CIRCULATORY SYSTEM,3,Major,Major,Surgical,Medicare,Medicare,Medicaid,,,true,81402.52,12904.82
Long Island,Nassau,2908000,000511,NYU Langone Hospital-Long Island,70 or Older,110,M,White,Not Span/Hispanic,2,Urgent,Home w/ Home Health Services,2019,CIR030,AORTIC AND PERIPHERAL ARTERIAL EMBOLISM OR THROMBOSIS,CAR007,"EMBOLECTOMY, ENDARTERECTOMY, AND RELATED VESSEL PROCEDURES (NON-ENDOVASCULAR; EXCLUDING CAROTID)",182,OTHER PERIPHERAL VASCULAR PROCEDURES,05,DISEASES AND DISORDERS OF THE CIRCULATORY SYSTEM,1,Minor,Moderate,Surgical,Medicare,Medicare,Private Health Insurance,,,false,53849.73,8721.55
Long Island,Nassau,2908000,000511,NYU Langone Hospital-Long Island,50 to 69,115,F,White,Not Span/Hispanic,5,Emergency,Home or Self Care,2019,CIR029,AORTIC; PERIPHERAL; AND VISCERAL ARTERY ANEURYSMS,CAR011,ANEURYSM REPAIR PROCEDURES,182,OTHER PERIPHERAL VASCULAR PROCEDURES,05,DISEASES AND DISORDERS OF THE CIRCULATORY SYSTEM,3,Major,Moderate,Surgical,Medicare,Medicare,Private Health Insurance,,,true,537715.47,85930.43
Long Island,Nassau,2908000,000511,NYU Langone Hospital-Long Island,50 to 69,115,M,Other Race,Spanish/Hispanic,4,Emergency,Home or Self Care,2019,CIR008,HYPERTENSION WITH COMPLICATIONS AND SECONDARY HYPERTENSION,CAR010,LIGATION AND EMBOLIZATION OF VESSELS,182,OTHER PERIPHERAL VASCULAR PROCEDURES,05,DISEASES AND DISORDERS OF THE CIRCULATORY SYSTEM,2,Moderate,Minor,Surgical,Medicaid,Medicaid,,,,true,134681.92,24189.89
Long Island,Nassau,2908000,000511,NYU Langone Hospital-Long Island,30 to 49,118,M,White,Not Span/Hispanic,6,Emergency,Home or Self Care,2019,INJ033,"COMPLICATION OF CARDIOVASCULAR DEVICE, IMPLANT OR GRAFT, INITIAL ENCOUNTER",CAR007,"EMBOLECTOMY, ENDARTERECTOMY, AND RELATED VESSEL PROCEDURES (NON-ENDOVASCULAR; EXCLUDING CAROTID)",182,OTHER PERIPHERAL VASCULAR PROCEDURES,05,DISEASES AND DISORDERS OF THE CIRCULATORY SYSTEM,4,Extreme,Major,Surgical,Medicare,Medicare,Medicaid,,,true,121351.62,20432.07
Long Island,Nassau,2908000,000511,NYU Langone Hospital-Long Island,70 or Older,115,M,White,Not Span/Hispanic,5,Emergency,Expired,2019,CIR029,AORTIC; PERIPHERAL; AND VISCERAL ARTERY ANEURYSMS,CAR012,VESSEL REPAIR AND REPLACEMENT,182,OTHER PERIPHERAL VASCULAR PROCEDURES,05,DISEASES AND DISORDERS OF THE CIRCULATORY SYSTEM,4,Extreme,Extreme,Surgical,Medicare,Medicare,Private Health Insurance,,,true,468915.43,65047.63
Long Island,Nassau,2908000,000511,NYU Langone Hospital-Long Island,50 to 69,117,M,White,Not Span/Hispanic,7,Elective,Inpatient Rehabilitation Facility,2019,MAL001,CARDIAC AND CIRCULATORY CONGENITAL ANOMALIES,CAR010,LIGATION AND EMBOLIZATION OF VESSELS,182,OTHER PERIPHERAL VASCULAR PROCEDURES,05,DISEASES AND DISORDERS OF THE CIRCULATORY SYSTEM,3,Major,Moderate,Surgical,Blue Cross/Blue Shield,,,,,false,269873.95,40709.29
Long Island,Nassau,2908000,000511,NYU Langone Hospital-Long Island,70 or Older,115,F,White,Not Span/Hispanic,2,Elective,Home w/ Home Health Services,2019,CIR029,AORTIC; PERIPHERAL; AND VISCERAL ARTERY ANEURYSMS,CAR011,ANEURYSM REPAIR PROCEDURES,182,OTHER PERIPHERAL VASCULAR PROCEDURES,05,DISEASES AND DISORDERS OF THE CIRCULATORY SYSTEM,2,Moderate,Moderate,Surgical,Medicare,Medicare,,,,false,342433.43,53438.45
Long Island,Nassau,2908000,000511,NYU Langone Hospital-Long Island,50 to 69,119,F,White,Not Span/Hispanic,1,Emergency,Home or Self Care,2019,INJ033,"COMPLICATION OF CARDIOVASCULAR DEVICE, IMPLANT OR GRAFT, INITIAL ENCOUNTER",CAR007,"EMBOLECTOMY, ENDARTERECTOMY, AND RELATED VESSEL PROCEDURES (NON-ENDOVASCULAR; EXCLUDING CAROTID)",182,OTHER PERIPHERAL VASCULAR PROCEDURES,05,DISEASES AND DISORDERS OF THE CIRCULATORY SYSTEM,3,Major,Major,Surgical,Medicare,Medicare,Blue Cross/Blue Shield,,,true,74085.5,10948.97
Long Island,Nassau,2908000,000511,NYU Langone Hospital-Long Island,70 or Older,115,M,Black/African American,Not Span/Hispanic,14,Emergency,Home w/ Home Health Services,2019,CIR006,PERICARDITIS AND PERICARDIAL DISEASE,CAR010,LIGATION AND EMBOLIZATION OF VESSELS,182,OTHER PERIPHERAL VASCULAR PROCEDURES,05,DISEASES AND DISORDERS OF THE CIRCULATORY SYSTEM,3,Major,Major,Surgical,Medicare,Medicare,,,,true,208306.72,37297.15
Long Island,Nassau,2908000,000511,NYU Langone Hospital-Long Island,70 or Older,115,F,Black/African American,Not Span/Hispanic,1,Emergency,Home w/ Home Health Services,2019,INJ033,"COMPLICATION OF CARDIOVASCULAR DEVICE, IMPLANT OR GRAFT, INITIAL ENCOUNTER",CAR007,"EMBOLECTOMY, ENDARTERECTOMY, AND RELATED VESSEL PROCEDURES (NON-ENDOVASCULAR; EXCLUDING CAROTID)",182,OTHER PERIPHERAL VASCULAR PROCEDURES,05,DISEASES AND DISORDERS OF THE CIRCULATORY SYSTEM,3,Major,Moderate,Surgical,Medicare,Medicare,Blue Cross/Blue Shield,,,true,52886.72,7649.56
Long Island,Nassau,2908000,000511,NYU Langone Hospital-Long Island,70 or Older,115,M,Other Race,Not Span/Hispanic,4,Emergency,Home or Self Care,2019,INJ033,"COMPLICATION OF CARDIOVASCULAR DEVICE, IMPLANT OR GRAFT, INITIAL ENCOUNTER",CAR029,"CARDIOVASCULAR DEVICE PROCEDURES, NEC",182,OTHER PERIPHERAL VASCULAR PROCEDURES,05,DISEASES AND DISORDERS OF THE CIRCULATORY SYSTEM,2,Moderate,Major,Surgical,Medicare,Medicaid,,,,true,130809.82,20452.94
Long Island,Nassau,2908000,000511,NYU Langone Hospital-Long Island,70 or Older,115,M,White,Not Span/Hispanic,5,Emergency,Skilled Nursing Home,2019,INJ016,"INJURY TO BLOOD VESSELS, INITIAL ENCOUNTER",MST030,"MUSCULOSKELETAL PROCEDURES, NEC",182,OTHER PERIPHERAL VASCULAR PROCEDURES,05,DISEASES AND DISORDERS OF THE CIRCULATORY SYSTEM,3,Major,Major,Surgical,Medicare,Medicare,Private Health Insurance,,,true,255566.8,46058.69
Long Island,Nassau,2908000,000511,NYU Langone Hospital-Long Island,50 to 69,110,F,Other Race,Not Span/Hispanic,3,Elective,Home or Self Care,2019,CIR029,AORTIC; PERIPHERAL; AND VISCERAL ARTERY ANEURYSMS,CAR011,ANEURYSM REPAIR PROCEDURES,182,OTHER PERIPHERAL VASCULAR PROCEDURES,05,DISEASES AND DISORDERS OF THE CIRCULATORY SYSTEM,2,Moderate,Moderate,Surgical,Medicare,Medicare,,,,false,239132.25,39934.2
Long Island,Nassau,2908000,000511,NYU Langone Hospital-Long Island,70 or Older,118,M,White,Not Span/Hispanic,9,Emergency,Skilled Nursing Home,2019,INJ033,"COMPLICATION OF CARDIOVASCULAR DEVICE, IMPLANT OR GRAFT, INITIAL ENCOUNTER",CAR008,ANGIOPLASTY AND RELATED VESSEL PROCEDURES (ENDOVASCULAR; EXCLUDING CAROTID),182,OTHER PERIPHERAL VASCULAR PROCEDURES,05,DISEASES AND DISORDERS OF THE CIRCULATORY SYSTEM,3,Major,Major,Surgical,Medicare,Medicare,Blue Cross/Blue Shield,,,true,141158.65,25934.19
Long Island,Nassau,2908000,000511,NYU Langone Hospital-Long Island,70 or Older,115,F,White,Not Span/Hispanic,2,Elective,Home w/ Home Health Services,2019,CIR029,AORTIC; PERIPHERAL; AND VISCERAL ARTERY ANEURYSMS,CAR011,ANEURYSM REPAIR PROCEDURES,182,OTHER PERIPHERAL VASCULAR PROCEDURES,05,DISEASES AND DISORDERS OF THE CIRCULATORY SYSTEM,2,Moderate,Major,Surgical,Medicare,Medicare,Private Health Insurance,,,false,372261.83,60208.83
Long Island,Nassau,2908000,000511,NYU Langone Hospital-Long Island,70 or Older,117,M,White,Not Span/Hispanic,1,Elective,Home or Self Care,2019,CIR029,AORTIC; PERIPHERAL; AND VISCERAL ARTERY ANEURYSMS,CAR011,ANEURYSM REPAIR PROCEDURES,182,OTHER PERIPHERAL VASCULAR PROCEDURES,05,DISEASES AND DISORDERS OF THE CIRCULATORY SYSTEM,1,Minor,Minor,Surgical,Medicare,Medicare,Blue Cross/Blue Shield,,,false,266911.9,42945.09
Long Island,Nassau,2908000,000511,NYU Langone Hospital-Long Island,50 to 69,110,F,White,Not Span/Hispanic,2,Emergency,Home w/ Home Health Services,2019,CIR039,OTHER SPECIFIED DISEASES OF VEINS AND LYMPHATICS,CAR010,LIGATION AND EMBOLIZATION OF VESSELS,182,OTHER PERIPHERAL VASCULAR PROCEDURES,05,DISEASES AND DISORDERS OF THE CIRCULATORY SYSTEM,2,Moderate,Moderate,Surgical,Medicare,Medicare,Private Health Insurance,,,true,39031.83,6815.34
Long Island,Nassau,2908000,000511,NYU Langone Hospital-Long Island,70 or Older,115,F,White,Not Span/Hispanic,1,Elective,Home or Self Care,2019,CIR029,AORTIC; PERIPHERAL; AND VISCERAL ARTERY ANEURYSMS,CAR011,ANEURYSM REPAIR PROCEDURES,182,OTHER PERIPHERAL VASCULAR PROCEDURES,05,DISEASES AND DISORDERS OF THE CIRCULATORY SYSTEM,2,Moderate,Moderate,Surgical,Medicare,Medicare,,,,false,403543.44,65120.45
Long Island,Nassau,2908000,000511,NYU Langone Hospital-Long Island,70 or Older,115,M,White,Not Span/Hispanic,1,Elective,Home or Self Care,2019,CIR029,AORTIC; PERIPHERAL; AND VISCERAL ARTERY ANEURYSMS,CAR011,ANEURYSM REPAIR PROCEDURES,182,OTHER PERIPHERAL VASCULAR PROCEDURES,05,DISEASES AND DISORDERS OF THE CIRCULATORY SYSTEM,1,Minor,Minor,Surgical,Medicare,Medicare,Private Health Insurance,,,false,259953.42,41597.93
Long Island,Nassau,2908000,000511,NYU Langone Hospital-Long Island,30 to 49,115,F,Other Race,Spanish/Hispanic,1,Urgent,Home or Self Care,2019,INJ033,"COMPLICATION OF CARDIOVASCULAR DEVICE, IMPLANT OR GRAFT, INITIAL ENCOUNTER",CAR029,"CARDIOVASCULAR DEVICE PROCEDURES, NEC",182,OTHER PERIPHERAL VASCULAR PROCEDURES,05,DISEASES AND DISORDERS OF THE CIRCULATORY SYSTEM,3,Major,Major,Surgical,Blue Cross/Blue Shield,,,,,true,85087.72,12276.87
Long Island,Nassau,2908000,000511,NYU Langone Hospital-Long Island,70 or Older,115,M,White,Not Span/Hispanic,1,Emergency,Home w/ Home Health Services,2019,CIR029,AORTIC; PERIPHERAL; AND VISCERAL ARTERY ANEURYSMS,CAR011,ANEURYSM REPAIR PROCEDURES,182,OTHER PERIPHERAL VASCULAR PROCEDURES,05,DISEASES AND DISORDERS OF THE CIRCULATORY SYSTEM,1,Minor,Moderate,Surgical,Medicare,Medicare,Blue Cross/Blue Shield,,,true,409957.87,63747.97
Long Island,Nassau,2908000,000511,NYU Langone Hospital-Long Island,70 or Older,113,M,White,Not Span/Hispanic,4,Elective,Home or Self Care,2019,INJ033,"COMPLICATION OF CARDIOVASCULAR DEVICE, IMPLANT OR GRAFT, INITIAL ENCOUNTER",CAR011,ANEURYSM REPAIR PROCEDURES,182,OTHER PERIPHERAL VASCULAR PROCEDURES,05,DISEASES AND DISORDERS OF THE CIRCULATORY SYSTEM,2,Moderate,Minor,Surgical,Medicare,Medicare,,,,false,353261.86,56237.49
Long Island,Nassau,2908000,000511,NYU Langone Hospital-Long Island,70 or Older,115,F,White,Not Span/Hispanic,2,Emergency,Home or Self Care,2019,CIR038,POSTPROCEDURAL OR POSTOPERATIVE CIRCULATORY SYSTEM COMPLICATION,CAR008,ANGIOPLASTY AND RELATED VESSEL PROCEDURES (ENDOVASCULAR; EXCLUDING CAROTID),182,OTHER PERIPHERAL VASCULAR PROCEDURES,05,DISEASES AND DISORDERS OF THE CIRCULATORY SYSTEM,2,Moderate,Minor,Surgical,Medicare,Medicare,Private Health Insurance,,,true,188978.48,27459.12
Long Island,Nassau,2908000,000511,NYU Langone Hospital-Long Island,18 to 29,115,F,Other Race,Spanish/Hispanic,4,Emergency,Home or Self Care,2019,CIR030,AORTIC AND PERIPHERAL ARTERIAL EMBOLISM OR THROMBOSIS,CAR007,"EMBOLECTOMY, ENDARTERECTOMY, AND RELATED VESSEL PROCEDURES (NON-ENDOVASCULAR; EXCLUDING CAROTID)",182,OTHER PERIPHERAL VASCULAR PROCEDURES,05,DISEASES AND DISORDERS OF THE CIRCULATORY SYSTEM,2,Moderate,Minor,Surgical,Medicaid,,,,,true,108208.58,17120.14
Long Island,Nassau,2908000,000511,NYU Langone Hospital-Long Island,30 to 49,110,M,White,Spanish/Hispanic,10,Emergency,Home or Self Care,2019,INJ016,"INJURY TO BLOOD VESSELS, INITIAL ENCOUNTER",CAR014,PERIPHERAL ARTERIAL BYPASS PROCEDURES,182,OTHER PERIPHERAL VASCULAR PROCEDURES,05,DISEASES AND DISORDERS OF THE CIRCULATORY SYSTEM,4,Extreme,Extreme,Surgical,Medicaid,,,,,true,324000.54,45537.28
Long Island,Nassau,2908000,000511,NYU Langone Hospital-Long Island,70 or Older,110,M,White,Not Span/Hispanic,1,Elective,Skilled Nursing Home,2019,CIR029,AORTIC; PERIPHERAL; AND VISCERAL ARTERY ANEURYSMS,CAR011,ANEURYSM REPAIR PROCEDURES,182,OTHER PERIPHERAL VASCULAR PROCEDURES,05,DISEASES AND DISORDERS OF THE CIRCULATORY SYSTEM,2,Moderate,Minor,Surgical,Medicare,Medicare,Medicaid,,,false,416000.24,66940.47
Long Island,Nassau,2908000,000511,NYU Langone Hospital-Long Island,30 to 49,110,M,White,Not Span/Hispanic,3,Emergency,Home or Self Care,2019,CIR033,ACUTE PHLEBITIS; THROMBOPHLEBITIS AND THROMBOEMBOLISM,CAR008,ANGIOPLASTY AND RELATED VESSEL PROCEDURES (ENDOVASCULAR; EXCLUDING CAROTID),182,OTHER PERIPHERAL VASCULAR PROCEDURES,05,DISEASES AND DISORDERS OF THE CIRCULATORY SYSTEM,2,Moderate,Minor,Surgical,Blue Cross/Blue Shield,,,,,true,158692.69,22711.09
Long Island,Nassau,2908000,000511,NYU Langone Hospital-Long Island,50 to 69,116,M,White,Not Span/Hispanic,2,Elective,Home w/ Home Health Services,2019,CIR032,OTHER SPECIFIED AND UNSPECIFIED CIRCULATORY DISEASE,CAR010,LIGATION AND EMBOLIZATION OF VESSELS,182,OTHER PERIPHERAL VASCULAR PROCEDURES,05,DISEASES AND DISORDERS OF THE CIRCULATORY SYSTEM,2,Moderate,Minor,Surgical,Medicare,Medicare,,,,false,154981.16,26474.41
Long Island,Nassau,2908000,000511,NYU Langone Hospital-Long Island,70 or Older,117,M,Other Race,Spanish/Hispanic,7,Emergency,Home w/ Home Health Services,2019,CIR039,OTHER SPECIFIED DISEASES OF VEINS AND LYMPHATICS,CAR010,LIGATION AND EMBOLIZATION OF VESSELS,182,OTHER PERIPHERAL VASCULAR PROCEDURES,05,DISEASES AND DISORDERS OF THE CIRCULATORY SYSTEM,3,Major,Moderate,Surgical,Medicare,Medicare,Private Health Insurance,,,true,121412.78,19568.81
Long Island,Nassau,2908000,000511,NYU Langone Hospital-Long Island,50 to 69,117,F,White,Not Span/Hispanic,2,Elective,Home or Self Care,2019,CIR029,AORTIC; PERIPHERAL; AND VISCERAL ARTERY ANEURYSMS,CAR010,LIGATION AND EMBOLIZATION OF VESSELS,182,OTHER PERIPHERAL VASCULAR PROCEDURES,05,DISEASES AND DISORDERS OF THE CIRCULATORY SYSTEM,1,Minor,Minor,Surgical,Blue Cross/Blue Shield,,,,,false,292810.63,48445.61
Long Island,Nassau,2908000,000511,NYU Langone Hospital-Long Island,30 to 49,118,F,Other Race,Spanish/Hispanic,6,Emergency,Home or Self Care,2019,INJ033,"COMPLICATION OF CARDIOVASCULAR DEVICE, IMPLANT OR GRAFT, INITIAL ENCOUNTER",CAR008,ANGIOPLASTY AND RELATED VESSEL PROCEDURES (ENDOVASCULAR; EXCLUDING CAROTID),182,OTHER PERIPHERAL VASCULAR PROCEDURES,05,DISEASES AND DISORDERS OF THE CIRCULATORY SYSTEM,3,Major,Moderate,Surgical,Miscellaneous/Other,Medicare,Medicare,,,true,173488.23,29406.32
Long Island,Nassau,2908000,000511,NYU Langone Hospital-Long Island,70 or Older,117,F,Black/African American,Not Span/Hispanic,12,Emergency,Home w/ Home Health Services,2019,CIR019,HEART FAILURE,CAR011,ANEURYSM REPAIR PROCEDURES,182,OTHER PERIPHERAL VASCULAR PROCEDURES,05,DISEASES AND DISORDERS OF THE CIRCULATORY SYSTEM,3,Major,Major,Surgical,Medicare,Medicare,Blue Cross/Blue Shield,,,true,268091.86,49833.37
Long Island,Nassau,2908000,000511,NYU Langone Hospital-Long Island,50 to 69,115,M,Black/African American,Not Span/Hispanic,5,Urgent,Home or Self Care,2019,INJ033,"COMPLICATION OF CARDIOVASCULAR DEVICE, IMPLANT OR GRAFT, INITIAL ENCOUNTER",CAR008,ANGIOPLASTY AND RELATED VESSEL PROCEDURES (ENDOVASCULAR; EXCLUDING CAROTID),182,OTHER PERIPHERAL VASCULAR PROCEDURES,05,DISEASES AND DISORDERS OF THE CIRCULATORY SYSTEM,3,Major,Major,Surgical,Medicare,Medicare,Blue Cross/Blue Shield,,,false,98471.47,17132.07